maven-notifications mailing list archives

Site index · List index
Message view « Date » · « Thread »
Top « Date » · « Thread »
From Apache Jenkins Server <jenk...@builds.apache.org>
Subject Build failed in Jenkins: maven-plugin-tools-jdk-1.7 #32
Date Sat, 03 Nov 2012 20:16:51 GMT
See <https://builds.apache.org/job/maven-plugin-tools-jdk-1.7/32/changes>

Changes:

[Robert Scholte] [MPLUGIN-232] java-basic-annotations IT for maven-plugin-plugin fails with
M2.2.1 due to a missing description-tag in the plugin-help.xml

------------------------------------------
[...truncated 1134 lines...]
[INFO] No sources to compile
mojoStarted org.apache.maven.plugins:maven-compiler-plugin:2.5(default-testCompile)
[INFO] 
[INFO] --- maven-compiler-plugin:2.5:testCompile (default-testCompile) @ maven-plugin-plugin
---
mojoSucceeded org.apache.maven.plugins:maven-compiler-plugin:2.5(default-testCompile)
mojoStarted org.apache.maven.plugins:maven-surefire-plugin:2.12(default-test)[INFO] Surefire
report directory: <https://builds.apache.org/job/maven-plugin-tools-jdk-1.7/ws/maven-plugin-plugin/target/surefire-reports>

-------------------------------------------------------
 T E S T S
-------------------------------------------------------

[INFO] 
[INFO] --- maven-surefire-plugin:2.12:test (default-test) @ maven-plugin-plugin ---

Results :

Tests run: 0, Failures: 0, Errors: 0, Skipped: 0

mojoSucceeded org.apache.maven.plugins:maven-surefire-plugin:2.12(default-test)
[JENKINS] Recording test results
mojoStarted org.apache.maven.plugins:maven-jar-plugin:2.4(default-jar)
[INFO] Building jar: <https://builds.apache.org/job/maven-plugin-tools-jdk-1.7/ws/maven-plugin-plugin/target/maven-plugin-plugin-3.2-SNAPSHOT.jar>
[INFO] 
[INFO] --- maven-jar-plugin:2.4:jar (default-jar) @ maven-plugin-plugin ---
mojoSucceeded org.apache.maven.plugins:maven-jar-plugin:2.4(default-jar)
mojoStarted org.apache.maven.plugins:maven-plugin-plugin:3.1(default-addPluginArtifactMetadata)
[INFO] 
[INFO] --- maven-plugin-plugin:3.1:addPluginArtifactMetadata (default-addPluginArtifactMetadata)
@ maven-plugin-plugin ---
mojoSucceeded org.apache.maven.plugins:maven-plugin-plugin:3.1(default-addPluginArtifactMetadata)
mojoStarted org.apache.maven.plugins:maven-site-plugin:3.1(attach-descriptor)
[INFO] 
[INFO] --- maven-site-plugin:3.1:attach-descriptor (attach-descriptor) @ maven-plugin-plugin
---
mojoSucceeded org.apache.maven.plugins:maven-site-plugin:3.1(attach-descriptor)
mojoStarted org.apache.maven.plugins:maven-invoker-plugin:1.6(integration-test)
[INFO] 
[INFO] --- maven-invoker-plugin:1.6:install (integration-test) @ maven-plugin-plugin ---
[INFO] Installing <https://builds.apache.org/job/maven-plugin-tools-jdk-1.7/ws/maven-plugin-tools-annotations/pom.xml>
to <https://builds.apache.org/job/maven-plugin-tools-jdk-1.7/ws/maven-plugin-plugin/target/local-repo/org/apache/maven/plugin-tools/maven-plugin-tools-annotations/3.2-SNAPSHOT/maven-plugin-tools-annotations-3.2-SNAPSHOT.pom>
[INFO] Installing <https://builds.apache.org/job/maven-plugin-tools-jdk-1.7/ws/maven-plugin-tools-annotations/target/maven-plugin-tools-annotations-3.2-SNAPSHOT.jar>
to <https://builds.apache.org/job/maven-plugin-tools-jdk-1.7/ws/maven-plugin-plugin/target/local-repo/org/apache/maven/plugin-tools/maven-plugin-tools-annotations/3.2-SNAPSHOT/maven-plugin-tools-annotations-3.2-SNAPSHOT.jar>
[INFO] Installing <https://builds.apache.org/job/maven-plugin-tools-jdk-1.7/ws/maven-plugin-tools-annotations/pom.xml>
to <https://builds.apache.org/job/maven-plugin-tools-jdk-1.7/ws/maven-plugin-plugin/target/local-repo/org/apache/maven/plugin-tools/maven-plugin-tools-annotations/3.2-SNAPSHOT/maven-plugin-tools-annotations-3.2-SNAPSHOT.pom>
[INFO] Installing <https://builds.apache.org/job/maven-plugin-tools-jdk-1.7/ws/maven-plugin-tools-annotations/target/maven-plugin-tools-annotations-3.2-SNAPSHOT-tests.jar>
to <https://builds.apache.org/job/maven-plugin-tools-jdk-1.7/ws/maven-plugin-plugin/target/local-repo/org/apache/maven/plugin-tools/maven-plugin-tools-annotations/3.2-SNAPSHOT/maven-plugin-tools-annotations-3.2-SNAPSHOT-tests.jar>
[INFO] Installing <https://builds.apache.org/job/maven-plugin-tools-jdk-1.7/ws/maven-plugin-tools-annotations/target/maven-plugin-tools-annotations-3.2-SNAPSHOT-test-sources.jar>
to <https://builds.apache.org/job/maven-plugin-tools-jdk-1.7/ws/maven-plugin-plugin/target/local-repo/org/apache/maven/plugin-tools/maven-plugin-tools-annotations/3.2-SNAPSHOT/maven-plugin-tools-annotations-3.2-SNAPSHOT-test-sources.jar>
[INFO] Installing <https://builds.apache.org/job/maven-plugin-tools-jdk-1.7/ws/pom.xml>
to <https://builds.apache.org/job/maven-plugin-tools-jdk-1.7/ws/maven-plugin-plugin/target/local-repo/org/apache/maven/plugin-tools/maven-plugin-tools/3.2-SNAPSHOT/maven-plugin-tools-3.2-SNAPSHOT.pom>
[INFO] Installing <https://builds.apache.org/job/maven-plugin-tools-jdk-1.7/ws/maven-plugin-annotations/pom.xml>
to <https://builds.apache.org/job/maven-plugin-tools-jdk-1.7/ws/maven-plugin-plugin/target/local-repo/org/apache/maven/plugin-tools/maven-plugin-annotations/3.2-SNAPSHOT/maven-plugin-annotations-3.2-SNAPSHOT.pom>
[INFO] Installing <https://builds.apache.org/job/maven-plugin-tools-jdk-1.7/ws/maven-plugin-annotations/target/maven-plugin-annotations-3.2-SNAPSHOT.jar>
to <https://builds.apache.org/job/maven-plugin-tools-jdk-1.7/ws/maven-plugin-plugin/target/local-repo/org/apache/maven/plugin-tools/maven-plugin-annotations/3.2-SNAPSHOT/maven-plugin-annotations-3.2-SNAPSHOT.jar>
[INFO] Installing <https://builds.apache.org/job/maven-plugin-tools-jdk-1.7/ws/maven-plugin-annotations/pom.xml>
to <https://builds.apache.org/job/maven-plugin-tools-jdk-1.7/ws/maven-plugin-plugin/target/local-repo/org/apache/maven/plugin-tools/maven-plugin-annotations/3.2-SNAPSHOT/maven-plugin-annotations-3.2-SNAPSHOT.pom>
[INFO] Installing <https://builds.apache.org/job/maven-plugin-tools-jdk-1.7/ws/maven-plugin-tools-api/pom.xml>
to <https://builds.apache.org/job/maven-plugin-tools-jdk-1.7/ws/maven-plugin-plugin/target/local-repo/org/apache/maven/plugin-tools/maven-plugin-tools-api/3.2-SNAPSHOT/maven-plugin-tools-api-3.2-SNAPSHOT.pom>
[INFO] Installing <https://builds.apache.org/job/maven-plugin-tools-jdk-1.7/ws/maven-plugin-tools-api/target/maven-plugin-tools-api-3.2-SNAPSHOT.jar>
to <https://builds.apache.org/job/maven-plugin-tools-jdk-1.7/ws/maven-plugin-plugin/target/local-repo/org/apache/maven/plugin-tools/maven-plugin-tools-api/3.2-SNAPSHOT/maven-plugin-tools-api-3.2-SNAPSHOT.jar>
[INFO] Installing <https://builds.apache.org/job/maven-plugin-tools-jdk-1.7/ws/maven-plugin-tools-api/pom.xml>
to <https://builds.apache.org/job/maven-plugin-tools-jdk-1.7/ws/maven-plugin-plugin/target/local-repo/org/apache/maven/plugin-tools/maven-plugin-tools-api/3.2-SNAPSHOT/maven-plugin-tools-api-3.2-SNAPSHOT.pom>
[INFO] Installing <https://builds.apache.org/job/maven-plugin-tools-jdk-1.7/ws/maven-plugin-tools-generators/pom.xml>
to <https://builds.apache.org/job/maven-plugin-tools-jdk-1.7/ws/maven-plugin-plugin/target/local-repo/org/apache/maven/plugin-tools/maven-plugin-tools-generators/3.2-SNAPSHOT/maven-plugin-tools-generators-3.2-SNAPSHOT.pom>
[INFO] Installing <https://builds.apache.org/job/maven-plugin-tools-jdk-1.7/ws/maven-plugin-tools-generators/target/maven-plugin-tools-generators-3.2-SNAPSHOT.jar>
to <https://builds.apache.org/job/maven-plugin-tools-jdk-1.7/ws/maven-plugin-plugin/target/local-repo/org/apache/maven/plugin-tools/maven-plugin-tools-generators/3.2-SNAPSHOT/maven-plugin-tools-generators-3.2-SNAPSHOT.jar>
[INFO] Installing <https://builds.apache.org/job/maven-plugin-tools-jdk-1.7/ws/maven-plugin-tools-generators/pom.xml>
to <https://builds.apache.org/job/maven-plugin-tools-jdk-1.7/ws/maven-plugin-plugin/target/local-repo/org/apache/maven/plugin-tools/maven-plugin-tools-generators/3.2-SNAPSHOT/maven-plugin-tools-generators-3.2-SNAPSHOT.pom>
[INFO] Installing <https://builds.apache.org/job/maven-plugin-tools-jdk-1.7/ws/maven-plugin-tools-java/pom.xml>
to <https://builds.apache.org/job/maven-plugin-tools-jdk-1.7/ws/maven-plugin-plugin/target/local-repo/org/apache/maven/plugin-tools/maven-plugin-tools-java/3.2-SNAPSHOT/maven-plugin-tools-java-3.2-SNAPSHOT.pom>
[INFO] Installing <https://builds.apache.org/job/maven-plugin-tools-jdk-1.7/ws/maven-plugin-tools-java/target/maven-plugin-tools-java-3.2-SNAPSHOT.jar>
to <https://builds.apache.org/job/maven-plugin-tools-jdk-1.7/ws/maven-plugin-plugin/target/local-repo/org/apache/maven/plugin-tools/maven-plugin-tools-java/3.2-SNAPSHOT/maven-plugin-tools-java-3.2-SNAPSHOT.jar>
[INFO] Installing <https://builds.apache.org/job/maven-plugin-tools-jdk-1.7/ws/maven-plugin-tools-java/pom.xml>
to <https://builds.apache.org/job/maven-plugin-tools-jdk-1.7/ws/maven-plugin-plugin/target/local-repo/org/apache/maven/plugin-tools/maven-plugin-tools-java/3.2-SNAPSHOT/maven-plugin-tools-java-3.2-SNAPSHOT.pom>
[INFO] Installing <https://builds.apache.org/job/maven-plugin-tools-jdk-1.7/ws/maven-plugin-tools-beanshell/pom.xml>
to <https://builds.apache.org/job/maven-plugin-tools-jdk-1.7/ws/maven-plugin-plugin/target/local-repo/org/apache/maven/plugin-tools/maven-plugin-tools-beanshell/3.2-SNAPSHOT/maven-plugin-tools-beanshell-3.2-SNAPSHOT.pom>
[INFO] Installing <https://builds.apache.org/job/maven-plugin-tools-jdk-1.7/ws/maven-plugin-tools-beanshell/target/maven-plugin-tools-beanshell-3.2-SNAPSHOT.jar>
to <https://builds.apache.org/job/maven-plugin-tools-jdk-1.7/ws/maven-plugin-plugin/target/local-repo/org/apache/maven/plugin-tools/maven-plugin-tools-beanshell/3.2-SNAPSHOT/maven-plugin-tools-beanshell-3.2-SNAPSHOT.jar>
[INFO] Installing <https://builds.apache.org/job/maven-plugin-tools-jdk-1.7/ws/maven-plugin-tools-beanshell/pom.xml>
to <https://builds.apache.org/job/maven-plugin-tools-jdk-1.7/ws/maven-plugin-plugin/target/local-repo/org/apache/maven/plugin-tools/maven-plugin-tools-beanshell/3.2-SNAPSHOT/maven-plugin-tools-beanshell-3.2-SNAPSHOT.pom>
[INFO] Installing <https://builds.apache.org/job/maven-plugin-tools-jdk-1.7/ws/maven-plugin-tools-model/pom.xml>
to <https://builds.apache.org/job/maven-plugin-tools-jdk-1.7/ws/maven-plugin-plugin/target/local-repo/org/apache/maven/plugin-tools/maven-plugin-tools-model/3.2-SNAPSHOT/maven-plugin-tools-model-3.2-SNAPSHOT.pom>
[INFO] Installing <https://builds.apache.org/job/maven-plugin-tools-jdk-1.7/ws/maven-plugin-tools-model/target/maven-plugin-tools-model-3.2-SNAPSHOT.jar>
to <https://builds.apache.org/job/maven-plugin-tools-jdk-1.7/ws/maven-plugin-plugin/target/local-repo/org/apache/maven/plugin-tools/maven-plugin-tools-model/3.2-SNAPSHOT/maven-plugin-tools-model-3.2-SNAPSHOT.jar>
[INFO] Installing <https://builds.apache.org/job/maven-plugin-tools-jdk-1.7/ws/maven-plugin-tools-model/pom.xml>
to <https://builds.apache.org/job/maven-plugin-tools-jdk-1.7/ws/maven-plugin-plugin/target/local-repo/org/apache/maven/plugin-tools/maven-plugin-tools-model/3.2-SNAPSHOT/maven-plugin-tools-model-3.2-SNAPSHOT.pom>
[INFO] Installing <https://builds.apache.org/job/maven-plugin-tools-jdk-1.7/ws/maven-plugin-plugin/pom.xml>
to <https://builds.apache.org/job/maven-plugin-tools-jdk-1.7/ws/maven-plugin-plugin/target/local-repo/org/apache/maven/plugins/maven-plugin-plugin/3.2-SNAPSHOT/maven-plugin-plugin-3.2-SNAPSHOT.pom>
[INFO] Installing <https://builds.apache.org/job/maven-plugin-tools-jdk-1.7/ws/maven-plugin-plugin/target/maven-plugin-plugin-3.2-SNAPSHOT.jar>
to <https://builds.apache.org/job/maven-plugin-tools-jdk-1.7/ws/maven-plugin-plugin/target/local-repo/org/apache/maven/plugins/maven-plugin-plugin/3.2-SNAPSHOT/maven-plugin-plugin-3.2-SNAPSHOT.jar>
mojoSucceeded org.apache.maven.plugins:maven-invoker-plugin:1.6(integration-test)
mojoStarted org.apache.maven.plugins:maven-invoker-plugin:1.6(integration-test)
[INFO] 
[INFO] --- maven-invoker-plugin:1.6:run (integration-test) @ maven-plugin-plugin ---
[INFO] Building: help-basic/pom.xml
[INFO] ..SUCCESS (25.0 s)
[INFO] Building: annotation-with-inheritance-from-deps/pom.xml
[INFO] run script <https://builds.apache.org/job/maven-plugin-tools-jdk-1.7/ws/maven-plugin-plugin/target/it/annotation-with-inheritance-from-deps/verify.groovy>
[INFO] ..SUCCESS (47.2 s)
[INFO] Building: ignore-plugin-class-realm/pom.xml
[INFO] ..SUCCESS (23.9 s)
[INFO] Building: skip/pom.xml
[INFO] run script <https://builds.apache.org/job/maven-plugin-tools-jdk-1.7/ws/maven-plugin-plugin/target/it/skip/verify.groovy>
[INFO] ..SUCCESS (11.1 s)
[INFO] Building: ant-basic/pom.xml
[INFO] run script <https://builds.apache.org/job/maven-plugin-tools-jdk-1.7/ws/maven-plugin-plugin/target/it/ant-basic/verify.groovy>
[INFO] ..SUCCESS (22.6 s)
[INFO] Building: annotation-with-inheritance/pom.xml
[INFO] run script <https://builds.apache.org/job/maven-plugin-tools-jdk-1.7/ws/maven-plugin-plugin/target/it/annotation-with-inheritance/verify.groovy>
[INFO] ..SUCCESS (49.3 s)
[INFO] Building: plugin-report-annotations/pom.xml
[INFO] run script <https://builds.apache.org/job/maven-plugin-tools-jdk-1.7/ws/maven-plugin-plugin/target/it/plugin-report-annotations/verify.bsh>
[INFO] ..SUCCESS (34.0 s)
[INFO] Building: plugin-info-jdk-default-version/pom.xml
[INFO] run script <https://builds.apache.org/job/maven-plugin-tools-jdk-1.7/ws/maven-plugin-plugin/target/it/plugin-info-jdk-default-version/verify.groovy>
[INFO] ..SUCCESS (24.6 s)
[INFO] Building: source-encoding/pom.xml
[INFO] run script <https://builds.apache.org/job/maven-plugin-tools-jdk-1.7/ws/maven-plugin-plugin/target/it/source-encoding/verify.groovy>
[INFO] ..SUCCESS (15.0 s)
[INFO] Building: java-basic/pom.xml
[INFO] run script <https://builds.apache.org/job/maven-plugin-tools-jdk-1.7/ws/maven-plugin-plugin/target/it/java-basic/verify.groovy>
[INFO] ..SUCCESS (20.7 s)
[INFO] Building: ant-simple-usage/pom.xml
[INFO] ..SUCCESS (13.8 s)
[INFO] Building: java-basic-annotations/pom.xml
[INFO] ..FAILED (32.1 s)
[INFO]   The build exited with code 1. See <https://builds.apache.org/job/maven-plugin-tools-jdk-1.7/ws/maven-plugin-plugin/target/it/java-basic-annotations/build.log>
for details.
[INFO] Building: mplugin-187/pom.xml
[INFO] ..SUCCESS (8.2 s)
[INFO] Building: beanshell-simple/pom.xml
[INFO] run script <https://builds.apache.org/job/maven-plugin-tools-jdk-1.7/ws/maven-plugin-plugin/target/it/beanshell-simple/verify.groovy>
[INFO] ..SUCCESS (17.6 s)
[INFO] Building: annotation-with-inheritance-reactor/pom.xml
[INFO] run script <https://builds.apache.org/job/maven-plugin-tools-jdk-1.7/ws/maven-plugin-plugin/target/it/annotation-with-inheritance-reactor/verify.groovy>
[INFO] ..SUCCESS (28.1 s)
[INFO] Building: plugin-report/pom.xml
[INFO] run script <https://builds.apache.org/job/maven-plugin-tools-jdk-1.7/ws/maven-plugin-plugin/target/it/plugin-report/verify.bsh>
[INFO] ..SUCCESS (46.9 s)
[INFO] Building: fix-maven-since-3.x/pom.xml
[INFO] run script <https://builds.apache.org/job/maven-plugin-tools-jdk-1.7/ws/maven-plugin-plugin/target/it/fix-maven-since-3.x/verify.groovy>
[INFO] ..SUCCESS (31.6 s)
[INFO] Building: ant-since-maven-plugin/pom.xml
[INFO] ..SUCCESS (10.8 s)
[INFO] Building: help-package/pom.xml
[INFO] run script <https://builds.apache.org/job/maven-plugin-tools-jdk-1.7/ws/maven-plugin-plugin/target/it/help-package/verify.bsh>
[INFO] ..SUCCESS (12.3 s)
[INFO] Building: ant-reference-parameter/pom.xml
[INFO] ..SUCCESS (21.4 s)
[INFO] -------------------------------------------------
[INFO] Build Summary:
[INFO]   Passed: 19, Failed: 1, Errors: 0, Skipped: 0
[INFO] -------------------------------------------------
mojoFailed org.apache.maven.plugins:maven-invoker-plugin:1.6(integration-test)[ERROR] The
following builds failed:
[ERROR] *  java-basic-annotations/pom.xml
[INFO] -------------------------------------------------

MavenInvokerArchiver
found reports:[<https://builds.apache.org/job/maven-plugin-tools-jdk-1.7/ws/maven-plugin-plugin/target/invoker-reports/BUILD-beanshell-simple.xml,>
<https://builds.apache.org/job/maven-plugin-tools-jdk-1.7/ws/maven-plugin-plugin/target/invoker-reports/BUILD-source-encoding.xml,>
<https://builds.apache.org/job/maven-plugin-tools-jdk-1.7/ws/maven-plugin-plugin/target/invoker-reports/BUILD-plugin-report-annotations.xml,>
<https://builds.apache.org/job/maven-plugin-tools-jdk-1.7/ws/maven-plugin-plugin/target/invoker-reports/BUILD-annotation-with-inheritance-from-deps.xml,>
<https://builds.apache.org/job/maven-plugin-tools-jdk-1.7/ws/maven-plugin-plugin/target/invoker-reports/BUILD-ant-since-maven-plugin.xml,>
<https://builds.apache.org/job/maven-plugin-tools-jdk-1.7/ws/maven-plugin-plugin/target/invoker-reports/BUILD-fix-maven-since-3.x.xml,>
<https://builds.apache.org/job/maven-plugin-tools-jdk-1.7/ws/maven-plugin-plugin/target/invoker-reports/BUILD-plugin-report.xml,>
<https://builds.apache.org/job/maven-plugin-tools-jdk-1.7/ws/maven-plugin-plugin/target/invoker-reports/BUILD-java-basic.xml,>
<https://builds.apache.org/job/maven-plugin-tools-jdk-1.7/ws/maven-plugin-plugin/target/invoker-reports/BUILD-ignore-plugin-class-realm.xml,>
<https://builds.apache.org/job/maven-plugin-tools-jdk-1.7/ws/maven-plugin-plugin/target/invoker-reports/BUILD-java-basic-annotations.xml,>
<https://builds.apache.org/job/maven-plugin-tools-jdk-1.7/ws/maven-plugin-plugin/target/invoker-reports/BUILD-skip.xml,>
<https://builds.apache.org/job/maven-plugin-tools-jdk-1.7/ws/maven-plugin-plugin/target/invoker-reports/BUILD-ant-reference-parameter.xml,>
<https://builds.apache.org/job/maven-plugin-tools-jdk-1.7/ws/maven-plugin-plugin/target/invoker-reports/BUILD-annotation-with-inheritance-reactor.xml,>
<https://builds.apache.org/job/maven-plugin-tools-jdk-1.7/ws/maven-plugin-plugin/target/invoker-reports/BUILD-ant-simple-usage.xml,>
<https://builds.apache.org/job/maven-plugin-tools-jdk-1.7/ws/maven-plugin-plugin/target/invoker-reports/BUILD-help-package.xml,>
<https://builds.apache.org/job/maven-plugin-tools-jdk-1.7/ws/maven-plugin-plugin/target/invoker-reports/BUILD-plugin-info-jdk-default-version.xml,>
<https://builds.apache.org/job/maven-plugin-tools-jdk-1.7/ws/maven-plugin-plugin/target/invoker-reports/BUILD-mplugin-187.xml,>
<https://builds.apache.org/job/maven-plugin-tools-jdk-1.7/ws/maven-plugin-plugin/target/invoker-reports/BUILD-ant-basic.xml,>
<https://builds.apache.org/job/maven-plugin-tools-jdk-1.7/ws/maven-plugin-plugin/target/invoker-reports/BUILD-annotation-with-inheritance.xml,>
<https://builds.apache.org/job/maven-plugin-tools-jdk-1.7/ws/maven-plugin-plugin/target/invoker-reports/BUILD-help-basic.xml]>
mavenInvokerResult:MavenInvokerResult{project='beanshell-simple/pom.xml', name='', description='',
result='success', failureMessage='null', time=17.635, type='null', buildLog='null'}
mavenInvokerResult:MavenInvokerResult{project='source-encoding/pom.xml', name='', description='',
result='success', failureMessage='null', time=14.979, type='null', buildLog='null'}
mavenInvokerResult:MavenInvokerResult{project='plugin-report-annotations/pom.xml', name='',
description='', result='success', failureMessage='null', time=33.994, type='null', buildLog='null'}
mavenInvokerResult:MavenInvokerResult{project='annotation-with-inheritance-from-deps/pom.xml',
name='', description='', result='success', failureMessage='null', time=47.157, type='null',
buildLog='null'}
mavenInvokerResult:MavenInvokerResult{project='ant-since-maven-plugin/pom.xml', name='', description='',
result='success', failureMessage='null', time=10.766, type='null', buildLog='null'}
mavenInvokerResult:MavenInvokerResult{project='fix-maven-since-3.x/pom.xml', name='', description='',
result='success', failureMessage='null', time=31.587, type='null', buildLog='null'}
mavenInvokerResult:MavenInvokerResult{project='plugin-report/pom.xml', name='', description='',
result='success', failureMessage='null', time=46.878, type='null', buildLog='null'}
mavenInvokerResult:MavenInvokerResult{project='java-basic/pom.xml', name='', description='',
result='success', failureMessage='null', time=20.718, type='null', buildLog='null'}
mavenInvokerResult:MavenInvokerResult{project='ignore-plugin-class-realm/pom.xml', name='',
description='', result='success', failureMessage='null', time=23.919, type='null', buildLog='null'}
mavenInvokerResult:MavenInvokerResult{project='java-basic-annotations/pom.xml', name='', description='',
result='failure-build', failureMessage='The build exited with code 1. See <https://builds.apache.org/job/maven-plugin-tools-jdk-1.7/ws/maven-plugin-plugin/target/it/java-basic-annotations/build.log>
for details.', time=32.058, type='null', buildLog='null'}
mavenInvokerResult:MavenInvokerResult{project='skip/pom.xml', name='', description='', result='success',
failureMessage='null', time=11.142, type='null', buildLog='null'}
mavenInvokerResult:MavenInvokerResult{project='ant-reference-parameter/pom.xml', name='',
description='', result='success', failureMessage='null', time=21.433, type='null', buildLog='null'}
mavenInvokerResult:MavenInvokerResult{project='annotation-with-inheritance-reactor/pom.xml',
name='', description='', result='success', failureMessage='null', time=28.125, type='null',
buildLog='null'}
mavenInvokerResult:MavenInvokerResult{project='ant-simple-usage/pom.xml', name='', description='',
result='success', failureMessage='null', time=13.751, type='null', buildLog='null'}
mavenInvokerResult:MavenInvokerResult{project='help-package/pom.xml', name='', description='',
result='success', failureMessage='null', time=12.345, type='null', buildLog='null'}
mavenInvokerResult:MavenInvokerResult{project='plugin-info-jdk-default-version/pom.xml', name='',
description='', result='success', failureMessage='null', time=24.575, type='null', buildLog='null'}
mavenInvokerResult:MavenInvokerResult{project='mplugin-187/pom.xml', name='', description='',
result='success', failureMessage='null', time=8.241, type='null', buildLog='null'}
mavenInvokerResult:MavenInvokerResult{project='ant-basic/pom.xml', name='', description='',
result='success', failureMessage='null', time=22.599, type='null', buildLog='null'}
mavenInvokerResult:MavenInvokerResult{project='annotation-with-inheritance/pom.xml', name='',
description='', result='success', failureMessage='null', time=49.296, type='null', buildLog='null'}
mavenInvokerResult:MavenInvokerResult{project='help-basic/pom.xml', name='', description='',
result='success', failureMessage='null', time=25.015, type='null', buildLog='null'}
projectFailed org.apache.maven.plugins:maven-plugin-plugin:3.2-SNAPSHOT
sessionEnded
[INFO] ------------------------------------------------------------------------
[INFO] Reactor Summary:
[INFO] 
[INFO] Maven Plugin Tools ................................ SUCCESS [44.700s]
[INFO] Maven Script Mojo Support ......................... SUCCESS [1.895s]
[INFO] Maven Ant Mojo Support ............................ SUCCESS [45.589s]
[INFO] Maven Beanshell Mojo Support ...................... SUCCESS [4.315s]
[INFO] Maven Plugin Tools APIs ........................... SUCCESS [10.182s]
[INFO] Maven Plugin Tools Generators ..................... SUCCESS [12.941s]
[INFO] Maven Plugin Tool for Java with Javadoc Tags ...... SUCCESS [15.200s]
[INFO] Maven Plugin Tools Javadoc ........................ SUCCESS [31.158s]
[INFO] Maven Plugin Java 5 Annotations ................... SUCCESS [6.045s]
[INFO] Maven Plugin Tool for Annotations ................. SUCCESS [11.515s]
[INFO] Maven Plugin Metadata Model ....................... SUCCESS [9.739s]
[INFO] Maven Plugin Tool for Ant ......................... SUCCESS [7.408s]
[INFO] Maven Plugin Tool for Beanshell ................... SUCCESS [4.801s]
[INFO] Maven Plugin Plugin ............................... FAILURE [9:23.820s]
[INFO] ------------------------------------------------------------------------
[INFO] BUILD FAILURE
[INFO] ------------------------------------------------------------------------
[INFO] Total time: 13:01.662s
[INFO] Finished at: Sat Nov 03 15:00:57 CDT 2012
[INFO] Final Memory: 33M/84M
[INFO] ------------------------------------------------------------------------
Projects to build: [MavenProject: org.apache.maven.plugin-tools:maven-plugin-tools:3.2-SNAPSHOT
@ <https://builds.apache.org/job/maven-plugin-tools-jdk-1.7/ws/pom.xml,> MavenProject:
org.apache.maven.plugin-tools:maven-script:3.2-SNAPSHOT @ <https://builds.apache.org/job/maven-plugin-tools-jdk-1.7/ws/maven-script/pom.xml,>
MavenProject: org.apache.maven.plugin-tools:maven-script-ant:3.2-SNAPSHOT @ <https://builds.apache.org/job/maven-plugin-tools-jdk-1.7/ws/maven-script/maven-script-ant/pom.xml,>
MavenProject: org.apache.maven.plugin-tools:maven-script-beanshell:3.2-SNAPSHOT @ <https://builds.apache.org/job/maven-plugin-tools-jdk-1.7/ws/maven-script/maven-script-beanshell/pom.xml,>
MavenProject: org.apache.maven.plugin-tools:maven-plugin-tools-api:3.2-SNAPSHOT @ <https://builds.apache.org/job/maven-plugin-tools-jdk-1.7/ws/maven-plugin-tools-api/pom.xml,>
MavenProject: org.apache.maven.plugin-tools:maven-plugin-tools-generators:3.2-SNAPSHOT @ <https://builds.apache.org/job/maven-plugin-tools-jdk-1.7/ws/maven-plugin-tools-generators/pom.xml,>
MavenProject: org.apache.maven.plugin-tools:maven-plugin-tools-java:3.2-SNAPSHOT @ <https://builds.apache.org/job/maven-plugin-tools-jdk-1.7/ws/maven-plugin-tools-java/pom.xml,>
MavenProject: org.apache.maven.plugin-tools:maven-plugin-tools-javadoc:3.2-SNAPSHOT @ <https://builds.apache.org/job/maven-plugin-tools-jdk-1.7/ws/maven-plugin-tools-javadoc/pom.xml,>
MavenProject: org.apache.maven.plugin-tools:maven-plugin-annotations:3.2-SNAPSHOT @ <https://builds.apache.org/job/maven-plugin-tools-jdk-1.7/ws/maven-plugin-annotations/pom.xml,>
MavenProject: org.apache.maven.plugin-tools:maven-plugin-tools-annotations:3.2-SNAPSHOT @
<https://builds.apache.org/job/maven-plugin-tools-jdk-1.7/ws/maven-plugin-tools-annotations/pom.xml,>
MavenProject: org.apache.maven.plugin-tools:maven-plugin-tools-model:3.2-SNAPSHOT @ <https://builds.apache.org/job/maven-plugin-tools-jdk-1.7/ws/maven-plugin-tools-model/pom.xml,>
MavenProject: org.apache.maven.plugin-tools:maven-plugin-tools-ant:3.2-SNAPSHOT @ <https://builds.apache.org/job/maven-plugin-tools-jdk-1.7/ws/maven-plugin-tools-ant/pom.xml,>
MavenProject: org.apache.maven.plugin-tools:maven-plugin-tools-beanshell:3.2-SNAPSHOT @ <https://builds.apache.org/job/maven-plugin-tools-jdk-1.7/ws/maven-plugin-tools-beanshell/pom.xml,>
MavenProject: org.apache.maven.plugins:maven-plugin-plugin:3.2-SNAPSHOT @ <https://builds.apache.org/job/maven-plugin-tools-jdk-1.7/ws/maven-plugin-plugin/pom.xml]>
[JENKINS] Archiving <https://builds.apache.org/job/maven-plugin-tools-jdk-1.7/ws/maven-plugin-tools-annotations/pom.xml>
to /home/hudson/hudson/jobs/maven-plugin-tools-jdk-1.7/modules/org.apache.maven.plugin-tools$maven-plugin-tools-annotations/builds/2012-11-03_20-02-07/archive/org.apache.maven.plugin-tools/maven-plugin-tools-annotations/3.2-SNAPSHOT/maven-plugin-tools-annotations-3.2-SNAPSHOT.pom
[JENKINS] Archiving <https://builds.apache.org/job/maven-plugin-tools-jdk-1.7/ws/maven-plugin-tools-annotations/target/maven-plugin-tools-annotations-3.2-SNAPSHOT.jar>
to /home/hudson/hudson/jobs/maven-plugin-tools-jdk-1.7/modules/org.apache.maven.plugin-tools$maven-plugin-tools-annotations/builds/2012-11-03_20-02-07/archive/org.apache.maven.plugin-tools/maven-plugin-tools-annotations/3.2-SNAPSHOT/maven-plugin-tools-annotations-3.2-SNAPSHOT.jar
[JENKINS] Archiving <https://builds.apache.org/job/maven-plugin-tools-jdk-1.7/ws/maven-plugin-tools-annotations/target/maven-plugin-tools-annotations-3.2-SNAPSHOT-tests.jar>
to /home/hudson/hudson/jobs/maven-plugin-tools-jdk-1.7/modules/org.apache.maven.plugin-tools$maven-plugin-tools-annotations/builds/2012-11-03_20-02-07/archive/org.apache.maven.plugin-tools/maven-plugin-tools-annotations/3.2-SNAPSHOT/maven-plugin-tools-annotations-3.2-SNAPSHOT-tests.jar
[JENKINS] Archiving <https://builds.apache.org/job/maven-plugin-tools-jdk-1.7/ws/maven-plugin-tools-annotations/target/maven-plugin-tools-annotations-3.2-SNAPSHOT-test-sources.jar>
to /home/hudson/hudson/jobs/maven-plugin-tools-jdk-1.7/modules/org.apache.maven.plugin-tools$maven-plugin-tools-annotations/builds/2012-11-03_20-02-07/archive/org.apache.maven.plugin-tools/maven-plugin-tools-annotations/3.2-SNAPSHOT/maven-plugin-tools-annotations-3.2-SNAPSHOT-test-sources.jar
[JENKINS] Archiving <https://builds.apache.org/job/maven-plugin-tools-jdk-1.7/ws/maven-plugin-annotations/pom.xml>
to /home/hudson/hudson/jobs/maven-plugin-tools-jdk-1.7/modules/org.apache.maven.plugin-tools$maven-plugin-annotations/builds/2012-11-03_20-02-07/archive/org.apache.maven.plugin-tools/maven-plugin-annotations/3.2-SNAPSHOT/maven-plugin-annotations-3.2-SNAPSHOT.pom
[JENKINS] Archiving <https://builds.apache.org/job/maven-plugin-tools-jdk-1.7/ws/maven-plugin-annotations/target/maven-plugin-annotations-3.2-SNAPSHOT.jar>
to /home/hudson/hudson/jobs/maven-plugin-tools-jdk-1.7/modules/org.apache.maven.plugin-tools$maven-plugin-annotations/builds/2012-11-03_20-02-07/archive/org.apache.maven.plugin-tools/maven-plugin-annotations/3.2-SNAPSHOT/maven-plugin-annotations-3.2-SNAPSHOT.jar
[JENKINS] Archiving <https://builds.apache.org/job/maven-plugin-tools-jdk-1.7/ws/maven-script/maven-script-ant/pom.xml>
to /home/hudson/hudson/jobs/maven-plugin-tools-jdk-1.7/modules/org.apache.maven.plugin-tools$maven-script-ant/builds/2012-11-03_20-02-04/archive/org.apache.maven.plugin-tools/maven-script-ant/3.2-SNAPSHOT/maven-script-ant-3.2-SNAPSHOT.pom
[JENKINS] Archiving <https://builds.apache.org/job/maven-plugin-tools-jdk-1.7/ws/maven-script/maven-script-ant/target/maven-script-ant-3.2-SNAPSHOT.jar>
to /home/hudson/hudson/jobs/maven-plugin-tools-jdk-1.7/modules/org.apache.maven.plugin-tools$maven-script-ant/builds/2012-11-03_20-02-04/archive/org.apache.maven.plugin-tools/maven-script-ant/3.2-SNAPSHOT/maven-script-ant-3.2-SNAPSHOT.jar
[JENKINS] Archiving <https://builds.apache.org/job/maven-plugin-tools-jdk-1.7/ws/maven-plugin-tools-ant/pom.xml>
to /home/hudson/hudson/jobs/maven-plugin-tools-jdk-1.7/modules/org.apache.maven.plugin-tools$maven-plugin-tools-ant/builds/2012-11-03_20-02-07/archive/org.apache.maven.plugin-tools/maven-plugin-tools-ant/3.2-SNAPSHOT/maven-plugin-tools-ant-3.2-SNAPSHOT.pom
[JENKINS] Archiving <https://builds.apache.org/job/maven-plugin-tools-jdk-1.7/ws/maven-plugin-tools-ant/target/maven-plugin-tools-ant-3.2-SNAPSHOT.jar>
to /home/hudson/hudson/jobs/maven-plugin-tools-jdk-1.7/modules/org.apache.maven.plugin-tools$maven-plugin-tools-ant/builds/2012-11-03_20-02-07/archive/org.apache.maven.plugin-tools/maven-plugin-tools-ant/3.2-SNAPSHOT/maven-plugin-tools-ant-3.2-SNAPSHOT.jar
[JENKINS] Archiving <https://builds.apache.org/job/maven-plugin-tools-jdk-1.7/ws/maven-plugin-tools-java/pom.xml>
to /home/hudson/hudson/jobs/maven-plugin-tools-jdk-1.7/modules/org.apache.maven.plugin-tools$maven-plugin-tools-java/builds/2012-11-03_20-02-06/archive/org.apache.maven.plugin-tools/maven-plugin-tools-java/3.2-SNAPSHOT/maven-plugin-tools-java-3.2-SNAPSHOT.pom
[JENKINS] Archiving <https://builds.apache.org/job/maven-plugin-tools-jdk-1.7/ws/maven-plugin-tools-java/target/maven-plugin-tools-java-3.2-SNAPSHOT.jar>
to /home/hudson/hudson/jobs/maven-plugin-tools-jdk-1.7/modules/org.apache.maven.plugin-tools$maven-plugin-tools-java/builds/2012-11-03_20-02-06/archive/org.apache.maven.plugin-tools/maven-plugin-tools-java/3.2-SNAPSHOT/maven-plugin-tools-java-3.2-SNAPSHOT.jar
[JENKINS] Archiving <https://builds.apache.org/job/maven-plugin-tools-jdk-1.7/ws/maven-plugin-tools-generators/pom.xml>
to /home/hudson/hudson/jobs/maven-plugin-tools-jdk-1.7/modules/org.apache.maven.plugin-tools$maven-plugin-tools-generators/builds/2012-11-03_20-02-05/archive/org.apache.maven.plugin-tools/maven-plugin-tools-generators/3.2-SNAPSHOT/maven-plugin-tools-generators-3.2-SNAPSHOT.pom
[JENKINS] Archiving <https://builds.apache.org/job/maven-plugin-tools-jdk-1.7/ws/maven-plugin-tools-generators/target/maven-plugin-tools-generators-3.2-SNAPSHOT.jar>
to /home/hudson/hudson/jobs/maven-plugin-tools-jdk-1.7/modules/org.apache.maven.plugin-tools$maven-plugin-tools-generators/builds/2012-11-03_20-02-05/archive/org.apache.maven.plugin-tools/maven-plugin-tools-generators/3.2-SNAPSHOT/maven-plugin-tools-generators-3.2-SNAPSHOT.jar
[JENKINS] Archiving <https://builds.apache.org/job/maven-plugin-tools-jdk-1.7/ws/maven-plugin-tools-api/pom.xml>
to /home/hudson/hudson/jobs/maven-plugin-tools-jdk-1.7/modules/org.apache.maven.plugin-tools$maven-plugin-tools-api/builds/2012-11-03_20-02-05/archive/org.apache.maven.plugin-tools/maven-plugin-tools-api/3.2-SNAPSHOT/maven-plugin-tools-api-3.2-SNAPSHOT.pom
[JENKINS] Archiving <https://builds.apache.org/job/maven-plugin-tools-jdk-1.7/ws/maven-plugin-tools-api/target/maven-plugin-tools-api-3.2-SNAPSHOT.jar>
to /home/hudson/hudson/jobs/maven-plugin-tools-jdk-1.7/modules/org.apache.maven.plugin-tools$maven-plugin-tools-api/builds/2012-11-03_20-02-05/archive/org.apache.maven.plugin-tools/maven-plugin-tools-api/3.2-SNAPSHOT/maven-plugin-tools-api-3.2-SNAPSHOT.jar
[JENKINS] Archiving <https://builds.apache.org/job/maven-plugin-tools-jdk-1.7/ws/maven-plugin-plugin/pom.xml>
to /home/hudson/hudson/jobs/maven-plugin-tools-jdk-1.7/modules/org.apache.maven.plugins$maven-plugin-plugin/builds/2012-11-03_20-02-09/archive/org.apache.maven.plugins/maven-plugin-plugin/3.2-SNAPSHOT/maven-plugin-plugin-3.2-SNAPSHOT.pom
[JENKINS] Archiving <https://builds.apache.org/job/maven-plugin-tools-jdk-1.7/ws/maven-plugin-plugin/target/maven-plugin-plugin-3.2-SNAPSHOT.jar>
to /home/hudson/hudson/jobs/maven-plugin-tools-jdk-1.7/modules/org.apache.maven.plugins$maven-plugin-plugin/builds/2012-11-03_20-02-09/archive/org.apache.maven.plugins/maven-plugin-plugin/3.2-SNAPSHOT/maven-plugin-plugin-3.2-SNAPSHOT.jar
[JENKINS] Archiving <https://builds.apache.org/job/maven-plugin-tools-jdk-1.7/ws/maven-plugin-tools-javadoc/pom.xml>
to /home/hudson/hudson/jobs/maven-plugin-tools-jdk-1.7/modules/org.apache.maven.plugin-tools$maven-plugin-tools-javadoc/builds/2012-11-03_20-02-06/archive/org.apache.maven.plugin-tools/maven-plugin-tools-javadoc/3.2-SNAPSHOT/maven-plugin-tools-javadoc-3.2-SNAPSHOT.pom
[JENKINS] Archiving <https://builds.apache.org/job/maven-plugin-tools-jdk-1.7/ws/maven-plugin-tools-javadoc/target/maven-plugin-tools-javadoc-3.2-SNAPSHOT.jar>
to /home/hudson/hudson/jobs/maven-plugin-tools-jdk-1.7/modules/org.apache.maven.plugin-tools$maven-plugin-tools-javadoc/builds/2012-11-03_20-02-06/archive/org.apache.maven.plugin-tools/maven-plugin-tools-javadoc/3.2-SNAPSHOT/maven-plugin-tools-javadoc-3.2-SNAPSHOT.jar
[JENKINS] Archiving <https://builds.apache.org/job/maven-plugin-tools-jdk-1.7/ws/maven-script/maven-script-beanshell/pom.xml>
to /home/hudson/hudson/jobs/maven-plugin-tools-jdk-1.7/modules/org.apache.maven.plugin-tools$maven-script-beanshell/builds/2012-11-03_20-02-05/archive/org.apache.maven.plugin-tools/maven-script-beanshell/3.2-SNAPSHOT/maven-script-beanshell-3.2-SNAPSHOT.pom
[JENKINS] Archiving <https://builds.apache.org/job/maven-plugin-tools-jdk-1.7/ws/maven-script/maven-script-beanshell/target/maven-script-beanshell-3.2-SNAPSHOT.jar>
to /home/hudson/hudson/jobs/maven-plugin-tools-jdk-1.7/modules/org.apache.maven.plugin-tools$maven-script-beanshell/builds/2012-11-03_20-02-05/archive/org.apache.maven.plugin-tools/maven-script-beanshell/3.2-SNAPSHOT/maven-script-beanshell-3.2-SNAPSHOT.jar
[JENKINS] Archiving <https://builds.apache.org/job/maven-plugin-tools-jdk-1.7/ws/maven-plugin-tools-model/pom.xml>
to /home/hudson/hudson/jobs/maven-plugin-tools-jdk-1.7/modules/org.apache.maven.plugin-tools$maven-plugin-tools-model/builds/2012-11-03_20-02-08/archive/org.apache.maven.plugin-tools/maven-plugin-tools-model/3.2-SNAPSHOT/maven-plugin-tools-model-3.2-SNAPSHOT.pom
[JENKINS] Archiving <https://builds.apache.org/job/maven-plugin-tools-jdk-1.7/ws/maven-plugin-tools-model/target/maven-plugin-tools-model-3.2-SNAPSHOT.jar>
to /home/hudson/hudson/jobs/maven-plugin-tools-jdk-1.7/modules/org.apache.maven.plugin-tools$maven-plugin-tools-model/builds/2012-11-03_20-02-08/archive/org.apache.maven.plugin-tools/maven-plugin-tools-model/3.2-SNAPSHOT/maven-plugin-tools-model-3.2-SNAPSHOT.jar
[JENKINS] Archiving <https://builds.apache.org/job/maven-plugin-tools-jdk-1.7/ws/maven-script/pom.xml>
to /home/hudson/hudson/jobs/maven-plugin-tools-jdk-1.7/modules/org.apache.maven.plugin-tools$maven-script/builds/2012-11-03_20-02-04/archive/org.apache.maven.plugin-tools/maven-script/3.2-SNAPSHOT/maven-script-3.2-SNAPSHOT.pom
[JENKINS] Archiving <https://builds.apache.org/job/maven-plugin-tools-jdk-1.7/ws/maven-script/target/maven-script-3.2-SNAPSHOT-site.xml>
to /home/hudson/hudson/jobs/maven-plugin-tools-jdk-1.7/modules/org.apache.maven.plugin-tools$maven-script/builds/2012-11-03_20-02-04/archive/org.apache.maven.plugin-tools/maven-script/3.2-SNAPSHOT/maven-script-3.2-SNAPSHOT-site.xml
[JENKINS] Archiving <https://builds.apache.org/job/maven-plugin-tools-jdk-1.7/ws/pom.xml>
to /home/hudson/hudson/jobs/maven-plugin-tools-jdk-1.7/modules/org.apache.maven.plugin-tools$maven-plugin-tools/builds/2012-11-03_20-02-03/archive/org.apache.maven.plugin-tools/maven-plugin-tools/3.2-SNAPSHOT/maven-plugin-tools-3.2-SNAPSHOT.pom
[JENKINS] Archiving <https://builds.apache.org/job/maven-plugin-tools-jdk-1.7/ws/target/maven-plugin-tools-3.2-SNAPSHOT-site.xml>
to /home/hudson/hudson/jobs/maven-plugin-tools-jdk-1.7/modules/org.apache.maven.plugin-tools$maven-plugin-tools/builds/2012-11-03_20-02-03/archive/org.apache.maven.plugin-tools/maven-plugin-tools/3.2-SNAPSHOT/maven-plugin-tools-3.2-SNAPSHOT-site.xml
[JENKINS] Archiving <https://builds.apache.org/job/maven-plugin-tools-jdk-1.7/ws/maven-plugin-tools-beanshell/pom.xml>
to /home/hudson/hudson/jobs/maven-plugin-tools-jdk-1.7/modules/org.apache.maven.plugin-tools$maven-plugin-tools-beanshell/builds/2012-11-03_20-02-08/archive/org.apache.maven.plugin-tools/maven-plugin-tools-beanshell/3.2-SNAPSHOT/maven-plugin-tools-beanshell-3.2-SNAPSHOT.pom
[JENKINS] Archiving <https://builds.apache.org/job/maven-plugin-tools-jdk-1.7/ws/maven-plugin-tools-beanshell/target/maven-plugin-tools-beanshell-3.2-SNAPSHOT.jar>
to /home/hudson/hudson/jobs/maven-plugin-tools-jdk-1.7/modules/org.apache.maven.plugin-tools$maven-plugin-tools-beanshell/builds/2012-11-03_20-02-08/archive/org.apache.maven.plugin-tools/maven-plugin-tools-beanshell/3.2-SNAPSHOT/maven-plugin-tools-beanshell-3.2-SNAPSHOT.jar
Waiting for Jenkins to finish collecting data
mavenExecutionResult exceptions not empty
message : Failed to execute goal org.apache.maven.plugins:maven-invoker-plugin:1.6:run (integration-test)
on project maven-plugin-plugin: 1 build failed. See console output above for details.
cause : 1 build failed. See console output above for details.
Stack trace : 
org.apache.maven.lifecycle.LifecycleExecutionException: Failed to execute goal org.apache.maven.plugins:maven-invoker-plugin:1.6:run
(integration-test) on project maven-plugin-plugin: 1 build failed. See console output above
for details.
	at org.apache.maven.lifecycle.internal.MojoExecutor.execute(MojoExecutor.java:213)
	at org.apache.maven.lifecycle.internal.MojoExecutor.execute(MojoExecutor.java:153)
	at org.apache.maven.lifecycle.internal.MojoExecutor.execute(MojoExecutor.java:145)
	at org.apache.maven.lifecycle.internal.LifecycleModuleBuilder.buildProject(LifecycleModuleBuilder.java:84)
	at org.apache.maven.lifecycle.internal.LifecycleModuleBuilder.buildProject(LifecycleModuleBuilder.java:59)
	at org.apache.maven.lifecycle.internal.LifecycleStarter.singleThreadedBuild(LifecycleStarter.java:183)
	at org.apache.maven.lifecycle.internal.LifecycleStarter.execute(LifecycleStarter.java:161)
	at org.apache.maven.DefaultMaven.doExecute(DefaultMaven.java:320)
	at org.apache.maven.DefaultMaven.execute(DefaultMaven.java:156)
	at org.jvnet.hudson.maven3.launcher.Maven3Launcher.main(Maven3Launcher.java:79)
	at sun.reflect.NativeMethodAccessorImpl.invoke0(Native Method)
	at sun.reflect.NativeMethodAccessorImpl.invoke(NativeMethodAccessorImpl.java:57)
	at sun.reflect.DelegatingMethodAccessorImpl.invoke(DelegatingMethodAccessorImpl.java:43)
	at java.lang.reflect.Method.invoke(Method.java:601)
	at org.codehaus.plexus.classworlds.launcher.Launcher.launchStandard(Launcher.java:329)
	at org.codehaus.plexus.classworlds.launcher.Launcher.launch(Launcher.java:239)
	at org.jvnet.hudson.maven3.agent.Maven3Main.launch(Maven3Main.java:158)
	at hudson.maven.Maven3Builder.call(Maven3Builder.java:98)
	at hudson.maven.Maven3Builder.call(Maven3Builder.java:64)
	at hudson.remoting.UserRequest.perform(UserRequest.java:118)
	at hudson.remoting.UserRequest.perform(UserRequest.java:48)
	at hudson.remoting.Request$2.run(Request.java:326)
	at hudson.remoting.InterceptingExecutorService$1.call(InterceptingExecutorService.java:72)
	at java.util.concurrent.FutureTask$Sync.innerRun(FutureTask.java:334)
	at java.util.concurrent.FutureTask.run(FutureTask.java:166)
	at java.util.concurrent.ThreadPoolExecutor.runWorker(ThreadPoolExecutor.java:1110)
	at java.util.concurrent.ThreadPoolExecutor$Worker.run(ThreadPoolExecutor.java:603)
	at java.lang.Thread.run(Thread.java:722)
Caused by: org.apache.maven.plugin.MojoFailureException: 1 build failed. See console output
above for details.
	at org.apache.maven.plugin.invoker.InvokerSession.handleFailures(InvokerSession.java:258)
	at org.apache.maven.plugin.invoker.InvokerMojo.processResults(InvokerMojo.java:59)
	at org.apache.maven.plugin.invoker.AbstractInvokerMojo.execute(AbstractInvokerMojo.java:692)
	at org.apache.maven.plugin.DefaultBuildPluginManager.executeMojo(DefaultBuildPluginManager.java:101)
	at org.apache.maven.lifecycle.internal.MojoExecutor.execute(MojoExecutor.java:209)
	... 27 more
channel stopped

Mime
View raw message