maven-notifications mailing list archives

Site index · List index
Message view « Date » · « Thread »
Top « Date » · « Thread »
From Apache Jenkins Server <jenk...@builds.apache.org>
Subject Build failed in Jenkins: maven-plugins #1270
Date Tue, 13 Nov 2012 16:53:37 GMT
See <https://builds.apache.org/job/maven-plugins/1270/changes>

Changes:

[Robert Scholte] [MINVOKER-143] Update Maven Invoker to 2.1.1

------------------------------------------
[...truncated 1181 lines...]
[INFO] Copying 3 resources
mojoStarted org.apache.maven.plugins:maven-remote-resources-plugin:1.3(default)
mojoStarted org.apache.maven.plugins:maven-resources-plugin:2.5(default-testResources)
[INFO] 
[INFO] --- maven-remote-resources-plugin:1.3:process (default) @ maven-changes-plugin ---
[INFO] 
[INFO] --- maven-resources-plugin:2.5:testResources (default-testResources) @ maven-checkstyle-plugin
---
mojoSucceeded org.apache.maven.plugins:maven-resources-plugin:2.5(default-testResources)
mojoSucceeded org.apache.maven.plugins:maven-compiler-plugin:2.5.1(default-testCompile)
[INFO] Compiling 12 source files to <https://builds.apache.org/job/maven-plugins/ws/maven-checkstyle-plugin/target/test-classes>
mojoSucceeded org.apache.maven.plugins:maven-remote-resources-plugin:1.3(default)
mojoStarted org.apache.maven.plugins:maven-compiler-plugin:2.5.1(default-testCompile)
[INFO] 
[INFO] --- maven-compiler-plugin:2.5.1:testCompile (default-testCompile) @ maven-checkstyle-plugin
---
mojoSucceeded org.apache.maven.plugins:maven-compiler-plugin:2.5.1(default-testCompile)
[INFO] Surefire report directory: <https://builds.apache.org/job/maven-plugins/ws/maven-changelog-plugin/target/surefire-reports>

-------------------------------------------------------
 T E S T S
-------------------------------------------------------
mojoStarted org.apache.maven.plugins:maven-surefire-plugin:2.12(default-test)
[INFO] 
[INFO] [INFO] outputDirectory: <https://builds.apache.org/job/maven-plugins/ws/maven-changes-plugin/target/classes/META-INF/changes/xsd>
[INFO] Working on model: src/main/mdo/changes.mdo
[INFO] Generating current version: 1.0.0
--- maven-surefire-plugin:2.12:test (default-test) @ maven-changelog-plugin ---[INFO] Surefire
report directory: <https://builds.apache.org/job/maven-plugins/ws/maven-checkstyle-plugin/target/surefire-reports>


mojoStarted org.codehaus.modello:modello-maven-plugin:1.0.1(generate-xsd)-------------------------------------------------------

 T E S T S
-------------------------------------------------------
[INFO] 
[INFO] --- modello-maven-plugin:1.0.1:xsd (generate-xsd) @ maven-changes-plugin ---
mojoStarted org.apache.maven.plugins:maven-surefire-plugin:2.12(default-test)
[INFO] 
[INFO] --- maven-surefire-plugin:2.12:test (default-test) @ maven-checkstyle-plugin ---
mojoSucceeded org.codehaus.modello:modello-maven-plugin:1.0.1(generate-xsd)
Running org.apache.maven.plugin.changelog.FileActivityReportTest
Running org.apache.maven.plugin.checkstyle.CheckstyleAggregateReportTest
[INFO] Using existing changelog.xml...
Tests run: 2, Failures: 0, Errors: 0, Skipped: 0, Time elapsed: 1.724 sec
Running org.apache.maven.plugin.changelog.ChangeLogTest
Tests run: 1, Failures: 0, Errors: 0, Skipped: 0, Time elapsed: 0 sec
Running org.apache.maven.plugin.changelog.FileActivityComparatorTest
Tests run: 3, Failures: 0, Errors: 0, Skipped: 0, Time elapsed: 0.001 sec
Running org.apache.maven.plugin.changelog.ChangeLogReportTest
[INFO] 
[INFO] There are 5 checkstyle errors.
[INFO] Generating changed sets xml to: <https://builds.apache.org/job/maven-plugins/ws/maven-changelog-plugin/target/test-harness/4/changelog.xml>
[INFO] Generating changed sets xml to: <https://builds.apache.org/job/maven-plugins/ws/maven-changelog-plugin/target/test-harness/5/changelog.xml>
[ERROR] Provider message:
[ERROR] Provider Stub Error Message
[ERROR] Command output:
[ERROR] Provider Stub Commandline
[INFO] Using existing changelog.xml...
[INFO] Generating changed sets xml to: <https://builds.apache.org/job/maven-plugins/ws/maven-changelog-plugin/target/test-harness/8/changelog.xml>
[INFO] Generating changed sets xml to: <https://builds.apache.org/job/maven-plugins/ws/maven-changelog-plugin/target/test-harness/9/changelog.xml>
[INFO] Generating changed sets xml to: <https://builds.apache.org/job/maven-plugins/ws/maven-changelog-plugin/target/test-harness/10/changelog.xml>
[INFO] Generating changed sets xml to: <https://builds.apache.org/job/maven-plugins/ws/maven-changelog-plugin/target/test-harness/11/changelog.xml>
[INFO] Generating changed sets xml to: <https://builds.apache.org/job/maven-plugins/ws/maven-changelog-plugin/target/test-harness/12/changelog.xml>
[INFO] 
[INFO] There are 5 checkstyle errors.
[INFO] Generating changed sets xml to: <https://builds.apache.org/job/maven-plugins/ws/maven-changelog-plugin/target/test-harness/13/changelog.xml>
[INFO] Generating changed sets xml to: <https://builds.apache.org/job/maven-plugins/ws/maven-changelog-plugin/target/test-harness/14/changelog.xml>
Tests run: 1, Failures: 0, Errors: 0, Skipped: 0, Time elapsed: 3.142 sec
Running org.apache.maven.plugin.checkstyle.CheckstyleReportListenerMultiSourceTest
Tests run: 1, Failures: 0, Errors: 0, Skipped: 0, Time elapsed: 0 sec
Running org.apache.maven.plugin.checkstyle.CheckstyleResultsTest
Tests run: 2, Failures: 0, Errors: 0, Skipped: 0, Time elapsed: 0.001 sec
Running org.apache.maven.plugin.checkstyle.ReportResourceTest
Tests run: 3, Failures: 0, Errors: 0, Skipped: 0, Time elapsed: 0.001 sec
Running org.apache.maven.plugin.checkstyle.CheckstyleReportTest
[INFO] Generating changed sets xml to: <https://builds.apache.org/job/maven-plugins/ws/maven-changelog-plugin/target/test-harness/15/changelog.xml>
Tests run: 13, Failures: 0, Errors: 0, Skipped: 0, Time elapsed: 1.291 sec
Running org.apache.maven.plugin.changelog.DeveloperActivityReportTest
[INFO] Using existing changelog.xml...
Tests run: 2, Failures: 0, Errors: 0, Skipped: 0, Time elapsed: 0.249 sec

Results :

Tests run: 21, Failures: 0, Errors: 0, Skipped: 0

[INFO] 
[INFO] There are 5 checkstyle errors.
mojoSucceeded org.apache.maven.plugins:maven-surefire-plugin:2.12(default-test)
[debug] execute contextualize
[INFO] Using 'UTF-8' encoding to copy filtered resources.
mojoStarted org.apache.maven.plugins:maven-resources-plugin:2.5(default-resources)
[INFO] 
[INFO] --- maven-resources-plugin:2.5:resources (default-resources) @ maven-changes-plugin
---
[INFO] Copying 33 resources
[JENKINS] Recording test results
[INFO] Copying 3 resources
mojoSucceeded org.apache.maven.plugins:maven-resources-plugin:2.5(default-resources)
[INFO] 
[INFO] There are 5 checkstyle errors.
[INFO] Compiling 55 source files to <https://builds.apache.org/job/maven-plugins/ws/maven-changes-plugin/target/classes>
mojoStarted org.apache.maven.plugins:maven-compiler-plugin:2.5.1(default-compile)
[INFO] 
[INFO] --- maven-compiler-plugin:2.5.1:compile (default-compile) @ maven-changes-plugin ---
mojoStarted org.apache.maven.plugins:maven-jar-plugin:2.4(default-jar)
[INFO] [INFO] Starting audit...
<https://builds.apache.org/job/maven-plugins/ws/maven-checkstyle-plugin/src/test/test-sources/TestJavaObject.java>:1:
Missing a Javadoc comment.
<https://builds.apache.org/job/maven-plugins/ws/maven-checkstyle-plugin/src/test/test-sources/TestJavaObject.java>:1:
Missing a header - not enough lines in file.
<https://builds.apache.org/job/maven-plugins/ws/maven-checkstyle-plugin/src/test/test-sources/TestJavaObject.java>:1:29:
'{' should be on a new line.
<https://builds.apache.org/job/maven-plugins/ws/maven-checkstyle-plugin/src/test/test-sources/TestJavaObject.java>:2:5:
warning: Missing a Javadoc comment.
<https://builds.apache.org/job/maven-plugins/ws/maven-checkstyle-plugin/src/test/test-sources/TestJavaObject.java>:2:31:
'{' should be on a new line.
<https://builds.apache.org/job/maven-plugins/ws/maven-checkstyle-plugin/src/test/test-sources/TestJavaObject.java>:6:5:
warning: Missing a Javadoc comment.
<https://builds.apache.org/job/maven-plugins/ws/maven-checkstyle-plugin/src/test/test-sources/TestJavaObject.java>:6:34:
'{' should be on a new line.
Audit done.

[INFO] There are 5 checkstyle errors.
[INFO] Building jar: <https://builds.apache.org/job/maven-plugins/ws/maven-changelog-plugin/target/maven-changelog-plugin-2.3-SNAPSHOT.jar>
[WARNING] <https://builds.apache.org/job/maven-plugins/ws/maven-changes-plugin/src/main/java/org/apache/maven/plugin/changes/ReleaseUtils.java>:[231,61]
[unchecked] unchecked conversion
found   : java.util.List
required: java.util.List<org.apache.maven.plugins.changes.model.Release>
[WARNING] <https://builds.apache.org/job/maven-plugins/ws/maven-changes-plugin/src/main/java/org/apache/maven/plugin/changes/ReleaseUtils.java>:[235,34]
[unchecked] unchecked call to add(E) as a member of the raw type java.util.List
[WARNING] <https://builds.apache.org/job/maven-plugins/ws/maven-changes-plugin/src/main/java/org/apache/maven/plugin/changes/ReleaseUtils.java>:[242,54]
[unchecked] unchecked conversion
found   : java.util.List
required: java.util.List<org.apache.maven.plugins.changes.model.Release>
[WARNING] <https://builds.apache.org/job/maven-plugins/ws/maven-changes-plugin/src/main/java/org/apache/maven/plugin/changes/ReleaseUtils.java>:[249,34]
[unchecked] unchecked call to add(E) as a member of the raw type java.util.List
[WARNING] <https://builds.apache.org/job/maven-plugins/ws/maven-changes-plugin/target/generated-sources/modello/org/apache/maven/plugins/changes/model/Release.java>:[184,33]
[unchecked] unchecked call to add(E) as a member of the raw type java.util.List
[WARNING] <https://builds.apache.org/job/maven-plugins/ws/maven-changes-plugin/target/generated-sources/modello/org/apache/maven/plugins/changes/model/Release.java>:[198,32]
[unchecked] unchecked call to add(E) as a member of the raw type java.util.List
[WARNING] <https://builds.apache.org/job/maven-plugins/ws/maven-changes-plugin/src/main/java/org/apache/maven/plugin/changes/AbstractChangesReport.java>:[180,12]
[deprecation] generate(org.codehaus.doxia.sink.Sink,java.util.Locale) in org.apache.maven.reporting.AbstractMavenReport
has been deprecated
[WARNING] <https://builds.apache.org/job/maven-plugins/ws/maven-changes-plugin/target/generated-sources/modello/org/apache/maven/plugins/changes/model/io/xpp3/ChangesXpp3Reader.java>:[83,18]
[unchecked] unchecked call to add(E) as a member of the raw type java.util.Set
[WARNING] <https://builds.apache.org/job/maven-plugins/ws/maven-changes-plugin/target/generated-sources/modello/org/apache/maven/plugins/changes/model/io/xpp3/ChangesXpp3Reader.java>:[491,43]
[unchecked] unchecked conversion
found   : java.util.List
required: java.util.List<org.apache.maven.plugins.changes.model.FixedIssue>
[WARNING] <https://builds.apache.org/job/maven-plugins/ws/maven-changes-plugin/target/generated-sources/modello/org/apache/maven/plugins/changes/model/io/xpp3/ChangesXpp3Reader.java>:[493,31]
[unchecked] unchecked call to add(E) as a member of the raw type java.util.List
[WARNING] <https://builds.apache.org/job/maven-plugins/ws/maven-changes-plugin/target/generated-sources/modello/org/apache/maven/plugins/changes/model/io/xpp3/ChangesXpp3Reader.java>:[501,38]
[unchecked] unchecked conversion
found   : java.util.List
required: java.util.List<org.apache.maven.plugins.changes.model.DueTo>
[WARNING] <https://builds.apache.org/job/maven-plugins/ws/maven-changes-plugin/target/generated-sources/modello/org/apache/maven/plugins/changes/model/io/xpp3/ChangesXpp3Reader.java>:[503,26]
[unchecked] unchecked call to add(E) as a member of the raw type java.util.List
[WARNING] <https://builds.apache.org/job/maven-plugins/ws/maven-changes-plugin/target/generated-sources/modello/org/apache/maven/plugins/changes/model/io/xpp3/ChangesXpp3Reader.java>:[586,38]
[unchecked] unchecked conversion
found   : java.util.List
required: java.util.List<org.apache.maven.plugins.changes.model.Release>
[WARNING] <https://builds.apache.org/job/maven-plugins/ws/maven-changes-plugin/target/generated-sources/modello/org/apache/maven/plugins/changes/model/io/xpp3/ChangesXpp3Reader.java>:[588,28]
[unchecked] unchecked call to add(E) as a member of the raw type java.util.List
[WARNING] <https://builds.apache.org/job/maven-plugins/ws/maven-changes-plugin/target/generated-sources/modello/org/apache/maven/plugins/changes/model/io/xpp3/ChangesXpp3Reader.java>:[681,38]
[unchecked] unchecked conversion
found   : java.util.List
required: java.util.List<org.apache.maven.plugins.changes.model.Action>
[WARNING] <https://builds.apache.org/job/maven-plugins/ws/maven-changes-plugin/target/generated-sources/modello/org/apache/maven/plugins/changes/model/io/xpp3/ChangesXpp3Reader.java>:[686,35]
[unchecked] unchecked call to add(E) as a member of the raw type java.util.List
[WARNING] <https://builds.apache.org/job/maven-plugins/ws/maven-changes-plugin/target/generated-sources/modello/org/apache/maven/plugins/changes/model/io/xpp3/ChangesXpp3Reader.java>:[863,40]
[unchecked] unchecked conversion
found   : java.util.List
required: java.util.List<org.apache.maven.plugins.changes.model.Action>
[WARNING] <https://builds.apache.org/job/maven-plugins/ws/maven-changes-plugin/target/generated-sources/modello/org/apache/maven/plugins/changes/model/io/xpp3/ChangesXpp3Reader.java>:[865,27]
[unchecked] unchecked call to add(E) as a member of the raw type java.util.List
[WARNING] <https://builds.apache.org/job/maven-plugins/ws/maven-changes-plugin/src/main/java/org/apache/maven/plugin/changes/schema/DefaultChangesSchemaValidator.java>:[108,32]
[unchecked] unchecked call to put(K,V) as a member of the raw type java.util.Map
[INFO] Starting audit...
<https://builds.apache.org/job/maven-plugins/ws/maven-checkstyle-plugin/src/test/test-sources/TestJavaObject.java>:1:
Missing a Javadoc comment.
<https://builds.apache.org/job/maven-plugins/ws/maven-checkstyle-plugin/src/test/test-sources/TestJavaObject.java>:1:
Missing a header - not enough lines in file.
<https://builds.apache.org/job/maven-plugins/ws/maven-checkstyle-plugin/src/test/test-sources/TestJavaObject.java>:1:29:
'{' should be on a new line.
<https://builds.apache.org/job/maven-plugins/ws/maven-checkstyle-plugin/src/test/test-sources/TestJavaObject.java>:2:5:
warning: Missing a Javadoc comment.
<https://builds.apache.org/job/maven-plugins/ws/maven-checkstyle-plugin/src/test/test-sources/TestJavaObject.java>:2:31:
'{' should be on a new line.
<https://builds.apache.org/job/maven-plugins/ws/maven-checkstyle-plugin/src/test/test-sources/TestJavaObject.java>:6:5:
warning: Missing a Javadoc comment.
<https://builds.apache.org/job/maven-plugins/ws/maven-checkstyle-plugin/src/test/test-sources/TestJavaObject.java>:6:34:
'{' should be on a new line.
Audit done.

[INFO] There are 5 checkstyle errors.
[INFO] There are 5 checkstyle errors.
[INFO] There are 5 checkstyle errors.
[INFO] 
[INFO] There are 5 checkstyle errors.
[INFO] 
[INFO] There are 5 checkstyle errors.
[INFO] 
[INFO] There are 5 checkstyle errors.
[INFO] 
[INFO] There are 5 checkstyle errors.

[INFO] --- maven-jar-plugin:2.4:jar (default-jar) @ maven-changelog-plugin ---
mojoSucceeded org.apache.maven.plugins:maven-jar-plugin:2.4(default-jar)
mojoSucceeded org.apache.maven.plugins:maven-compiler-plugin:2.5.1(default-compile)
[INFO] 
[INFO] There are 5 checkstyle errors.
mojoStarted org.apache.maven.plugins:maven-plugin-plugin:3.2(default-addPluginArtifactMetadata)
[INFO] Using 'UTF-8' encoding to read mojo metadata.
[INFO] [INFO] Applying mojo extractor for language: java

[INFO] --- maven-plugin-plugin:3.2:addPluginArtifactMetadata (default-addPluginArtifactMetadata)
@ maven-changelog-plugin ---
mojoSucceeded org.apache.maven.plugins:maven-plugin-plugin:3.2(default-addPluginArtifactMetadata)
mojoStarted org.apache.maven.plugins:maven-plugin-plugin:3.2(mojo-descriptor)
[INFO] 
[INFO] --- maven-plugin-plugin:3.2:descriptor (mojo-descriptor) @ maven-changes-plugin ---
[INFO] Mojo extractor for language: java found 0 mojo descriptors.
[INFO] Applying mojo extractor for language: bsh
[INFO] Mojo extractor for language: bsh found 0 mojo descriptors.
[INFO] Applying mojo extractor for language: java-annotations
[INFO] Installing <https://builds.apache.org/job/maven-plugins/ws/maven-changelog-plugin/target/maven-changelog-plugin-2.3-SNAPSHOT.jar>
to /home/jenkins/jenkins-slave/maven-repositories/0/org/apache/maven/plugins/maven-changelog-plugin/2.3-SNAPSHOT/maven-changelog-plugin-2.3-SNAPSHOT.jar
mojoStarted org.apache.maven.plugins:maven-install-plugin:2.3.1(default-install)[INFO] Installing
<https://builds.apache.org/job/maven-plugins/ws/maven-changelog-plugin/pom.xml> to /home/jenkins/jenkins-slave/maven-repositories/0/org/apache/maven/plugins/maven-changelog-plugin/2.3-SNAPSHOT/maven-changelog-plugin-2.3-SNAPSHOT.pom

[INFO] 
[INFO] There are 5 checkstyle errors.
[INFO] 
[INFO] 
[INFO] Mojo extractor for language: java-annotations found 9 mojo descriptors.
[INFO] 
[INFO] There are 5 checkstyle errors.
[INFO] 
[INFO] There are 5 checkstyle errors.
[INFO] Tests run: 10, Failures: 0, Errors: 0, Skipped: 0, Time elapsed: 7.352 sec
Running org.apache.maven.plugin.checkstyle.CheckstyleViolationCheckMojoTest
--- maven-install-plugin:2.3.1:install (default-install) @ maven-changelog-plugin ---
mojoSucceeded org.apache.maven.plugins:maven-install-plugin:2.3.1(default-install)[INFO] Unable
to perform checkstyle:check, unable to find checkstyle:checkstyle outputFile.

mojoSucceeded org.apache.maven.plugins:maven-plugin-plugin:3.2(mojo-descriptor)
[WARNING] checkstyle:check violations detected but failOnViolation set to false
Tests run: 4, Failures: 0, Errors: 0, Skipped: 0, Time elapsed: 0.141 sec
Running org.apache.maven.plugin.checkstyle.CheckstyleReportListenerTest
Tests run: 1, Failures: 0, Errors: 0, Skipped: 0, Time elapsed: 0 sec

Results :

Tests run: 22, Failures: 0, Errors: 0, Skipped: 0

mojoSucceeded org.apache.maven.plugins:maven-surefire-plugin:2.12(default-test)
projectSucceeded org.apache.maven.plugins:maven-changelog-plugin:2.3-SNAPSHOT
mojoStarted org.codehaus.plexus:plexus-component-metadata:1.5.5(default)
[INFO] 
[INFO] --- plexus-component-metadata:1.5.5:generate-metadata (default) @ maven-changes-plugin
---
[INFO] Discovered 1 component descriptors(s)
[JENKINS] Recording test results
mojoSucceeded org.codehaus.plexus:plexus-component-metadata:1.5.5(default)
[debug] execute contextualize
[INFO] Using 'UTF-8' encoding to copy filtered resources.
[INFO] Copying 4 resources
[INFO] Copying 3 resources
mojoStarted org.apache.maven.plugins:maven-resources-plugin:2.5(default-testResources)
[INFO] 
[INFO] --- maven-resources-plugin:2.5:testResources (default-testResources) @ maven-changes-plugin
---
mojoSucceeded org.apache.maven.plugins:maven-resources-plugin:2.5(default-testResources)
projectStarted org.apache.maven.plugins:maven-clean-plugin:2.6-SNAPSHOT
mojoStarted org.apache.maven.plugins:maven-jar-plugin:2.4(default-jar)
mojoStarted org.apache.maven.plugins:maven-compiler-plugin:2.5.1(default-testCompile)
[INFO] 
[INFO] --- maven-compiler-plugin:2.5.1:testCompile (default-testCompile) @ maven-changes-plugin
---
[INFO] Compiling 18 source files to <https://builds.apache.org/job/maven-plugins/ws/maven-changes-plugin/target/test-classes>
Nov 13, 2012 4:53:06 PM hudson.remoting.SynchronousCommandTransport$ReaderThread run
SEVERE: I/O error in channel channel
java.io.StreamCorruptedException
	at java.io.ObjectInputStream.readObject0(ObjectInputStream.java:1332)
	at java.io.ObjectInputStream.readObject(ObjectInputStream.java:348)
	at hudson.remoting.Command.readFrom(Command.java:90)
	at hudson.remoting.ClassicCommandTransport.read(ClassicCommandTransport.java:59)
	at hudson.remoting.SynchronousCommandTransport$ReaderThread.run(SynchronousCommandTransport.java:48)
channel stopped
[INFO] 
[INFO] --- maven-jar-plugin:2.4:jar (default-jar) @ maven-checkstyle-plugin ---
ERROR: Maven JVM terminated unexpectedly with exit code 0
[WARNINGS] Skipping publisher since build result is FAILURE

Mime
View raw message