maven-notifications mailing list archives

Site index · List index
Message view « Date » · « Thread »
Top « Date » · « Thread »
From Apache Jenkins Server <jenk...@builds.apache.org>
Subject Build failed in Jenkins: maven-plugin-tools-m2 #111
Date Fri, 02 Nov 2012 19:53:21 GMT
See <https://builds.apache.org/job/maven-plugin-tools-m2/111/changes>

Changes:

[hboutemy] code formatting

[krosenvold] [MPLUGIN-229] Converted to use dom instead of xpp3dom

------------------------------------------
[...truncated 1373 lines...]
[JENKINS] Recording test results
[INFO] [jar:jar {execution: default-jar}]
[INFO] Building jar: <https://builds.apache.org/job/maven-plugin-tools-m2/ws/maven-plugin-tools-beanshell/target/maven-plugin-tools-beanshell-3.2-SNAPSHOT.jar>
[INFO] [install:install {execution: default-install}]
[INFO] Installing <https://builds.apache.org/job/maven-plugin-tools-m2/ws/maven-plugin-tools-beanshell/target/maven-plugin-tools-beanshell-3.2-SNAPSHOT.jar>
to /home/jenkins/jenkins-slave/maven-repositories/1/org/apache/maven/plugin-tools/maven-plugin-tools-beanshell/3.2-SNAPSHOT/maven-plugin-tools-beanshell-3.2-SNAPSHOT.jar
[JENKINS] Archiving <https://builds.apache.org/job/maven-plugin-tools-m2/ws/maven-plugin-tools-beanshell/pom.xml>
to /home/hudson/hudson/jobs/maven-plugin-tools-m2/modules/org.apache.maven.plugin-tools$maven-plugin-tools-beanshell/builds/2012-11-02_19-48-01/archive/org.apache.maven.plugin-tools/maven-plugin-tools-beanshell/3.2-SNAPSHOT/maven-plugin-tools-beanshell-3.2-SNAPSHOT.pom
[JENKINS] Archiving <https://builds.apache.org/job/maven-plugin-tools-m2/ws/maven-plugin-tools-beanshell/target/maven-plugin-tools-beanshell-3.2-SNAPSHOT.jar>
to /home/hudson/hudson/jobs/maven-plugin-tools-m2/modules/org.apache.maven.plugin-tools$maven-plugin-tools-beanshell/builds/2012-11-02_19-48-01/archive/org.apache.maven.plugin-tools/maven-plugin-tools-beanshell/3.2-SNAPSHOT/maven-plugin-tools-beanshell-3.2-SNAPSHOT.jar
[INFO] ------------------------------------------------------------------------
[INFO] Building Maven Plugin Plugin
[INFO]    task-segment: [clean, install]
[INFO] ------------------------------------------------------------------------
[INFO] [clean:clean {execution: default-clean}]
[INFO] [enforcer:enforce {execution: ensure-no-container-api}]
[INFO] [modello:java {execution: default}]
[INFO] outputDirectory: <https://builds.apache.org/job/maven-plugin-tools-m2/ws/maven-plugin-plugin/target/generated-sources/modello>
[INFO] Working on model: src/main/mdo/pluginRequirements.mdo
[INFO] Generating current version: 1.0.0
[INFO] [plugin:helpmojo {execution: generated-helpmojo}]
[INFO] Using 'UTF-8' encoding to read mojo metadata.
[INFO] Applying mojo extractor for language: java
[INFO] Mojo extractor for language: java found 0 mojo descriptors.
[INFO] Applying mojo extractor for language: bsh
[INFO] Mojo extractor for language: bsh found 0 mojo descriptors.
[INFO] Applying mojo extractor for language: java-annotations
[INFO] snapshot org.apache.maven.plugin-tools:maven-plugin-tools-annotations:3.2-SNAPSHOT:
checking for updates from apache.snapshots
[INFO] Mojo extractor for language: java-annotations found 0 mojo descriptors.
[INFO] [plugin:descriptor {execution: default-descriptor}]
[INFO] Using 'UTF-8' encoding to read mojo metadata.
[INFO] Applying mojo extractor for language: java
[INFO] Mojo extractor for language: java found 1 mojo descriptors.
[INFO] Applying mojo extractor for language: bsh
[INFO] Mojo extractor for language: bsh found 0 mojo descriptors.
[INFO] Applying mojo extractor for language: java-annotations
[INFO] Mojo extractor for language: java-annotations found 0 mojo descriptors.
[WARNING] The parameter expression: 'project.build.resources' used in mojo: 'process' has
been deprecated. Use 'project.resources' instead.
[INFO] [remote-resources:process {execution: default}]
[debug] execute contextualize
[INFO] [resources:resources {execution: default-resources}]
[INFO] Using 'UTF-8' encoding to copy filtered resources.
[INFO] Copying 5 resources
[INFO] Copying 3 resources
[INFO] [compiler:compile {execution: default-compile}]
[INFO] Compiling 9 source files to <https://builds.apache.org/job/maven-plugin-tools-m2/ws/maven-plugin-plugin/target/classes>
[INFO] [plugin:descriptor {execution: mojo-descriptor}]
[INFO] Using 'UTF-8' encoding to read mojo metadata.
[INFO] Applying mojo extractor for language: java
[INFO] Mojo extractor for language: java found 1 mojo descriptors.
[INFO] Applying mojo extractor for language: bsh
[INFO] Mojo extractor for language: bsh found 0 mojo descriptors.
[INFO] Applying mojo extractor for language: java-annotations
[INFO] Mojo extractor for language: java-annotations found 6 mojo descriptors.
[debug] execute contextualize
[INFO] [resources:testResources {execution: default-testResources}]
[INFO] Using 'UTF-8' encoding to copy filtered resources.
[INFO] skip non existing resourceDirectory <https://builds.apache.org/job/maven-plugin-tools-m2/ws/maven-plugin-plugin/src/test/resources>
[INFO] Copying 3 resources
[INFO] [compiler:testCompile {execution: default-testCompile}]
[INFO] No sources to compile
[INFO] [surefire:test {execution: default-test}]
[INFO] Surefire report directory: <https://builds.apache.org/job/maven-plugin-tools-m2/ws/maven-plugin-plugin/target/surefire-reports>

-------------------------------------------------------
 T E S T S
-------------------------------------------------------

Results :

Tests run: 0, Failures: 0, Errors: 0, Skipped: 0

[JENKINS] Recording test results
[INFO] [jar:jar {execution: default-jar}]
[INFO] Building jar: <https://builds.apache.org/job/maven-plugin-tools-m2/ws/maven-plugin-plugin/target/maven-plugin-plugin-3.2-SNAPSHOT.jar>
[INFO] [plugin:addPluginArtifactMetadata {execution: default-addPluginArtifactMetadata}]
[INFO] [invoker:install {execution: integration-test}]
[INFO] Installing <https://builds.apache.org/job/maven-plugin-tools-m2/ws/maven-plugin-tools-annotations/pom.xml>
to <https://builds.apache.org/job/maven-plugin-tools-m2/ws/maven-plugin-plugin/target/local-repo/org/apache/maven/plugin-tools/maven-plugin-tools-annotations/3.2-SNAPSHOT/maven-plugin-tools-annotations-3.2-SNAPSHOT.pom>
[INFO] Installing <https://builds.apache.org/job/maven-plugin-tools-m2/ws/maven-plugin-tools-annotations/target/maven-plugin-tools-annotations-3.2-SNAPSHOT.jar>
to <https://builds.apache.org/job/maven-plugin-tools-m2/ws/maven-plugin-plugin/target/local-repo/org/apache/maven/plugin-tools/maven-plugin-tools-annotations/3.2-SNAPSHOT/maven-plugin-tools-annotations-3.2-SNAPSHOT.jar>
[INFO] Installing <https://builds.apache.org/job/maven-plugin-tools-m2/ws/maven-plugin-tools-annotations/target/maven-plugin-tools-annotations-3.2-SNAPSHOT-tests.jar>
to <https://builds.apache.org/job/maven-plugin-tools-m2/ws/maven-plugin-plugin/target/local-repo/org/apache/maven/plugin-tools/maven-plugin-tools-annotations/3.2-SNAPSHOT/maven-plugin-tools-annotations-3.2-SNAPSHOT-tests.jar>
[INFO] Installing <https://builds.apache.org/job/maven-plugin-tools-m2/ws/maven-plugin-tools-annotations/target/maven-plugin-tools-annotations-3.2-SNAPSHOT-test-sources.jar>
to <https://builds.apache.org/job/maven-plugin-tools-m2/ws/maven-plugin-plugin/target/local-repo/org/apache/maven/plugin-tools/maven-plugin-tools-annotations/3.2-SNAPSHOT/maven-plugin-tools-annotations-3.2-SNAPSHOT-test-sources.jar>
[INFO] Installing <https://builds.apache.org/job/maven-plugin-tools-m2/ws/pom.xml> to
<https://builds.apache.org/job/maven-plugin-tools-m2/ws/maven-plugin-plugin/target/local-repo/org/apache/maven/plugin-tools/maven-plugin-tools/3.2-SNAPSHOT/maven-plugin-tools-3.2-SNAPSHOT.pom>
[INFO] Installing <https://builds.apache.org/job/maven-plugin-tools-m2/ws/maven-plugin-tools-api/pom.xml>
to <https://builds.apache.org/job/maven-plugin-tools-m2/ws/maven-plugin-plugin/target/local-repo/org/apache/maven/plugin-tools/maven-plugin-tools-api/3.2-SNAPSHOT/maven-plugin-tools-api-3.2-SNAPSHOT.pom>
[INFO] Installing <https://builds.apache.org/job/maven-plugin-tools-m2/ws/maven-plugin-tools-api/target/maven-plugin-tools-api-3.2-SNAPSHOT.jar>
to <https://builds.apache.org/job/maven-plugin-tools-m2/ws/maven-plugin-plugin/target/local-repo/org/apache/maven/plugin-tools/maven-plugin-tools-api/3.2-SNAPSHOT/maven-plugin-tools-api-3.2-SNAPSHOT.jar>
[INFO] Installing <https://builds.apache.org/job/maven-plugin-tools-m2/ws/maven-plugin-annotations/pom.xml>
to <https://builds.apache.org/job/maven-plugin-tools-m2/ws/maven-plugin-plugin/target/local-repo/org/apache/maven/plugin-tools/maven-plugin-annotations/3.2-SNAPSHOT/maven-plugin-annotations-3.2-SNAPSHOT.pom>
[INFO] Installing <https://builds.apache.org/job/maven-plugin-tools-m2/ws/maven-plugin-annotations/target/maven-plugin-annotations-3.2-SNAPSHOT.jar>
to <https://builds.apache.org/job/maven-plugin-tools-m2/ws/maven-plugin-plugin/target/local-repo/org/apache/maven/plugin-tools/maven-plugin-annotations/3.2-SNAPSHOT/maven-plugin-annotations-3.2-SNAPSHOT.jar>
[INFO] Installing <https://builds.apache.org/job/maven-plugin-tools-m2/ws/maven-plugin-tools-generators/pom.xml>
to <https://builds.apache.org/job/maven-plugin-tools-m2/ws/maven-plugin-plugin/target/local-repo/org/apache/maven/plugin-tools/maven-plugin-tools-generators/3.2-SNAPSHOT/maven-plugin-tools-generators-3.2-SNAPSHOT.pom>
[INFO] Installing <https://builds.apache.org/job/maven-plugin-tools-m2/ws/maven-plugin-tools-generators/target/maven-plugin-tools-generators-3.2-SNAPSHOT.jar>
to <https://builds.apache.org/job/maven-plugin-tools-m2/ws/maven-plugin-plugin/target/local-repo/org/apache/maven/plugin-tools/maven-plugin-tools-generators/3.2-SNAPSHOT/maven-plugin-tools-generators-3.2-SNAPSHOT.jar>
[INFO] Installing <https://builds.apache.org/job/maven-plugin-tools-m2/ws/maven-plugin-tools-java/pom.xml>
to <https://builds.apache.org/job/maven-plugin-tools-m2/ws/maven-plugin-plugin/target/local-repo/org/apache/maven/plugin-tools/maven-plugin-tools-java/3.2-SNAPSHOT/maven-plugin-tools-java-3.2-SNAPSHOT.pom>
[INFO] Installing <https://builds.apache.org/job/maven-plugin-tools-m2/ws/maven-plugin-tools-java/target/maven-plugin-tools-java-3.2-SNAPSHOT.jar>
to <https://builds.apache.org/job/maven-plugin-tools-m2/ws/maven-plugin-plugin/target/local-repo/org/apache/maven/plugin-tools/maven-plugin-tools-java/3.2-SNAPSHOT/maven-plugin-tools-java-3.2-SNAPSHOT.jar>
[INFO] Installing <https://builds.apache.org/job/maven-plugin-tools-m2/ws/maven-plugin-tools-beanshell/pom.xml>
to <https://builds.apache.org/job/maven-plugin-tools-m2/ws/maven-plugin-plugin/target/local-repo/org/apache/maven/plugin-tools/maven-plugin-tools-beanshell/3.2-SNAPSHOT/maven-plugin-tools-beanshell-3.2-SNAPSHOT.pom>
[INFO] Installing <https://builds.apache.org/job/maven-plugin-tools-m2/ws/maven-plugin-tools-beanshell/target/maven-plugin-tools-beanshell-3.2-SNAPSHOT.jar>
to <https://builds.apache.org/job/maven-plugin-tools-m2/ws/maven-plugin-plugin/target/local-repo/org/apache/maven/plugin-tools/maven-plugin-tools-beanshell/3.2-SNAPSHOT/maven-plugin-tools-beanshell-3.2-SNAPSHOT.jar>
[INFO] Installing <https://builds.apache.org/job/maven-plugin-tools-m2/ws/maven-plugin-tools-model/pom.xml>
to <https://builds.apache.org/job/maven-plugin-tools-m2/ws/maven-plugin-plugin/target/local-repo/org/apache/maven/plugin-tools/maven-plugin-tools-model/3.2-SNAPSHOT/maven-plugin-tools-model-3.2-SNAPSHOT.pom>
[INFO] Installing <https://builds.apache.org/job/maven-plugin-tools-m2/ws/maven-plugin-tools-model/target/maven-plugin-tools-model-3.2-SNAPSHOT.jar>
to <https://builds.apache.org/job/maven-plugin-tools-m2/ws/maven-plugin-plugin/target/local-repo/org/apache/maven/plugin-tools/maven-plugin-tools-model/3.2-SNAPSHOT/maven-plugin-tools-model-3.2-SNAPSHOT.jar>
[INFO] Installing <https://builds.apache.org/job/maven-plugin-tools-m2/ws/maven-plugin-plugin/pom.xml>
to <https://builds.apache.org/job/maven-plugin-tools-m2/ws/maven-plugin-plugin/target/local-repo/org/apache/maven/plugins/maven-plugin-plugin/3.2-SNAPSHOT/maven-plugin-plugin-3.2-SNAPSHOT.pom>
[INFO] Installing <https://builds.apache.org/job/maven-plugin-tools-m2/ws/maven-plugin-plugin/target/maven-plugin-plugin-3.2-SNAPSHOT.jar>
to <https://builds.apache.org/job/maven-plugin-tools-m2/ws/maven-plugin-plugin/target/local-repo/org/apache/maven/plugins/maven-plugin-plugin/3.2-SNAPSHOT/maven-plugin-plugin-3.2-SNAPSHOT.jar>
[INFO] [invoker:run {execution: integration-test}]
[INFO] Building: skip/pom.xml
[INFO] run script <https://builds.apache.org/job/maven-plugin-tools-m2/ws/maven-plugin-plugin/target/it/skip/verify.groovy>
[INFO] ..SUCCESS (8.3 s)
[INFO] Building: ant-since-maven-plugin/pom.xml
[INFO] ..SUCCESS (4.5 s)
[INFO] Building: mplugin-187/pom.xml
[INFO] ..SUCCESS (3.8 s)
[INFO] Building: fix-maven-since-3.x/pom.xml
[INFO] ..SKIPPED 
[INFO] Building: help-basic/pom.xml
[INFO] ..SUCCESS (7.0 s)
[INFO] Building: help-package/pom.xml
[INFO] run script <https://builds.apache.org/job/maven-plugin-tools-m2/ws/maven-plugin-plugin/target/it/help-package/verify.bsh>
[INFO] ..SUCCESS (6.9 s)
[INFO] Building: ignore-plugin-class-realm/pom.xml
[INFO] ..SUCCESS (8.6 s)
[INFO] Building: java-basic-annotations/pom.xml
[INFO] ..FAILED (11.3 s)
[INFO]   The build exited with code 1. See <https://builds.apache.org/job/maven-plugin-tools-m2/ws/maven-plugin-plugin/target/it/java-basic-annotations/build.log>
for details.
[INFO] Building: annotation-with-inheritance-from-deps/pom.xml
[INFO] run script <https://builds.apache.org/job/maven-plugin-tools-m2/ws/maven-plugin-plugin/target/it/annotation-with-inheritance-from-deps/verify.groovy>
[INFO] ..SUCCESS (14.7 s)
[INFO] Building: java-basic/pom.xml
[INFO] run script <https://builds.apache.org/job/maven-plugin-tools-m2/ws/maven-plugin-plugin/target/it/java-basic/verify.groovy>
[INFO] ..SUCCESS (7.6 s)
[INFO] Building: annotation-with-inheritance-reactor/pom.xml
[INFO] run script <https://builds.apache.org/job/maven-plugin-tools-m2/ws/maven-plugin-plugin/target/it/annotation-with-inheritance-reactor/verify.groovy>
[INFO] ..SUCCESS (11.1 s)
[INFO] Building: ant-reference-parameter/pom.xml
[INFO] ..SUCCESS (8.4 s)
[INFO] Building: annotation-with-inheritance/pom.xml
[INFO] run script <https://builds.apache.org/job/maven-plugin-tools-m2/ws/maven-plugin-plugin/target/it/annotation-with-inheritance/verify.groovy>
[INFO] ..SUCCESS (16.7 s)
[INFO] Building: ant-simple-usage/pom.xml
[INFO] ..SUCCESS (6.4 s)
[INFO] Building: plugin-report/pom.xml
[INFO] run script <https://builds.apache.org/job/maven-plugin-tools-m2/ws/maven-plugin-plugin/target/it/plugin-report/verify.bsh>
[INFO] ..SUCCESS (28.4 s)
[INFO] Building: plugin-report-annotations/pom.xml
[INFO] run script <https://builds.apache.org/job/maven-plugin-tools-m2/ws/maven-plugin-plugin/target/it/plugin-report-annotations/verify.bsh>
[INFO] ..SUCCESS (11.0 s)
[INFO] Building: source-encoding/pom.xml
[INFO] run script <https://builds.apache.org/job/maven-plugin-tools-m2/ws/maven-plugin-plugin/target/it/source-encoding/verify.groovy>
[INFO] ..SUCCESS (5.5 s)
[INFO] Building: plugin-info-jdk-default-version/pom.xml
[INFO] run script <https://builds.apache.org/job/maven-plugin-tools-m2/ws/maven-plugin-plugin/target/it/plugin-info-jdk-default-version/verify.groovy>
[INFO] ..SUCCESS (11.1 s)
[INFO] Building: beanshell-simple/pom.xml
[INFO] run script <https://builds.apache.org/job/maven-plugin-tools-m2/ws/maven-plugin-plugin/target/it/beanshell-simple/verify.groovy>
[INFO] ..SUCCESS (5.9 s)
[INFO] Building: ant-basic/pom.xml
[INFO] run script <https://builds.apache.org/job/maven-plugin-tools-m2/ws/maven-plugin-plugin/target/it/ant-basic/verify.groovy>
[INFO] ..SUCCESS (7.4 s)
[INFO] -------------------------------------------------
[INFO] Build Summary:
[INFO]   Passed: 18, Failed: 1, Errors: 0, Skipped: 1
[INFO] -------------------------------------------------
[ERROR] The following builds failed:
[ERROR] *  java-basic-annotations/pom.xml
[INFO] -------------------------------------------------
MavenInvokerArchiver
found reports:[<https://builds.apache.org/job/maven-plugin-tools-m2/ws/maven-plugin-plugin/target/invoker-reports/BUILD-skip.xml,>
<https://builds.apache.org/job/maven-plugin-tools-m2/ws/maven-plugin-plugin/target/invoker-reports/BUILD-java-basic.xml,>
<https://builds.apache.org/job/maven-plugin-tools-m2/ws/maven-plugin-plugin/target/invoker-reports/BUILD-mplugin-187.xml,>
<https://builds.apache.org/job/maven-plugin-tools-m2/ws/maven-plugin-plugin/target/invoker-reports/BUILD-ant-reference-parameter.xml,>
<https://builds.apache.org/job/maven-plugin-tools-m2/ws/maven-plugin-plugin/target/invoker-reports/BUILD-help-package.xml,>
<https://builds.apache.org/job/maven-plugin-tools-m2/ws/maven-plugin-plugin/target/invoker-reports/BUILD-annotation-with-inheritance-reactor.xml,>
<https://builds.apache.org/job/maven-plugin-tools-m2/ws/maven-plugin-plugin/target/invoker-reports/BUILD-ant-basic.xml,>
<https://builds.apache.org/job/maven-plugin-tools-m2/ws/maven-plugin-plugin/target/invoker-reports/BUILD-plugin-report-annotations.xml,>
<https://builds.apache.org/job/maven-plugin-tools-m2/ws/maven-plugin-plugin/target/invoker-reports/BUILD-ant-simple-usage.xml,>
<https://builds.apache.org/job/maven-plugin-tools-m2/ws/maven-plugin-plugin/target/invoker-reports/BUILD-beanshell-simple.xml,>
<https://builds.apache.org/job/maven-plugin-tools-m2/ws/maven-plugin-plugin/target/invoker-reports/BUILD-plugin-report.xml,>
<https://builds.apache.org/job/maven-plugin-tools-m2/ws/maven-plugin-plugin/target/invoker-reports/BUILD-annotation-with-inheritance-from-deps.xml,>
<https://builds.apache.org/job/maven-plugin-tools-m2/ws/maven-plugin-plugin/target/invoker-reports/BUILD-ant-since-maven-plugin.xml,>
<https://builds.apache.org/job/maven-plugin-tools-m2/ws/maven-plugin-plugin/target/invoker-reports/BUILD-annotation-with-inheritance.xml,>
<https://builds.apache.org/job/maven-plugin-tools-m2/ws/maven-plugin-plugin/target/invoker-reports/BUILD-source-encoding.xml,>
<https://builds.apache.org/job/maven-plugin-tools-m2/ws/maven-plugin-plugin/target/invoker-reports/BUILD-java-basic-annotations.xml,>
<https://builds.apache.org/job/maven-plugin-tools-m2/ws/maven-plugin-plugin/target/invoker-reports/BUILD-help-basic.xml,>
<https://builds.apache.org/job/maven-plugin-tools-m2/ws/maven-plugin-plugin/target/invoker-reports/BUILD-plugin-info-jdk-default-version.xml,>
<https://builds.apache.org/job/maven-plugin-tools-m2/ws/maven-plugin-plugin/target/invoker-reports/BUILD-ignore-plugin-class-realm.xml,>
<https://builds.apache.org/job/maven-plugin-tools-m2/ws/maven-plugin-plugin/target/invoker-reports/BUILD-fix-maven-since-3.x.xml]>
mavenInvokerResult:MavenInvokerResult{project='skip/pom.xml', name='', description='', result='success',
failureMessage='null', time=8.335, type='null', buildLog='null'}
mavenInvokerResult:MavenInvokerResult{project='java-basic/pom.xml', name='', description='',
result='success', failureMessage='null', time=7.569, type='null', buildLog='null'}
mavenInvokerResult:MavenInvokerResult{project='mplugin-187/pom.xml', name='', description='',
result='success', failureMessage='null', time=3.766, type='null', buildLog='null'}
mavenInvokerResult:MavenInvokerResult{project='ant-reference-parameter/pom.xml', name='',
description='', result='success', failureMessage='null', time=8.39, type='null', buildLog='null'}
mavenInvokerResult:MavenInvokerResult{project='help-package/pom.xml', name='', description='',
result='success', failureMessage='null', time=6.945, type='null', buildLog='null'}
mavenInvokerResult:MavenInvokerResult{project='annotation-with-inheritance-reactor/pom.xml',
name='', description='', result='success', failureMessage='null', time=11.118, type='null',
buildLog='null'}
mavenInvokerResult:MavenInvokerResult{project='ant-basic/pom.xml', name='', description='',
result='success', failureMessage='null', time=7.444, type='null', buildLog='null'}
mavenInvokerResult:MavenInvokerResult{project='plugin-report-annotations/pom.xml', name='',
description='', result='success', failureMessage='null', time=10.99, type='null', buildLog='null'}
mavenInvokerResult:MavenInvokerResult{project='ant-simple-usage/pom.xml', name='', description='',
result='success', failureMessage='null', time=6.373, type='null', buildLog='null'}
mavenInvokerResult:MavenInvokerResult{project='beanshell-simple/pom.xml', name='', description='',
result='success', failureMessage='null', time=5.924, type='null', buildLog='null'}
mavenInvokerResult:MavenInvokerResult{project='plugin-report/pom.xml', name='', description='',
result='success', failureMessage='null', time=28.395, type='null', buildLog='null'}
mavenInvokerResult:MavenInvokerResult{project='annotation-with-inheritance-from-deps/pom.xml',
name='', description='', result='success', failureMessage='null', time=14.736, type='null',
buildLog='null'}
mavenInvokerResult:MavenInvokerResult{project='ant-since-maven-plugin/pom.xml', name='', description='',
result='success', failureMessage='null', time=4.528, type='null', buildLog='null'}
mavenInvokerResult:MavenInvokerResult{project='annotation-with-inheritance/pom.xml', name='',
description='', result='success', failureMessage='null', time=16.741, type='null', buildLog='null'}
mavenInvokerResult:MavenInvokerResult{project='source-encoding/pom.xml', name='', description='',
result='success', failureMessage='null', time=5.537, type='null', buildLog='null'}
mavenInvokerResult:MavenInvokerResult{project='java-basic-annotations/pom.xml', name='', description='',
result='failure-build', failureMessage='The build exited with code 1. See <https://builds.apache.org/job/maven-plugin-tools-m2/ws/maven-plugin-plugin/target/it/java-basic-annotations/build.log>
for details.', time=11.332, type='null', buildLog='null'}
mavenInvokerResult:MavenInvokerResult{project='help-basic/pom.xml', name='', description='',
result='success', failureMessage='null', time=6.998, type='null', buildLog='null'}
mavenInvokerResult:MavenInvokerResult{project='plugin-info-jdk-default-version/pom.xml', name='',
description='', result='success', failureMessage='null', time=11.083, type='null', buildLog='null'}
mavenInvokerResult:MavenInvokerResult{project='ignore-plugin-class-realm/pom.xml', name='',
description='', result='success', failureMessage='null', time=8.623, type='null', buildLog='null'}
mavenInvokerResult:MavenInvokerResult{project='fix-maven-since-3.x/pom.xml', name='', description='',
result='skipped', failureMessage='null', time=0.0, type='null', buildLog='null'}
[JENKINS] Archiving <https://builds.apache.org/job/maven-plugin-tools-m2/ws/maven-plugin-plugin/pom.xml>
to /home/hudson/hudson/jobs/maven-plugin-tools-m2/modules/org.apache.maven.plugins$maven-plugin-plugin/builds/2012-11-02_19-48-02/archive/org.apache.maven.plugins/maven-plugin-plugin/3.2-SNAPSHOT/maven-plugin-plugin-3.2-SNAPSHOT.pom
[JENKINS] Archiving <https://builds.apache.org/job/maven-plugin-tools-m2/ws/maven-plugin-plugin/target/maven-plugin-plugin-3.2-SNAPSHOT.jar>
to /home/hudson/hudson/jobs/maven-plugin-tools-m2/modules/org.apache.maven.plugins$maven-plugin-plugin/builds/2012-11-02_19-48-02/archive/org.apache.maven.plugins/maven-plugin-plugin/3.2-SNAPSHOT/maven-plugin-plugin-3.2-SNAPSHOT.jar
[INFO] 
[INFO] 
[INFO] ------------------------------------------------------------------------
[INFO] Reactor Summary:
[INFO] ------------------------------------------------------------------------
[INFO] Maven Plugin Tools .................................... SUCCESS [14.202s]
[INFO] Maven Script Mojo Support ............................. SUCCESS [0.249s]
[INFO] Maven Ant Mojo Support ................................ SUCCESS [14.960s]
[INFO] Maven Beanshell Mojo Support .......................... SUCCESS [0.870s]
[INFO] Maven Plugin Tools APIs ............................... SUCCESS [2.092s]
[INFO] Maven Plugin Tools Generators ......................... SUCCESS [4.540s]
[INFO] Maven Plugin Tool for Java with Javadoc Tags .......... SUCCESS [3.060s]
[INFO] Maven Plugin Tools Javadoc ............................ SUCCESS [10.577s]
[INFO] Maven Plugin Java 5 Annotations ....................... SUCCESS [0.898s]
[INFO] Maven Plugin Tool for Annotations ..................... SUCCESS [5.532s]
[INFO] Maven Plugin Metadata Model ........................... SUCCESS [2.046s]
[INFO] Maven Plugin Tool for Ant ............................. SUCCESS [1.222s]
[INFO] Maven Plugin Tool for Beanshell ....................... SUCCESS [1.309s]
[INFO] Maven Plugin Plugin ................................... FAILED [3:28.491s]
[INFO] ------------------------------------------------------------------------
[INFO] Error for project: Maven Plugin Plugin (during install)
[INFO] ------------------------------------------------------------------------
[INFO] 1 build failed. See console output above for details.
[INFO] ------------------------------------------------------------------------
[INFO] Trace
org.apache.maven.BuildFailureException: 1 build failed. See console output above for details.
	at org.apache.maven.lifecycle.DefaultLifecycleExecutor.executeGoals(DefaultLifecycleExecutor.java:715)
	at org.apache.maven.lifecycle.DefaultLifecycleExecutor.executeGoalWithLifecycle(DefaultLifecycleExecutor.java:556)
	at org.apache.maven.lifecycle.DefaultLifecycleExecutor.executeGoal(DefaultLifecycleExecutor.java:535)
	at org.apache.maven.lifecycle.DefaultLifecycleExecutor.executeGoalAndHandleFailures(DefaultLifecycleExecutor.java:387)
	at org.apache.maven.lifecycle.DefaultLifecycleExecutor.executeTaskSegments(DefaultLifecycleExecutor.java:348)
	at org.apache.maven.lifecycle.DefaultLifecycleExecutor.execute(DefaultLifecycleExecutor.java:180)
	at org.apache.maven.lifecycle.LifecycleExecutorInterceptor.execute(LifecycleExecutorInterceptor.java:65)
	at org.apache.maven.DefaultMaven.doExecute(DefaultMaven.java:328)
	at org.apache.maven.DefaultMaven.execute(DefaultMaven.java:138)
	at org.apache.maven.cli.MavenCli.main(MavenCli.java:362)
	at sun.reflect.NativeMethodAccessorImpl.invoke0(Native Method)
	at sun.reflect.NativeMethodAccessorImpl.invoke(NativeMethodAccessorImpl.java:39)
	at sun.reflect.DelegatingMethodAccessorImpl.invoke(DelegatingMethodAccessorImpl.java:25)
	at java.lang.reflect.Method.invoke(Method.java:592)
	at org.codehaus.classworlds.Launcher.launchEnhanced(Launcher.java:315)
	at org.codehaus.classworlds.Launcher.launch(Launcher.java:255)
	at hudson.maven.agent.Main.launch(Main.java:185)
	at hudson.maven.MavenBuilder.call(MavenBuilder.java:151)
	at hudson.maven.Maven2Builder.call(Maven2Builder.java:77)
	at hudson.maven.Maven2Builder.call(Maven2Builder.java:53)
	at hudson.remoting.UserRequest.perform(UserRequest.java:118)
	at hudson.remoting.UserRequest.perform(UserRequest.java:48)
	at hudson.remoting.Request$2.run(Request.java:326)
	at hudson.remoting.InterceptingExecutorService$1.call(InterceptingExecutorService.java:72)
	at java.util.concurrent.FutureTask$Sync.innerRun(FutureTask.java:269)
	at java.util.concurrent.FutureTask.run(FutureTask.java:123)
	at java.util.concurrent.ThreadPoolExecutor$Worker.runTask(ThreadPoolExecutor.java:651)
	at java.util.concurrent.ThreadPoolExecutor$Worker.run(ThreadPoolExecutor.java:676)
	at java.lang.Thread.run(Thread.java:595)
Caused by: org.apache.maven.plugin.MojoFailureException: 1 build failed. See console output
above for details.
	at org.apache.maven.plugin.invoker.InvokerSession.handleFailures(InvokerSession.java:258)
	at org.apache.maven.plugin.invoker.InvokerMojo.processResults(InvokerMojo.java:59)
	at org.apache.maven.plugin.invoker.AbstractInvokerMojo.execute(AbstractInvokerMojo.java:692)
	at org.apache.maven.plugin.DefaultPluginManager.executeMojo(DefaultPluginManager.java:490)
	at hudson.maven.agent.PluginManagerInterceptor.executeMojo(PluginManagerInterceptor.java:182)
	at org.apache.maven.lifecycle.DefaultLifecycleExecutor.executeGoals(DefaultLifecycleExecutor.java:694)
	... 28 more
[INFO] ------------------------------------------------------------------------
[INFO] BUILD ERRORS
[INFO] ------------------------------------------------------------------------
[INFO] Total time: 4 minutes 49 seconds
[INFO] Finished at: Fri Nov 02 19:53:19 UTC 2012
[INFO] Final Memory: 101M/323M
[INFO] ------------------------------------------------------------------------
channel stopped

Mime
View raw message