maven-notifications mailing list archives

Site index · List index
Message view « Date » · « Thread »
Top « Date » · « Thread »
From Apache Jenkins Server <jenk...@builds.apache.org>
Subject Build failed in Jenkins: core-it-maven-3-win #191
Date Mon, 12 Nov 2012 21:45:32 GMT
See <https://builds.apache.org/job/core-it-maven-3-win/191/>

------------------------------------------
[...truncated 16836 lines...]
Downloading: http://repo1.maven.org/maven2/org/mortbay/jetty/servlet-api-2.5/6.1.14/servlet-api-2.5-6.1.14.pom
Downloaded: http://repo1.maven.org/maven2/org/mortbay/jetty/servlet-api-2.5/6.1.14/servlet-api-2.5-6.1.14.pom
(4 KB at 56.0 KB/sec)
Downloading: http://repo1.maven.org/maven2/org/apache/maven/wagon/wagon-webdav-jackrabbit/2.0/wagon-webdav-jackrabbit-2.0.pom
Downloaded: http://repo1.maven.org/maven2/org/apache/maven/wagon/wagon-webdav-jackrabbit/2.0/wagon-webdav-jackrabbit-2.0.pom
(5 KB at 55.1 KB/sec)
Downloading: http://repo1.maven.org/maven2/org/apache/maven/wagon/wagon-http-shared/2.0/wagon-http-shared-2.0.pom
Downloaded: http://repo1.maven.org/maven2/org/apache/maven/wagon/wagon-http-shared/2.0/wagon-http-shared-2.0.pom
(3 KB at 48.9 KB/sec)
Downloading: http://repo1.maven.org/maven2/org/apache/jackrabbit/jackrabbit-webdav/2.2.5/jackrabbit-webdav-2.2.5.pom
Downloaded: http://repo1.maven.org/maven2/org/apache/jackrabbit/jackrabbit-webdav/2.2.5/jackrabbit-webdav-2.2.5.pom
(4 KB at 43.4 KB/sec)
Downloading: http://repo1.maven.org/maven2/org/apache/jackrabbit/jackrabbit-parent/2.2.5/jackrabbit-parent-2.2.5.pom
Downloaded: http://repo1.maven.org/maven2/org/apache/jackrabbit/jackrabbit-parent/2.2.5/jackrabbit-parent-2.2.5.pom
(11 KB at 182.3 KB/sec)
Downloading: http://repo1.maven.org/maven2/org/apache/jackrabbit/parent/5/parent-5.pom
Downloaded: http://repo1.maven.org/maven2/org/apache/jackrabbit/parent/5/parent-5.pom (17
KB at 301.3 KB/sec)
Downloading: http://repo1.maven.org/maven2/org/apache/jackrabbit/jackrabbit-jcr-commons/2.2.5/jackrabbit-jcr-commons-2.2.5.pom
Downloaded: http://repo1.maven.org/maven2/org/apache/jackrabbit/jackrabbit-jcr-commons/2.2.5/jackrabbit-jcr-commons-2.2.5.pom
(3 KB at 47.0 KB/sec)
Downloading: http://repo1.maven.org/maven2/org/slf4j/slf4j-api/1.5.11/slf4j-api-1.5.11.pom
Downloaded: http://repo1.maven.org/maven2/org/slf4j/slf4j-api/1.5.11/slf4j-api-1.5.11.pom
(3 KB at 55.2 KB/sec)
Downloading: http://repo1.maven.org/maven2/org/slf4j/slf4j-parent/1.5.11/slf4j-parent-1.5.11.pom
Downloaded: http://repo1.maven.org/maven2/org/slf4j/slf4j-parent/1.5.11/slf4j-parent-1.5.11.pom
(9 KB at 143.3 KB/sec)
Downloading: http://repo1.maven.org/maven2/org/slf4j/jcl-over-slf4j/1.5.11/jcl-over-slf4j-1.5.11.pom
Downloaded: http://repo1.maven.org/maven2/org/slf4j/jcl-over-slf4j/1.5.11/jcl-over-slf4j-1.5.11.pom
(3 KB at 33.9 KB/sec)
Downloading: http://repo1.maven.org/maven2/org/slf4j/slf4j-api/1.6.1/slf4j-api-1.6.1.pom
Downloaded: http://repo1.maven.org/maven2/org/slf4j/slf4j-api/1.6.1/slf4j-api-1.6.1.pom (3
KB at 51.3 KB/sec)
Downloading: http://repo1.maven.org/maven2/org/slf4j/slf4j-parent/1.6.1/slf4j-parent-1.6.1.pom
Downloaded: http://repo1.maven.org/maven2/org/slf4j/slf4j-parent/1.6.1/slf4j-parent-1.6.1.pom
(10 KB at 162.6 KB/sec)
Downloading: http://repo1.maven.org/maven2/org/slf4j/slf4j-simple/1.6.1/slf4j-simple-1.6.1.pom
Downloaded: http://repo1.maven.org/maven2/org/slf4j/slf4j-simple/1.6.1/slf4j-simple-1.6.1.pom
(2 KB at 27.0 KB/sec)
Downloading: http://repo1.maven.org/maven2/org/codehaus/plexus/plexus-utils/1.5.8/plexus-utils-1.5.8.jar
Downloading: http://repo1.maven.org/maven2/org/mortbay/jetty/jetty/6.1.14/jetty-6.1.14.jar
Downloading: http://repo1.maven.org/maven2/junit/junit/4.8.2/junit-4.8.2.jar
Downloading: http://repo1.maven.org/maven2/org/apache/maven/shared/maven-verifier/1.3/maven-verifier-1.3.jar
Downloading: http://repo1.maven.org/maven2/org/mortbay/jetty/jetty-util/6.1.14/jetty-util-6.1.14.jar
Downloaded: http://repo1.maven.org/maven2/org/mortbay/jetty/jetty-util/6.1.14/jetty-util-6.1.14.jar
(160 KB at 627.2 KB/sec)
Downloading: http://repo1.maven.org/maven2/org/mortbay/jetty/servlet-api-2.5/6.1.14/servlet-api-2.5-6.1.14.jar
Downloaded: http://repo1.maven.org/maven2/junit/junit/4.8.2/junit-4.8.2.jar (232 KB at 905.4
KB/sec)
Downloading: http://repo1.maven.org/maven2/org/apache/maven/wagon/wagon-webdav-jackrabbit/2.0/wagon-webdav-jackrabbit-2.0.jar
Downloaded: http://repo1.maven.org/maven2/org/codehaus/plexus/plexus-utils/1.5.8/plexus-utils-1.5.8.jar
(262 KB at 944.3 KB/sec)
Downloading: http://repo1.maven.org/maven2/org/apache/maven/wagon/wagon-http-shared/2.0/wagon-http-shared-2.0.jar
Downloaded: http://repo1.maven.org/maven2/org/apache/maven/wagon/wagon-webdav-jackrabbit/2.0/wagon-webdav-jackrabbit-2.0.jar
(19 KB at 347.2 KB/sec)
Downloading: http://repo1.maven.org/maven2/commons-logging/commons-logging/1.1.1/commons-logging-1.1.1.jar
Downloaded: http://repo1.maven.org/maven2/org/apache/maven/wagon/wagon-http-shared/2.0/wagon-http-shared-2.0.jar
(26 KB at 441.7 KB/sec)
Downloading: http://repo1.maven.org/maven2/org/apache/jackrabbit/jackrabbit-webdav/2.2.5/jackrabbit-webdav-2.2.5.jar
Downloaded: http://repo1.maven.org/maven2/org/mortbay/jetty/jetty/6.1.14/jetty-6.1.14.jar
(505 KB at 1327.2 KB/sec)
Downloading: http://repo1.maven.org/maven2/org/apache/jackrabbit/jackrabbit-jcr-commons/2.2.5/jackrabbit-jcr-commons-2.2.5.jar
Downloaded: http://repo1.maven.org/maven2/org/mortbay/jetty/servlet-api-2.5/6.1.14/servlet-api-2.5-6.1.14.jar
(130 KB at 1017.8 KB/sec)
Downloading: http://repo1.maven.org/maven2/org/slf4j/jcl-over-slf4j/1.5.11/jcl-over-slf4j-1.5.11.jar
Downloaded: http://repo1.maven.org/maven2/commons-logging/commons-logging/1.1.1/commons-logging-1.1.1.jar
(60 KB at 740.8 KB/sec)
Downloading: http://repo1.maven.org/maven2/org/apache/maven/wagon/wagon-provider-api/2.0/wagon-provider-api-2.0.jar
Downloaded: http://repo1.maven.org/maven2/org/slf4j/jcl-over-slf4j/1.5.11/jcl-over-slf4j-1.5.11.jar
(17 KB at 307.0 KB/sec)
Downloading: http://repo1.maven.org/maven2/org/slf4j/slf4j-api/1.6.1/slf4j-api-1.6.1.jar
Downloaded: http://repo1.maven.org/maven2/org/apache/maven/wagon/wagon-provider-api/2.0/wagon-provider-api-2.0.jar
(52 KB at 593.9 KB/sec)
Downloading: http://repo1.maven.org/maven2/org/slf4j/slf4j-simple/1.6.1/slf4j-simple-1.6.1.jar
Downloaded: http://repo1.maven.org/maven2/org/apache/jackrabbit/jackrabbit-webdav/2.2.5/jackrabbit-webdav-2.2.5.jar
(282 KB at 1818.2 KB/sec)
Downloaded: http://repo1.maven.org/maven2/org/slf4j/slf4j-api/1.6.1/slf4j-api-1.6.1.jar (25
KB at 461.1 KB/sec)
Downloaded: http://repo1.maven.org/maven2/org/slf4j/slf4j-simple/1.6.1/slf4j-simple-1.6.1.jar
(8 KB at 138.7 KB/sec)
Downloaded: http://repo1.maven.org/maven2/org/apache/maven/shared/maven-verifier/1.3/maven-verifier-1.3.jar
(88 KB at 164.7 KB/sec)
Downloaded: http://repo1.maven.org/maven2/org/apache/jackrabbit/jackrabbit-jcr-commons/2.2.5/jackrabbit-jcr-commons-2.2.5.jar
(280 KB at 1793.5 KB/sec)
[INFO] 
[INFO] --- maven-clean-plugin:2.4.1:clean (default-clean) @ core-it-suite ---
[INFO] 
[INFO] --- maven-remote-resources-plugin:1.2.1:process (default) @ core-it-suite ---
[INFO] 
[INFO] --- maven-resources-plugin:2.5:resources (default-resources) @ core-it-suite ---
[debug] execute contextualize
[INFO] Using 'UTF-8' encoding to copy filtered resources.
[INFO] skip non existing resourceDirectory F:\hudson\hudson-slave\workspace\core-it-maven-3-win\core-integration-testing\core-it-suite\src\main\resources
[INFO] Copying 3 resources
[INFO] 
[INFO] --- maven-compiler-plugin:2.5.1:compile (default-compile) @ core-it-suite ---
[INFO] No sources to compile
[INFO] 
[INFO] --- maven-resources-plugin:2.5:testResources (default-testResources) @ core-it-suite
---
[debug] execute contextualize
[INFO] Using 'UTF-8' encoding to copy filtered resources.
[INFO] Copying 2722 resources
[INFO] Copying 2 resources
[INFO] Copying 3 resources
[INFO] 
[INFO] --- maven-compiler-plugin:2.5.1:testCompile (default-testCompile) @ core-it-suite ---
[INFO] Compiling 567 source files to F:\hudson\hudson-slave\workspace\core-it-maven-3-win\core-integration-testing\core-it-suite\target\test-classes
[INFO] 
[INFO] --- maven-surefire-plugin:2.12.3:test (default-test) @ core-it-suite ---
[WARNING] useSystemClassloader setting has no effect when not forking
[INFO] Surefire report directory: F:\hudson\hudson-slave\workspace\core-it-maven-3-win\core-integration-testing\core-it-suite\target\surefire-reports
Downloading: http://repo1.maven.org/maven2/org/apache/maven/surefire/surefire-junit4/2.12.3/surefire-junit4-2.12.3.pom
Downloaded: http://repo1.maven.org/maven2/org/apache/maven/surefire/surefire-junit4/2.12.3/surefire-junit4-2.12.3.pom
(3 KB at 27.4 KB/sec)
Downloading: http://repo1.maven.org/maven2/org/apache/maven/surefire/surefire-junit4/2.12.3/surefire-junit4-2.12.3.jar
Downloaded: http://repo1.maven.org/maven2/org/apache/maven/surefire/surefire-junit4/2.12.3/surefire-junit4-2.12.3.jar
(36 KB at 348.8 KB/sec)

-------------------------------------------------------
 T E S T S
-------------------------------------------------------
Running org.apache.maven.it.IntegrationTestSuite
Tests run: 1, Failures: 0, Errors: 1, Skipped: 0, Time elapsed: 0.048 sec <<< FAILURE!
initializationError(org.apache.maven.it.IntegrationTestSuite)  Time elapsed: 3 sec  <<<
ERROR!
org.apache.maven.it.VerificationException: Illegal maven output: String 'Maven version: '
not found in the following output:
The system cannot find the path specified.
	at org.apache.maven.it.Verifier.getMavenVersion(Verifier.java:1457)
	at org.apache.maven.it.IntegrationTestSuite.suite(IntegrationTestSuite.java:54)
	at sun.reflect.NativeMethodAccessorImpl.invoke0(Native Method)
	at sun.reflect.NativeMethodAccessorImpl.invoke(NativeMethodAccessorImpl.java:39)
	at sun.reflect.DelegatingMethodAccessorImpl.invoke(DelegatingMethodAccessorImpl.java:25)
	at java.lang.reflect.Method.invoke(Method.java:592)
	at org.junit.internal.runners.SuiteMethod.testFromSuiteMethod(SuiteMethod.java:34)
	at org.junit.internal.runners.SuiteMethod.<init>(SuiteMethod.java:23)
	at org.junit.internal.builders.SuiteMethodBuilder.runnerForClass(SuiteMethodBuilder.java:14)
	at org.junit.runners.model.RunnerBuilder.safeRunnerForClass(RunnerBuilder.java:57)
	at org.junit.internal.builders.AllDefaultPossibilitiesBuilder.runnerForClass(AllDefaultPossibilitiesBuilder.java:29)
	at org.junit.runners.model.RunnerBuilder.safeRunnerForClass(RunnerBuilder.java:57)
	at org.junit.internal.requests.ClassRequest.getRunner(ClassRequest.java:24)
	at org.apache.maven.surefire.junit4.JUnit4Provider.execute(JUnit4Provider.java:250)
	at org.apache.maven.surefire.junit4.JUnit4Provider.executeTestSet(JUnit4Provider.java:141)
	at org.apache.maven.surefire.junit4.JUnit4Provider.invoke(JUnit4Provider.java:112)
	at sun.reflect.NativeMethodAccessorImpl.invoke0(Native Method)
	at sun.reflect.NativeMethodAccessorImpl.invoke(NativeMethodAccessorImpl.java:39)
	at sun.reflect.DelegatingMethodAccessorImpl.invoke(DelegatingMethodAccessorImpl.java:25)
	at java.lang.reflect.Method.invoke(Method.java:592)
	at org.apache.maven.surefire.util.ReflectionUtils.invokeMethodWithArray(ReflectionUtils.java:189)
	at org.apache.maven.surefire.booter.ProviderFactory$ProviderProxy.invoke(ProviderFactory.java:165)
	at org.apache.maven.surefire.booter.ProviderFactory.invokeProvider(ProviderFactory.java:85)
	at org.apache.maven.plugin.surefire.InPluginVMSurefireStarter.runSuitesInProcess(InPluginVMSurefireStarter.java:80)
	at org.apache.maven.plugin.surefire.AbstractSurefireMojo.executeProvider(AbstractSurefireMojo.java:724)
	at org.apache.maven.plugin.surefire.AbstractSurefireMojo.executeAllProviders(AbstractSurefireMojo.java:682)
	at org.apache.maven.plugin.surefire.AbstractSurefireMojo.executeAfterPreconditionsChecked(AbstractSurefireMojo.java:648)
	at org.apache.maven.plugin.surefire.AbstractSurefireMojo.execute(AbstractSurefireMojo.java:586)
	at org.apache.maven.plugin.DefaultBuildPluginManager.executeMojo(DefaultBuildPluginManager.java:101)
	at org.apache.maven.lifecycle.internal.MojoExecutor.execute(MojoExecutor.java:209)
	at org.apache.maven.lifecycle.internal.MojoExecutor.execute(MojoExecutor.java:153)
	at org.apache.maven.lifecycle.internal.MojoExecutor.execute(MojoExecutor.java:145)
	at org.apache.maven.lifecycle.internal.LifecycleModuleBuilder.buildProject(LifecycleModuleBuilder.java:84)
	at org.apache.maven.lifecycle.internal.LifecycleModuleBuilder.buildProject(LifecycleModuleBuilder.java:59)
	at org.apache.maven.lifecycle.internal.LifecycleStarter.singleThreadedBuild(LifecycleStarter.java:183)
	at org.apache.maven.lifecycle.internal.LifecycleStarter.execute(LifecycleStarter.java:161)
	at org.apache.maven.DefaultMaven.doExecute(DefaultMaven.java:319)
	at org.apache.maven.DefaultMaven.execute(DefaultMaven.java:156)
	at org.apache.maven.cli.MavenCli.execute(MavenCli.java:537)
	at org.apache.maven.cli.MavenCli.doMain(MavenCli.java:196)
	at org.apache.maven.cli.MavenCli.main(MavenCli.java:141)
	at sun.reflect.NativeMethodAccessorImpl.invoke0(Native Method)
	at sun.reflect.NativeMethodAccessorImpl.invoke(NativeMethodAccessorImpl.java:39)
	at sun.reflect.DelegatingMethodAccessorImpl.invoke(DelegatingMethodAccessorImpl.java:25)
	at java.lang.reflect.Method.invoke(Method.java:592)
	at org.codehaus.plexus.classworlds.launcher.Launcher.launchEnhanced(Launcher.java:290)
	at org.codehaus.plexus.classworlds.launcher.Launcher.launch(Launcher.java:230)
	at org.codehaus.plexus.classworlds.launcher.Launcher.mainWithExitCode(Launcher.java:409)
	at org.codehaus.plexus.classworlds.launcher.Launcher.main(Launcher.java:352)


Results :

Tests in error: 
  initializationError(org.apache.maven.it.IntegrationTestSuite): Illegal maven output: String
'Maven version: ' not found in the following output:(..)

Tests run: 1, Failures: 0, Errors: 1, Skipped: 0

[INFO] ------------------------------------------------------------------------
[INFO] Reactor Summary:
[INFO] 
[INFO] Maven Core ITs .................................... SUCCESS [22.978s]
[INFO] Maven IT Support .................................. SUCCESS [0.062s]
[INFO] Maven IT :: Plugins ............................... SUCCESS [0.047s]
[INFO] Maven IT Plugin :: Active Collection .............. SUCCESS [11.966s]
[INFO] Maven IT Plugin :: Ant-Based ...................... SUCCESS [5.731s]
[INFO] Maven IT Plugin :: Artifact ....................... SUCCESS [1.606s]
[INFO] Maven IT Plugin :: Class Loader :: Dependency A ... SUCCESS [0.321s]
[INFO] Maven IT Plugin :: Class Loader :: Dependency B ... SUCCESS [0.457s]
[INFO] Maven IT Plugin :: Class Loader :: Dependency C ... SUCCESS [0.369s]
[INFO] Maven IT Plugin :: Class Loader ................... SUCCESS [2.406s]
[INFO] Maven IT Plugin :: Class Loader :: Aggregator ..... SUCCESS [0.041s]
[INFO] Maven IT Plugin :: Configuration .................. SUCCESS [1.076s]
[INFO] Maven IT Plugin :: Context Passing ................ SUCCESS [0.332s]
[INFO] Maven ITs :: Core Plugin Stubs .................... SUCCESS [0.036s]
[INFO] Maven IT Clean Plugin Stub ........................ SUCCESS [0.382s]
[INFO] Maven IT Compiler Plugin Stub ..................... SUCCESS [0.394s]
[INFO] Maven IT Deploy Plugin Stub ....................... SUCCESS [0.309s]
[INFO] Maven IT EAR Plugin Stub .......................... SUCCESS [0.344s]
[INFO] Maven IT EJB Plugin Stub .......................... SUCCESS [0.328s]
[INFO] Maven IT Install Plugin Stub ...................... SUCCESS [0.623s]
[INFO] Maven IT JAR Plugin Stub .......................... SUCCESS [0.446s]
[INFO] Maven IT Javadoc Plugin Stub ...................... SUCCESS [0.260s]
[INFO] Maven IT Plugin Plugin Stub ....................... SUCCESS [0.448s]
[INFO] Maven IT RAR Plugin Stub .......................... SUCCESS [0.223s]
[INFO] Maven IT Resources Plugin Stub .................... SUCCESS [0.273s]
[INFO] Maven IT Site Plugin Stub ......................... SUCCESS [0.383s]
[INFO] Maven IT Source Plugin Stub ....................... SUCCESS [0.427s]
[INFO] Maven IT Surefire Plugin Stub ..................... SUCCESS [0.314s]
[INFO] Maven IT WAR Plugin Stub .......................... SUCCESS [0.386s]
[INFO] Maven IT Plugin :: Dependency Collection .......... SUCCESS [3.869s]
[INFO] Maven IT Plugin :: Dependency Resolution .......... SUCCESS [6.802s]
[INFO] Maven IT Plugin :: Expression ..................... SUCCESS [0.808s]
[INFO] Maven IT Plugin :: Error Mojos .................... SUCCESS [2.221s]
[INFO] Maven IT Component ................................ SUCCESS [0.177s]
[INFO] Maven IT Plugin :: Extension Consumer ............. SUCCESS [0.403s]
[INFO] Maven IT Plugin :: Extension Provider ............. SUCCESS [0.224s]
[INFO] Maven IT Plugin :: Fork ........................... SUCCESS [0.325s]
[INFO] Maven IT Plugin :: Invalid Descriptor ............. SUCCESS [0.466s]
[INFO] Maven IT Plugin :: Log File ....................... SUCCESS [0.260s]
[INFO] Maven IT Plugin :: No Default Component ........... SUCCESS [0.247s]
[INFO] Maven IT Plugin :: No Project ..................... SUCCESS [0.199s]
[INFO] Maven IT Plugin :: Online ......................... SUCCESS [0.247s]
[INFO] Maven IT Plugin :: Optional Mojos ................. SUCCESS [0.507s]
[INFO] Maven IT Plugin :: Packaging ...................... SUCCESS [0.238s]
[INFO] Maven IT Plugin :: Parameter Implementation ....... SUCCESS [0.184s]
[INFO] Maven IT Plugin :: Plugin Dependency .............. SUCCESS [0.286s]
[INFO] Maven IT Plugin :: Project ........................ SUCCESS [0.317s]
[INFO] Maven IT Helper Library ........................... SUCCESS [1.638s]
[INFO] Maven IT Plugin :: Project Interpolation .......... SUCCESS [0.438s]
[INFO] Maven IT Plugin :: Setter ......................... SUCCESS [0.175s]
[INFO] Maven IT Plugin :: Singleton Component ............ SUCCESS [0.285s]
[INFO] Maven IT Plugin :: Site ........................... SUCCESS [0.541s]
[INFO] Maven IT Plugin :: Toolchain ...................... SUCCESS [4.764s]
[INFO] Maven IT Plugin :: Touch .......................... SUCCESS [0.606s]
[INFO] Maven IT Plugin :: Uses Properties Plugin ......... SUCCESS [0.218s]
[INFO] Maven IT Plugin :: Uses Wagon Plugin .............. SUCCESS [6.794s]
[INFO] Maven IT Plugin :: This plugin should contain the mojos needed by all tests.  SUCCESS
[0.221s]
[INFO] Maven IT Plugin :: Plexus Utils 1.1 ............... SUCCESS [0.153s]
[INFO] Maven IT Plugin :: Plexus Utils New ............... SUCCESS [0.373s]
[INFO] Maven IT Plugin :: Plexus Component API ........... SUCCESS [1.175s]
[INFO] Maven IT Plugin :: Log4J Client ................... SUCCESS [0.736s]
[INFO] Maven IT Plugin :: Extension 1 .................... SUCCESS [0.235s]
[INFO] Maven IT Plugin :: Extension 2 .................... SUCCESS [0.259s]
[INFO] Maven IT Plugin :: Plexus Lifecycle ............... SUCCESS [2.335s]
[INFO] Maven IT Plugin :: Settings ....................... SUCCESS [0.303s]
[INFO] Maven IT Toolchain ................................ SUCCESS [0.650s]
[INFO] Maven IT Wagon .................................... SUCCESS [0.273s]
[INFO] Maven IT Support Artifacts ........................ SUCCESS [2.322s]
[INFO] Maven IT Extension ................................ SUCCESS [0.083s]
[INFO] Maven ITs ......................................... FAILURE [1:51.347s]
[INFO] ------------------------------------------------------------------------
[INFO] BUILD FAILURE
[INFO] ------------------------------------------------------------------------
[INFO] Total time: 3:31.041s
[INFO] Finished at: Mon Nov 12 21:45:27 GMT 2012
[INFO] Final Memory: 70M/670M
[INFO] ------------------------------------------------------------------------
[ERROR] Failed to execute goal org.apache.maven.plugins:maven-surefire-plugin:2.12.3:test
(default-test) on project core-it-suite: There are test failures.
[ERROR] 
[ERROR] Please refer to F:\hudson\hudson-slave\workspace\core-it-maven-3-win\core-integration-testing\core-it-suite\target\surefire-reports
for the individual test results.
[ERROR] -> [Help 1]
[ERROR] 
[ERROR] To see the full stack trace of the errors, re-run Maven with the -e switch.
[ERROR] Re-run Maven using the -X switch to enable full debug logging.
[ERROR] 
[ERROR] For more information about the errors and possible solutions, please read the following
articles:
[ERROR] [Help 1] http://cwiki.apache.org/confluence/display/MAVEN/MojoFailureException
[ERROR] 
[ERROR] After correcting the problems, you can resume the build with the command
[ERROR]   mvn <goals> -rf :core-it-suite
Build step 'Invoke top-level Maven targets' marked build as failure
Recording test results

Mime
View raw message