maven-notifications mailing list archives

Site index · List index
Message view « Date » · « Thread »
Top « Date » · « Thread »
From Apache Jenkins Server <jenk...@builds.apache.org>
Subject Build failed in Jenkins: maven-plugins-ITs-m3.0.3 #15
Date Sat, 27 Oct 2012 01:04:18 GMT
See <https://builds.apache.org/job/maven-plugins-ITs-m3.0.3/15/changes>

Changes:

[dennisl] [MASSEMBLY-604] Please document <format>dir</format>
[MASSEMBLY-623] Assembly documentation does not list all supported formats

[dennisl] [MASSEMBLY-608] Missing XML tag <plugins> in example documentation

[dennisl] [MASSEMBLY-611] Documentation unclear in Usage > Configuration (part 2)

[dennisl] [MASSEMBLY-610] Documentation unclear in the Usage > Configuration section

------------------------------------------
[...truncated 10157 lines...]
 T E S T S
-------------------------------------------------------
Running org.apache.maven.plugins.shade.DefaultShaderTest
Tests run: 4, Failures: 0, Errors: 0, Skipped: 0, Time elapsed: 1.397 sec
Running org.apache.maven.plugins.shade.resource.ApacheLicenseResourceTransformerTest
Tests run: 1, Failures: 0, Errors: 0, Skipped: 0, Time elapsed: 0.004 sec
Running org.apache.maven.plugins.shade.resource.XmlAppendingTransformerTest
Tests run: 1, Failures: 0, Errors: 0, Skipped: 0, Time elapsed: 0.006 sec
Running org.apache.maven.plugins.shade.resource.AppendingTransformerTest
Tests run: 1, Failures: 0, Errors: 0, Skipped: 0, Time elapsed: 0 sec
Running org.apache.maven.plugins.shade.resource.ApacheNoticeResourceTransformerTest
Tests run: 1, Failures: 0, Errors: 0, Skipped: 0, Time elapsed: 0.001 sec
Running org.apache.maven.plugins.shade.resource.ComponentsXmlResourceTransformerTest
Tests run: 1, Failures: 0, Errors: 0, Skipped: 0, Time elapsed: 0.063 sec
Running org.apache.maven.plugins.shade.mojo.ShadeMojoTest
Tests run: 4, Failures: 0, Errors: 0, Skipped: 0, Time elapsed: 1.521 sec
Running org.apache.maven.plugins.shade.mojo.RelativizePathTest
Tests run: 1, Failures: 0, Errors: 0, Skipped: 0, Time elapsed: 0.016 sec
Running org.apache.maven.plugins.shade.mojo.ArtifactSelectorTest
Tests run: 1, Failures: 0, Errors: 0, Skipped: 0, Time elapsed: 0.002 sec
Running org.apache.maven.plugins.shade.mojo.ArtifactIdTest
Tests run: 2, Failures: 0, Errors: 0, Skipped: 0, Time elapsed: 0.002 sec
Running org.apache.maven.plugins.shade.filter.SimpleFilterTest
Tests run: 1, Failures: 0, Errors: 0, Skipped: 0, Time elapsed: 0 sec
Running org.apache.maven.plugins.shade.relocation.SimpleRelocatorTest
Tests run: 7, Failures: 0, Errors: 0, Skipped: 0, Time elapsed: 0.003 sec
Running org.apache.maven.plugins.shade.relocation.SimpleRelocatorParameterTest
Tests run: 2, Failures: 0, Errors: 0, Skipped: 0, Time elapsed: 0 sec

Results :

Tests run: 27, Failures: 0, Errors: 0, Skipped: 0

[INFO] 
[INFO] --- maven-jar-plugin:2.4:jar (default-jar) @ maven-shade-plugin ---
[INFO] Building jar: <https://builds.apache.org/job/maven-plugins-ITs-m3.0.3/ws/maven-shade-plugin/target/maven-shade-plugin-2.0.1-SNAPSHOT.jar>
[INFO] 
[INFO] --- maven-plugin-plugin:3.1:addPluginArtifactMetadata (default-addPluginArtifactMetadata)
@ maven-shade-plugin ---
[INFO] 
[INFO] --- maven-jar-plugin:2.4:test-jar (default) @ maven-shade-plugin ---
[INFO] Building jar: <https://builds.apache.org/job/maven-plugins-ITs-m3.0.3/ws/maven-shade-plugin/target/maven-shade-plugin-2.0.1-SNAPSHOT-tests.jar>
[INFO] 
[INFO] --- maven-invoker-plugin:1.6:install (integration-test) @ maven-shade-plugin ---
[INFO] Installing <https://builds.apache.org/job/maven-plugins-ITs-m3.0.3/ws/maven-shade-plugin/pom.xml>
to <https://builds.apache.org/job/maven-plugins-ITs-m3.0.3/ws/maven-shade-plugin/target/local-repo/org/apache/maven/plugins/maven-shade-plugin/2.0.1-SNAPSHOT/maven-shade-plugin-2.0.1-SNAPSHOT.pom>
[INFO] Installing <https://builds.apache.org/job/maven-plugins-ITs-m3.0.3/ws/maven-shade-plugin/target/maven-shade-plugin-2.0.1-SNAPSHOT.jar>
to <https://builds.apache.org/job/maven-plugins-ITs-m3.0.3/ws/maven-shade-plugin/target/local-repo/org/apache/maven/plugins/maven-shade-plugin/2.0.1-SNAPSHOT/maven-shade-plugin-2.0.1-SNAPSHOT.jar>
[INFO] Installing <https://builds.apache.org/job/maven-plugins-ITs-m3.0.3/ws/maven-shade-plugin/target/maven-shade-plugin-2.0.1-SNAPSHOT-tests.jar>
to <https://builds.apache.org/job/maven-plugins-ITs-m3.0.3/ws/maven-shade-plugin/target/local-repo/org/apache/maven/plugins/maven-shade-plugin/2.0.1-SNAPSHOT/maven-shade-plugin-2.0.1-SNAPSHOT-tests.jar>
[INFO] 
[INFO] --- maven-invoker-plugin:1.6:integration-test (integration-test) @ maven-shade-plugin
---
[INFO] Building: artifact-includes-excludes/pom.xml
[INFO] run script <https://builds.apache.org/job/maven-plugins-ITs-m3.0.3/ws/maven-shade-plugin/target/it/artifact-includes-excludes/verify.bsh>
[INFO] ..SUCCESS (4.4 s)
[INFO] Building: dep-reduced-pom-with-local-parent/pom.xml
[INFO] ..SUCCESS (3.6 s)
[INFO] Building: implicit-inclusion-of-project-artifact/pom.xml
[INFO] run script <https://builds.apache.org/job/maven-plugins-ITs-m3.0.3/ws/maven-shade-plugin/target/it/implicit-inclusion-of-project-artifact/verify.bsh>
[INFO] ..SUCCESS (4.0 s)
[INFO] Building: reloc-class-from-string-pool/pom.xml
[INFO] ..SUCCESS (3.4 s)
[INFO] Building: dep-reduced-pom-unique/pom.xml
[INFO] run script <https://builds.apache.org/job/maven-plugins-ITs-m3.0.3/ws/maven-shade-plugin/target/it/dep-reduced-pom-unique/verify.groovy>
[INFO] ..SUCCESS (3.9 s)
[INFO] Building: non-runtime-scope-excluded/pom.xml
[INFO] run script <https://builds.apache.org/job/maven-plugins-ITs-m3.0.3/ws/maven-shade-plugin/target/it/non-runtime-scope-excluded/verify.bsh>
[INFO] ..SUCCESS (3.9 s)
[INFO] Building: manifest-transformed/pom.xml
[INFO] run script <https://builds.apache.org/job/maven-plugins-ITs-m3.0.3/ws/maven-shade-plugin/target/it/manifest-transformed/verify.bsh>
[INFO] ..SUCCESS (7.7 s)
[INFO] Building: duplicate-classes-without-reloc/pom.xml
[INFO] ..SUCCESS (2.9 s)
[INFO] Building: mini-jar-respect-includes/pom.xml
[INFO] run script <https://builds.apache.org/job/maven-plugins-ITs-m3.0.3/ws/maven-shade-plugin/target/it/mini-jar-respect-includes/verify.bsh>
[INFO] ..SUCCESS (4.5 s)
[INFO] Building: pom-packaging/pom.xml
[INFO] run script <https://builds.apache.org/job/maven-plugins-ITs-m3.0.3/ws/maven-shade-plugin/target/it/pom-packaging/verify.bsh>
[INFO] ..SUCCESS (2.5 s)
[INFO] Building: xml-transformer-ignores-dtd/pom.xml
[INFO] run script <https://builds.apache.org/job/maven-plugins-ITs-m3.0.3/ws/maven-shade-plugin/target/it/xml-transformer-ignores-dtd/verify.bsh>
[INFO] ..SUCCESS (3.9 s)
[INFO] Building: empty-relocation-shaded-pattern/pom.xml
[INFO] ..SUCCESS (3.6 s)
[INFO] Building: mshade-123/pom.xml
[INFO] ..SUCCESS (5.5 s)
[INFO] Building: manifest-retained/pom.xml
[INFO] run script <https://builds.apache.org/job/maven-plugins-ITs-m3.0.3/ws/maven-shade-plugin/target/it/manifest-retained/verify.bsh>
[INFO] ..SUCCESS (4.6 s)
[INFO] Building: finalNameBuild/pom.xml
[INFO] run script <https://builds.apache.org/job/maven-plugins-ITs-m3.0.3/ws/maven-shade-plugin/target/it/finalNameBuild/setup.bsh>
[INFO] run script <https://builds.apache.org/job/maven-plugins-ITs-m3.0.3/ws/maven-shade-plugin/target/it/finalNameBuild/verify.bsh>
[INFO] ..SUCCESS (3.8 s)
[INFO] Building: finalNameShade/pom.xml
[INFO] run script <https://builds.apache.org/job/maven-plugins-ITs-m3.0.3/ws/maven-shade-plugin/target/it/finalNameShade/setup.bsh>
[INFO] run script <https://builds.apache.org/job/maven-plugins-ITs-m3.0.3/ws/maven-shade-plugin/target/it/finalNameShade/verify.bsh>
[INFO] ..SUCCESS (4.8 s)
[INFO] Building: reloc-abs-resource-path/pom.xml
[INFO] ..SUCCESS (5.5 s)
[INFO] Building: empty-apache-notice-transform/pom.xml
[INFO] ..SUCCESS (4.4 s)
[INFO] Building: services-resource-transformer/pom.xml
[INFO] run script <https://builds.apache.org/job/maven-plugins-ITs-m3.0.3/ws/maven-shade-plugin/target/it/services-resource-transformer/verify.bsh>
[INFO] ..SUCCESS (3.9 s)
[INFO] Building: mini-jar-package-info/pom.xml
[INFO] run script <https://builds.apache.org/job/maven-plugins-ITs-m3.0.3/ws/maven-shade-plugin/target/it/mini-jar-package-info/verify.bsh>
[INFO] ..SUCCESS (4.4 s)
[INFO] Building: rerun-without-reloc/pom.xml
[INFO] ..SUCCESS (3.7 s)
[INFO] Building: shadePomDependency/pom.xml
[INFO] ..SUCCESS (4.4 s)
[INFO] Building: reloc-includes-excludes/pom.xml
[INFO] run script <https://builds.apache.org/job/maven-plugins-ITs-m3.0.3/ws/maven-shade-plugin/target/it/reloc-includes-excludes/verify.bsh>
[INFO] ..SUCCESS (4.2 s)
[INFO] Building: finalNameShade-attached/pom.xml
[INFO] run script <https://builds.apache.org/job/maven-plugins-ITs-m3.0.3/ws/maven-shade-plugin/target/it/finalNameShade-attached/setup.bsh>
[INFO] run script <https://builds.apache.org/job/maven-plugins-ITs-m3.0.3/ws/maven-shade-plugin/target/it/finalNameShade-attached/verify.bsh>
[INFO] ..SUCCESS (3.8 s)
[INFO] Building: component-descriptor-relocation/pom.xml
[INFO] ..SUCCESS (4.5 s)
[INFO] Building: users-shader-impl/pom.xml
[INFO] run script <https://builds.apache.org/job/maven-plugins-ITs-m3.0.3/ws/maven-shade-plugin/target/it/users-shader-impl/verify.groovy>
[INFO] ..SUCCESS (4.4 s)
[INFO] Building: mini-jar-malformed-dependencies/pom.xml
[INFO] ..SUCCESS (7.0 s)
[INFO] Building: finalNameBuild-attached/pom.xml
[INFO] run script <https://builds.apache.org/job/maven-plugins-ITs-m3.0.3/ws/maven-shade-plugin/target/it/finalNameBuild-attached/setup.bsh>
[INFO] run script <https://builds.apache.org/job/maven-plugins-ITs-m3.0.3/ws/maven-shade-plugin/target/it/finalNameBuild-attached/verify.bsh>
[INFO] ..SUCCESS (3.9 s)
[INFO] Building: attach-after-lifecycle-fork/pom.xml
[INFO] run script <https://builds.apache.org/job/maven-plugins-ITs-m3.0.3/ws/maven-shade-plugin/target/it/attach-after-lifecycle-fork/setup.bsh>
[INFO] run script <https://builds.apache.org/job/maven-plugins-ITs-m3.0.3/ws/maven-shade-plugin/target/it/attach-after-lifecycle-fork/verify.bsh>
[INFO] ..SUCCESS (3.0 s)
[INFO] Building: empty-relocation-pattern/pom.xml
[INFO] ..SUCCESS (3.7 s)
[INFO] Building: mini-jar/pom.xml
[INFO] run script <https://builds.apache.org/job/maven-plugins-ITs-m3.0.3/ws/maven-shade-plugin/target/it/mini-jar/verify.bsh>
[INFO] ..SUCCESS (4.0 s)
[INFO] Building: reloc-anno/pom.xml
[INFO] ..SUCCESS (3.8 s)
[INFO] Building: MSHADE-105/pom.xml
[INFO] run script <https://builds.apache.org/job/maven-plugins-ITs-m3.0.3/ws/maven-shade-plugin/target/it/MSHADE-105/verify.bsh>
[INFO] ..SUCCESS (6.9 s)
[INFO] Building: dep-reduced-pom-relocated-result/pom.xml
[INFO] ..SUCCESS (2.8 s)
[INFO] Building: attached-artifact-type/pom.xml
[INFO] ..SUCCESS (3.0 s)
[INFO] Building: dep-reduced-pom/pom.xml
[INFO] run script <https://builds.apache.org/job/maven-plugins-ITs-m3.0.3/ws/maven-shade-plugin/target/it/dep-reduced-pom/verify.groovy>
[INFO] ..SUCCESS (3.7 s)
[INFO] Building: rerun-with-reloc/pom.xml
[INFO] ..SUCCESS (4.9 s)
[INFO] Building: duplicate-classes-with-reloc/pom.xml
[INFO] ..SUCCESS (2.8 s)
[INFO] Building: filter-artifact-contents/pom.xml
[INFO] run script <https://builds.apache.org/job/maven-plugins-ITs-m3.0.3/ws/maven-shade-plugin/target/it/filter-artifact-contents/verify.bsh>
[INFO] ..SUCCESS (3.7 s)
[INFO] Building: project-with-reactors-included/pom.xml
[INFO] run script <https://builds.apache.org/job/maven-plugins-ITs-m3.0.3/ws/maven-shade-plugin/target/it/project-with-reactors-included/verify.bsh>
[INFO] ..SUCCESS (5.1 s)
[INFO] Building: reloc-enum-ref-from-anno/pom.xml
[INFO] ..SUCCESS (3.7 s)
[INFO] 
[INFO] --- maven-invoker-plugin:1.6:verify (integration-test) @ maven-shade-plugin ---
[INFO] -------------------------------------------------
[INFO] Build Summary:
[INFO]   Passed: 41, Failed: 0, Errors: 0, Skipped: 0
[INFO] -------------------------------------------------
[INFO] 
[INFO] --- maven-install-plugin:2.3.1:install (default-install) @ maven-shade-plugin ---
[INFO] Installing <https://builds.apache.org/job/maven-plugins-ITs-m3.0.3/ws/maven-shade-plugin/target/maven-shade-plugin-2.0.1-SNAPSHOT.jar>
to /home/jenkins/.m2/repository/org/apache/maven/plugins/maven-shade-plugin/2.0.1-SNAPSHOT/maven-shade-plugin-2.0.1-SNAPSHOT.jar
[INFO] Installing <https://builds.apache.org/job/maven-plugins-ITs-m3.0.3/ws/maven-shade-plugin/pom.xml>
to /home/jenkins/.m2/repository/org/apache/maven/plugins/maven-shade-plugin/2.0.1-SNAPSHOT/maven-shade-plugin-2.0.1-SNAPSHOT.pom
[INFO] Installing <https://builds.apache.org/job/maven-plugins-ITs-m3.0.3/ws/maven-shade-plugin/target/maven-shade-plugin-2.0.1-SNAPSHOT-tests.jar>
to /home/jenkins/.m2/repository/org/apache/maven/plugins/maven-shade-plugin/2.0.1-SNAPSHOT/maven-shade-plugin-2.0.1-SNAPSHOT-tests.jar
[INFO]                                                                         
[INFO] ------------------------------------------------------------------------
[INFO] Building Maven Plugins Aggregator 1-SNAPSHOT
[INFO] ------------------------------------------------------------------------
[INFO] 
[INFO] --- maven-clean-plugin:2.4.1:clean (default-clean) @ maven-plugins-aggregator ---
[INFO] Deleting <https://builds.apache.org/job/maven-plugins-ITs-m3.0.3/ws/target>
[INFO] 
[INFO] --- maven-remote-resources-plugin:1.1:process (default) @ maven-plugins-aggregator
---
[INFO] 
[INFO] --- maven-install-plugin:2.3.1:install (default-install) @ maven-plugins-aggregator
---
[INFO] Installing <https://builds.apache.org/job/maven-plugins-ITs-m3.0.3/ws/pom.xml>
to /home/jenkins/.m2/repository/org/apache/maven/plugins/maven-plugins-aggregator/1-SNAPSHOT/maven-plugins-aggregator-1-SNAPSHOT.pom
[INFO] ------------------------------------------------------------------------
[INFO] Reactor Summary:
[INFO] 
[INFO] Maven Plugins ..................................... SUCCESS [2.830s]
[INFO] Maven ACR Plugin .................................. SUCCESS [20.242s]
[INFO] Maven Ant Plugin .................................. SUCCESS [1:01.922s]
[INFO] Maven AntRun Plugin ............................... SUCCESS [52.292s]
[INFO] Maven Eclipse Plugin .............................. SUCCESS [6:32.317s]
[INFO] Maven Assembly Plugin ............................. SUCCESS [10:59.761s]
[INFO] Maven Changelog Plugin ............................ SUCCESS [40.441s]
[INFO] Maven Changes Report Plugin ....................... SUCCESS [55.774s]
[INFO] Maven Checkstyle Plugin ........................... SUCCESS [1:34.961s]
[INFO] Maven Clean Plugin ................................ SUCCESS [18.986s]
[INFO] Maven Compiler Plugin ............................. SUCCESS [1:10.086s]
[INFO] Maven Dependency Plugin ........................... SUCCESS [2:43.393s]
[INFO] Maven Deploy Plugin ............................... SUCCESS [57.565s]
[INFO] Maven DOAP Plugin ................................. SUCCESS [16.737s]
[INFO] Maven Documentation Checker Plugin ................ SUCCESS [6.724s]
[INFO] Maven EAR Plugin .................................. SUCCESS [3:45.372s]
[INFO] Maven EJB Plugin .................................. SUCCESS [27.014s]
[INFO] Maven GPG Plugin .................................. SUCCESS [11.577s]
[INFO] Maven Help Plugin ................................. SUCCESS [37.181s]
[INFO] Maven IDEA Plugin ................................. SUCCESS [8.779s]
[INFO] Maven Install Plugin .............................. SUCCESS [43.916s]
[INFO] Maven JAR Plugin .................................. SUCCESS [1:14.668s]
[INFO] Maven Jarsigner Plugin ............................ SUCCESS [29.601s]
[INFO] Maven Javadoc Plugin .............................. SUCCESS [3:06.631s]
[INFO] Maven Linkcheck Plugin ............................ SUCCESS [2.450s]
[INFO] Maven One Plugin .................................. SUCCESS [1.659s]
[INFO] Maven Patch Plugin ................................ SUCCESS [12.542s]
[INFO] Maven PDF Plugin .................................. SUCCESS [33.556s]
[INFO] Maven PMD Plugin .................................. SUCCESS [36.483s]
[INFO] Maven RAR Plugin .................................. SUCCESS [10.911s]
[INFO] Maven Reactor Plugin .............................. SUCCESS [2.592s]
[INFO] Maven Repository Plugin ........................... SUCCESS [57.567s]
[INFO] Maven Resources Plugin ............................ SUCCESS [54.382s]
[INFO] Maven Site Plugin 3 ............................... SUCCESS [6:11.228s]
[INFO] Maven Source Plugin ............................... SUCCESS [42.685s]
[INFO] Maven Stage Plugin ................................ SUCCESS [2.724s]
[INFO] Maven Toolchains Plugin ........................... SUCCESS [1.695s]
[INFO] Maven Verifier Plugin ............................. SUCCESS [14.834s]
[INFO] Maven WAR Plugin .................................. SUCCESS [1:19.508s]
[INFO] SCM Publish Maven Plugin .......................... SUCCESS [1:14.342s]
[INFO] Maven Invoker Plugin .............................. FAILURE [4:10.330s]
[INFO] Maven Project Info Reports Plugin ................. SUCCESS [2:16.956s]
[INFO] Maven Remote Resources Plugin ..................... SUCCESS [52.429s]
[INFO] Maven Shade Plugin ................................ SUCCESS [3:03.331s]
[INFO] Maven Plugins Aggregator .......................... SUCCESS [0.017s]
[INFO] ------------------------------------------------------------------------
[INFO] BUILD FAILURE
[INFO] ------------------------------------------------------------------------
[INFO] Total time: 1:03:01.973s
[INFO] Finished at: Sat Oct 27 01:04:11 UTC 2012
[INFO] Final Memory: 99M/423M
[INFO] ------------------------------------------------------------------------
[WARNING] The requested profile "apache.snapshots" could not be activated because it does
not exist.
[ERROR] Failed to execute goal org.apache.maven.plugins:maven-invoker-plugin:1.5:verify (integration-test)
on project maven-invoker-plugin: 2 builds failed. -> [Help 1]
[ERROR] 
[ERROR] To see the full stack trace of the errors, re-run Maven with the -e switch.
[ERROR] Re-run Maven using the -X switch to enable full debug logging.
[ERROR] 
[ERROR] For more information about the errors and possible solutions, please read the following
articles:
[ERROR] [Help 1] http://cwiki.apache.org/confluence/display/MAVEN/MojoFailureException
[ERROR] 
[ERROR] After correcting the problems, you can resume the build with the command
[ERROR]   mvn <goals> -rf :maven-invoker-plugin
Build step 'Invoke top-level Maven targets' marked build as failure
Recording test results

Mime
View raw message