maven-notifications mailing list archives

Site index · List index
Message view « Date » · « Thread »
Top « Date » · « Thread »
From Apache Jenkins Server <jenk...@builds.apache.org>
Subject Build failed in Jenkins: maven-plugins-ITs-m2 #733
Date Wed, 05 Sep 2012 21:52:48 GMT
See <https://builds.apache.org/job/maven-plugins-ITs-m2/733/changes>

Changes:

[olamy] oups fix typo. I must use something else than vi sometimes :-)

[olamy] fix doc as the current one can cause failures

------------------------------------------
[...truncated 3520 lines...]
[INFO] No sources to compile
[INFO] [surefire:test {execution: default-test}]
[INFO] Surefire report directory: /x1/jenkins/jenkins-slave/workspace/maven-plugins-ITs-m2/maven-scm-publish-plugin/target/surefire-reports

-------------------------------------------------------
 T E S T S
-------------------------------------------------------

Results :

Tests run: 0, Failures: 0, Errors: 0, Skipped: 0

[INFO] ------------------------------------------------------------------------
[INFO] Building Maven Plugins Aggregator
[INFO]    task-segment: [clean, install]
[INFO] ------------------------------------------------------------------------
[INFO] [clean:clean {execution: default-clean}]
[INFO] Deleting /x1/jenkins/jenkins-slave/workspace/maven-plugins-ITs-m2/target
[INFO] [remote-resources:process {execution: default}]
[INFO] [site:attach-descriptor {execution: default-attach-descriptor}]
[INFO] [install:install {execution: default-install}]
[INFO] Installing /x1/jenkins/jenkins-slave/workspace/maven-plugins-ITs-m2/pom.xml to <https://builds.apache.org/job/maven-plugins-ITs-m2/ws/.repository/org/apache/maven/plugins/maven-plugins-aggregator/1-SNAPSHOT/maven-plugins-aggregator-1-SNAPSHOT.pom>
[INFO] 
[INFO] 
[INFO] ------------------------------------------------------------------------
[INFO] Reactor Summary:
[INFO] ------------------------------------------------------------------------
[INFO] Maven Plugins ......................................... SUCCESS [7.063s]
[INFO] Maven ACR Plugin ...................................... SUCCESS [26.991s]
[INFO] Maven Ant Plugin ...................................... SUCCESS [50.225s]
[INFO] Maven AntRun Plugin ................................... SUCCESS [34.821s]
[INFO] Maven Eclipse Plugin .................................. FAILED [41:55.055s]
[INFO] Maven Assembly Plugin ................................. FAILED [9.295s]
[INFO] Maven Changelog Plugin ................................ FAILED [2.613s]
[INFO] Maven Compiler Plugin ................................. FAILED [3.884s]
[INFO] Maven Changes Report Plugin ........................... SKIPPED (dependency build failed
or was skipped)
[INFO] Maven Checkstyle Plugin ............................... FAILED [3.524s]
[INFO] Maven Clean Plugin .................................... FAILED [1.121s]
[INFO] Maven Dependency Plugin ............................... FAILED [4.246s]
[INFO] Maven Deploy Plugin ................................... FAILED [2.924s]
[INFO] Maven DOAP Plugin ..................................... FAILED [2.910s]
[INFO] Maven Documentation Checker Plugin .................... FAILED [0.982s]
[INFO] Maven EAR Plugin ...................................... FAILED [4.820s]
[INFO] Maven EJB Plugin ...................................... FAILED [1.407s]
[INFO] Maven GPG Plugin ...................................... FAILED [0.673s]
[INFO] Maven Help Plugin ..................................... FAILED [1.480s]
[INFO] Maven IDEA Plugin ..................................... FAILED [2.111s]
[INFO] Maven Install Plugin .................................. FAILED [1.183s]
[INFO] Maven JAR Plugin ...................................... FAILED [1.433s]
[INFO] Maven Jarsigner Plugin ................................ FAILED [1.002s]
[INFO] Maven Javadoc Plugin .................................. FAILED [7.597s]
[INFO] Maven Linkcheck Plugin ................................ FAILED [1.401s]
[INFO] Maven One Plugin ...................................... FAILED [0.984s]
[INFO] Maven Patch Plugin .................................... FAILED [0.524s]
[INFO] Maven PDF Plugin ...................................... FAILED [5.615s]
[INFO] Maven PMD Plugin ...................................... FAILED [5.613s]
[INFO] Maven RAR Plugin ...................................... FAILED [1.490s]
[INFO] Maven Reactor Plugin .................................. FAILED [1.246s]
[INFO] Maven Repository Plugin ............................... FAILED [1.554s]
[INFO] Maven Resources Plugin ................................ SKIPPED (dependency build failed
or was skipped)
[INFO] Maven Site Plugin 3 ................................... FAILED [7.053s]
[INFO] Maven Source Plugin ................................... FAILED [1.637s]
[INFO] Maven Stage Plugin .................................... FAILED [0.983s]
[INFO] Maven Toolchains Plugin ............................... FAILED [0.769s]
[INFO] Maven Verifier Plugin ................................. FAILED [0.664s]
[INFO] Maven WAR Plugin ...................................... FAILED [2.654s]
[INFO] SCM Publish Maven Plugin .............................. FAILED [9.596s]
[INFO] Maven Plugins Aggregator .............................. SUCCESS [0.782s]
[INFO] ------------------------------------------------------------------------
[INFO] Error for project: Maven Eclipse Plugin (during install)
[INFO] ------------------------------------------------------------------------
[INFO] There are test failures.

Please refer to /x1/jenkins/jenkins-slave/workspace/maven-plugins-ITs-m2/maven-eclipse-plugin/target/failsafe-reports
for the individual test results.
[INFO] ------------------------------------------------------------------------
[INFO] Error for project: Maven Assembly Plugin (during install)
[INFO] ------------------------------------------------------------------------
[INFO] Error while executing forked tests.; nested exception is java.io.IOException: java.io.IOException:
Cannot allocate memory

[INFO] ------------------------------------------------------------------------
[INFO] Error for project: Maven Changelog Plugin (during install)
[INFO] ------------------------------------------------------------------------
[INFO] Error while executing forked tests.; nested exception is java.io.IOException: java.io.IOException:
Cannot allocate memory

[INFO] ------------------------------------------------------------------------
[INFO] Error for project: Maven Compiler Plugin (during install)
[INFO] ------------------------------------------------------------------------
[INFO] Error while executing forked tests.; nested exception is java.io.IOException: java.io.IOException:
Cannot allocate memory

[INFO] ------------------------------------------------------------------------
[INFO] Error for project: Maven Checkstyle Plugin (during install)
[INFO] ------------------------------------------------------------------------
[INFO] Error while executing forked tests.; nested exception is java.io.IOException: java.io.IOException:
Cannot allocate memory

[INFO] ------------------------------------------------------------------------
[INFO] Error for project: Maven Clean Plugin (during install)
[INFO] ------------------------------------------------------------------------
[INFO] Error while executing forked tests.; nested exception is java.io.IOException: java.io.IOException:
Cannot allocate memory

[INFO] ------------------------------------------------------------------------
[INFO] Error for project: Maven Dependency Plugin (during install)
[INFO] ------------------------------------------------------------------------
[INFO] Error while executing forked tests.; nested exception is java.io.IOException: java.io.IOException:
Cannot allocate memory

[INFO] ------------------------------------------------------------------------
[INFO] Error for project: Maven Deploy Plugin (during install)
[INFO] ------------------------------------------------------------------------
[INFO] Error while executing forked tests.; nested exception is java.io.IOException: java.io.IOException:
Cannot allocate memory

[INFO] ------------------------------------------------------------------------
[INFO] Error for project: Maven DOAP Plugin (during install)
[INFO] ------------------------------------------------------------------------
[INFO] Error while executing forked tests.; nested exception is java.io.IOException: java.io.IOException:
Cannot allocate memory

[INFO] ------------------------------------------------------------------------
[INFO] Error for project: Maven Documentation Checker Plugin (during install)
[INFO] ------------------------------------------------------------------------
[INFO] Error while executing forked tests.; nested exception is java.io.IOException: java.io.IOException:
Cannot allocate memory

[INFO] ------------------------------------------------------------------------
[INFO] Error for project: Maven EAR Plugin (during install)
[INFO] ------------------------------------------------------------------------
[INFO] Error while executing forked tests.; nested exception is java.io.IOException: java.io.IOException:
Cannot allocate memory

[INFO] ------------------------------------------------------------------------
[INFO] Error for project: Maven EJB Plugin (during install)
[INFO] ------------------------------------------------------------------------
[INFO] Error while executing forked tests.; nested exception is java.io.IOException: java.io.IOException:
Cannot allocate memory

[INFO] ------------------------------------------------------------------------
[INFO] Error for project: Maven GPG Plugin (during install)
[INFO] ------------------------------------------------------------------------
[INFO] Error while executing forked tests.; nested exception is java.io.IOException: java.io.IOException:
Cannot allocate memory

[INFO] ------------------------------------------------------------------------
[INFO] Error for project: Maven Help Plugin (during install)
[INFO] ------------------------------------------------------------------------
[INFO] Error while executing forked tests.; nested exception is java.io.IOException: java.io.IOException:
Cannot allocate memory

[INFO] ------------------------------------------------------------------------
[INFO] Error for project: Maven IDEA Plugin (during install)
[INFO] ------------------------------------------------------------------------
[INFO] Error while executing forked tests.; nested exception is java.io.IOException: java.io.IOException:
Cannot allocate memory

[INFO] ------------------------------------------------------------------------
[INFO] Error for project: Maven Install Plugin (during install)
[INFO] ------------------------------------------------------------------------
[INFO] Error while executing forked tests.; nested exception is java.io.IOException: java.io.IOException:
Cannot allocate memory

[INFO] ------------------------------------------------------------------------
[INFO] Error for project: Maven JAR Plugin (during install)
[INFO] ------------------------------------------------------------------------
[INFO] Error while executing forked tests.; nested exception is java.io.IOException: java.io.IOException:
Cannot allocate memory

[INFO] ------------------------------------------------------------------------
[INFO] Error for project: Maven Jarsigner Plugin (during install)
[INFO] ------------------------------------------------------------------------
[INFO] Error while executing forked tests.; nested exception is java.io.IOException: java.io.IOException:
Cannot allocate memory

[INFO] ------------------------------------------------------------------------
[INFO] Error for project: Maven Javadoc Plugin (during install)
[INFO] ------------------------------------------------------------------------
[INFO] Error while executing forked tests.; nested exception is java.io.IOException: java.io.IOException:
Cannot allocate memory

[INFO] ------------------------------------------------------------------------
[INFO] Error for project: Maven Linkcheck Plugin (during install)
[INFO] ------------------------------------------------------------------------
[INFO] Error while executing forked tests.; nested exception is java.io.IOException: java.io.IOException:
Cannot allocate memory

[INFO] ------------------------------------------------------------------------
[INFO] Error for project: Maven One Plugin (during install)
[INFO] ------------------------------------------------------------------------
[INFO] Error while executing forked tests.; nested exception is java.io.IOException: java.io.IOException:
Cannot allocate memory

[INFO] ------------------------------------------------------------------------
[INFO] Error for project: Maven Patch Plugin (during install)
[INFO] ------------------------------------------------------------------------
[INFO] Error while executing forked tests.; nested exception is java.io.IOException: java.io.IOException:
Cannot allocate memory

[INFO] ------------------------------------------------------------------------
[INFO] Error for project: Maven PDF Plugin (during install)
[INFO] ------------------------------------------------------------------------
[INFO] Error while executing forked tests.; nested exception is java.io.IOException: java.io.IOException:
Cannot allocate memory

[INFO] ------------------------------------------------------------------------
[INFO] Error for project: Maven PMD Plugin (during install)
[INFO] ------------------------------------------------------------------------
[INFO] Error while executing forked tests.; nested exception is java.io.IOException: java.io.IOException:
Cannot allocate memory

[INFO] ------------------------------------------------------------------------
[INFO] Error for project: Maven RAR Plugin (during install)
[INFO] ------------------------------------------------------------------------
[INFO] Error while executing forked tests.; nested exception is java.io.IOException: java.io.IOException:
Cannot allocate memory

[INFO] ------------------------------------------------------------------------
[INFO] Error for project: Maven Reactor Plugin (during install)
[INFO] ------------------------------------------------------------------------
[INFO] Error while executing forked tests.; nested exception is java.io.IOException: java.io.IOException:
Cannot allocate memory

[INFO] ------------------------------------------------------------------------
[INFO] Error for project: Maven Repository Plugin (during install)
[INFO] ------------------------------------------------------------------------
[INFO] Error while executing forked tests.; nested exception is java.io.IOException: java.io.IOException:
Cannot allocate memory

[INFO] ------------------------------------------------------------------------
[INFO] Error for project: Maven Site Plugin 3 (during install)
[INFO] ------------------------------------------------------------------------
[INFO] Error while executing forked tests.; nested exception is java.io.IOException: java.io.IOException:
Cannot allocate memory

[INFO] ------------------------------------------------------------------------
[INFO] Error for project: Maven Source Plugin (during install)
[INFO] ------------------------------------------------------------------------
[INFO] Error while executing forked tests.; nested exception is java.io.IOException: java.io.IOException:
Cannot allocate memory

[INFO] ------------------------------------------------------------------------
[INFO] Error for project: Maven Stage Plugin (during install)
[INFO] ------------------------------------------------------------------------
[INFO] Error while executing forked tests.; nested exception is java.io.IOException: java.io.IOException:
Cannot allocate memory

[INFO] ------------------------------------------------------------------------
[INFO] Error for project: Maven Toolchains Plugin (during install)
[INFO] ------------------------------------------------------------------------
[INFO] Error while executing forked tests.; nested exception is java.io.IOException: java.io.IOException:
Cannot allocate memory

[INFO] ------------------------------------------------------------------------
[INFO] Error for project: Maven Verifier Plugin (during install)
[INFO] ------------------------------------------------------------------------
[INFO] Error while executing forked tests.; nested exception is java.io.IOException: java.io.IOException:
Cannot allocate memory

[INFO] ------------------------------------------------------------------------
[INFO] Error for project: Maven WAR Plugin (during install)
[INFO] ------------------------------------------------------------------------
[INFO] Error while executing forked tests.; nested exception is java.io.IOException: java.io.IOException:
Cannot allocate memory

[INFO] ------------------------------------------------------------------------
[INFO] Error for project: SCM Publish Maven Plugin (during install)
[INFO] ------------------------------------------------------------------------
[INFO] Error while executing forked tests.; nested exception is java.io.IOException: java.io.IOException:
Cannot allocate memory

[INFO] ------------------------------------------------------------------------
[INFO] For more information, run Maven with the -e switch
[INFO] ------------------------------------------------------------------------
[INFO] BUILD ERRORS
[INFO] ------------------------------------------------------------------------
[INFO] Total time: 45 minutes 31 seconds
[INFO] Finished at: Wed Sep 05 21:52:47 GMT 2012
[INFO] Final Memory: 289M/1017M
[INFO] ------------------------------------------------------------------------
Build step 'Invoke top-level Maven targets' marked build as failure

Mime
View raw message