maven-notifications mailing list archives

Site index · List index
Message view « Date » · « Thread »
Top « Date » · « Thread »
From Apache Jenkins Server <jenk...@builds.apache.org>
Subject Build failed in Jenkins: doxia-tools » JDK 1.5 (latest),Ubuntu #31
Date Sat, 29 Sep 2012 02:13:29 GMT
See <https://builds.apache.org/job/doxia-tools/./jdk=JDK%201.5%20(latest),label=Ubuntu/31/changes>

Changes:

[dennisl] Update to released version of doxia-tools parent.

------------------------------------------
[...truncated 714 lines...]
location: class org.apache.maven.doxia.DefaultConverter
[INFO] 23 errors 
[INFO] -------------------------------------------------------------
[INFO] ------------------------------------------------------------------------
[INFO] Building Doxia Integration Tools
[INFO]    task-segment: [clean, install]
[INFO] ------------------------------------------------------------------------
[INFO] [clean:clean {execution: default-clean}]
[WARNING] The parameter expression: 'project.build.resources' used in mojo: 'process' has
been deprecated. Use 'project.resources' instead.
[INFO] [remote-resources:process {execution: default}]
Downloading: http://repo1.maven.org/maven2/org/apache/maven/shared/maven-plugin-testing-harness/1.0/maven-plugin-testing-harness-1.0.pom
5K downloaded  (maven-plugin-testing-harness-1.0.pom)
Downloading: http://repo1.maven.org/maven2/org/apache/maven/shared/maven-plugin-testing-harness/1.0/maven-plugin-testing-harness-1.0.jar
21K downloaded  (maven-plugin-testing-harness-1.0.jar)
[debug] execute contextualize
[INFO] [resources:resources {execution: default-resources}]
[INFO] Using 'UTF-8' encoding to copy filtered resources.
[INFO] Copying 26 resources
[INFO] Copying 3 resources
[INFO] [compiler:compile {execution: default-compile}]
[INFO] Compiling 5 source files to <https://builds.apache.org/job/doxia-tools/./jdk=JDK%201.5%20(latest),label=Ubuntu/ws/doxia-integration-tools/target/classes>
[INFO] [plexus-component-metadata:generate-metadata {execution: default}]
[INFO] Discovered 1 component descriptors(s)
[INFO] [plexus-component-metadata:generate-metadata {execution: create-component-descriptor}]
[INFO] Discovered 1 component descriptors(s)
[debug] execute contextualize
[INFO] [resources:testResources {execution: default-testResources}]
[INFO] Using 'UTF-8' encoding to copy filtered resources.
[INFO] Copying 3 resources
[INFO] Copying 3 resources
[INFO] [compiler:testCompile {execution: default-testCompile}]
[INFO] Compiling 3 source files to <https://builds.apache.org/job/doxia-tools/./jdk=JDK%201.5%20(latest),label=Ubuntu/ws/doxia-integration-tools/target/test-classes>
[INFO] [surefire:test {execution: default-test}]
[INFO] Surefire report directory: <https://builds.apache.org/job/doxia-tools/./jdk=JDK%201.5%20(latest),label=Ubuntu/ws/doxia-integration-tools/target/surefire-reports>

-------------------------------------------------------
 T E S T S
-------------------------------------------------------
Running org.apache.maven.doxia.tools.DefaultSiteToolTest
Tests run: 1, Failures: 0, Errors: 0, Skipped: 0, Time elapsed: 0.028 sec
Running org.apache.maven.doxia.tools.SiteToolTest
[INFO] artifact org.apache.maven.skins:maven-stylus-skin: checking for updates from central
[INFO] Unable to find resource 'org.apache.maven:maven-site:xml:site_en:1.0' in repository
central (http://repo1.maven.org/maven2)
Tests run: 7, Failures: 0, Errors: 0, Skipped: 0, Time elapsed: 2.077 sec

Results :

Tests run: 8, Failures: 0, Errors: 0, Skipped: 0

[INFO] [jar:jar {execution: default-jar}]
[INFO] Building jar: <https://builds.apache.org/job/doxia-tools/./jdk=JDK%201.5%20(latest),label=Ubuntu/ws/doxia-integration-tools/target/doxia-integration-tools-1.6-SNAPSHOT.jar>
[INFO] [install:install {execution: default-install}]
[INFO] Installing <https://builds.apache.org/job/doxia-tools/./jdk=JDK%201.5%20(latest),label=Ubuntu/ws/doxia-integration-tools/target/doxia-integration-tools-1.6-SNAPSHOT.jar>
to /home/jenkins/.m2/repository/org/apache/maven/doxia/doxia-integration-tools/1.6-SNAPSHOT/doxia-integration-tools-1.6-SNAPSHOT.jar
[INFO] ------------------------------------------------------------------------
[INFO] Building Doxia Linkcheck
[INFO]    task-segment: [clean, install]
[INFO] ------------------------------------------------------------------------
[INFO] [clean:clean {execution: default-clean}]
[INFO] [modello:java {execution: linkcheck}]
[INFO] outputDirectory: <https://builds.apache.org/job/doxia-tools/./jdk=JDK%201.5%20(latest),label=Ubuntu/ws/doxia-linkcheck/target/generated-sources/modello>
[INFO] Working on model: src/main/mdo/linkcheck.mdo
[INFO] Generating current version: 1.0.0
[INFO] [modello:xpp3-reader {execution: linkcheck}]
[INFO] outputDirectory: <https://builds.apache.org/job/doxia-tools/./jdk=JDK%201.5%20(latest),label=Ubuntu/ws/doxia-linkcheck/target/generated-sources/modello>
[INFO] Working on model: src/main/mdo/linkcheck.mdo
[INFO] Generating current version: 1.0.0
[INFO] [modello:xpp3-writer {execution: linkcheck}]
[INFO] outputDirectory: <https://builds.apache.org/job/doxia-tools/./jdk=JDK%201.5%20(latest),label=Ubuntu/ws/doxia-linkcheck/target/generated-sources/modello>
[INFO] Working on model: src/main/mdo/linkcheck.mdo
[INFO] Generating current version: 1.0.0
[INFO] [modello:java {execution: httpbean}]
[INFO] outputDirectory: <https://builds.apache.org/job/doxia-tools/./jdk=JDK%201.5%20(latest),label=Ubuntu/ws/doxia-linkcheck/target/generated-sources/modello>
[INFO] Working on model: src/main/mdo/httpbean.mdo
[INFO] Generating current version: 1.0.0
[WARNING] The parameter expression: 'project.build.resources' used in mojo: 'process' has
been deprecated. Use 'project.resources' instead.
[INFO] [remote-resources:process {execution: default}]
[debug] execute contextualize
[INFO] [resources:resources {execution: default-resources}]
[INFO] Using 'UTF-8' encoding to copy filtered resources.
[INFO] Copying 1 resource
[INFO] Copying 3 resources
[INFO] [compiler:compile {execution: default-compile}]
[INFO] Compiling 21 source files to <https://builds.apache.org/job/doxia-tools/./jdk=JDK%201.5%20(latest),label=Ubuntu/ws/doxia-linkcheck/target/classes>
[INFO] [plexus-component-metadata:generate-metadata {execution: default}]
[INFO] Discovered 1 component descriptors(s)
[debug] execute contextualize
[INFO] [resources:testResources {execution: default-testResources}]
[INFO] Using 'UTF-8' encoding to copy filtered resources.
[INFO] Copying 10 resources
[INFO] Copying 3 resources
[INFO] [compiler:testCompile {execution: default-testCompile}]
[INFO] Compiling 5 source files to <https://builds.apache.org/job/doxia-tools/./jdk=JDK%201.5%20(latest),label=Ubuntu/ws/doxia-linkcheck/target/test-classes>
[INFO] [surefire:test {execution: default-test}]
[INFO] Surefire report directory: <https://builds.apache.org/job/doxia-tools/./jdk=JDK%201.5%20(latest),label=Ubuntu/ws/doxia-linkcheck/target/surefire-reports>

-------------------------------------------------------
 T E S T S
-------------------------------------------------------
Running org.apache.maven.doxia.linkcheck.AnchorLinkTest
[ INFO] Begin to check links in files...
[ INFO] Links checked.
Tests run: 1, Failures: 0, Errors: 0, Skipped: 0, Time elapsed: 0.315 sec
Running org.apache.maven.doxia.linkcheck.LinkCheckTest
[ INFO] Begin to check links in files...
[ INFO] Links checked.
Tests run: 1, Failures: 0, Errors: 0, Skipped: 0, Time elapsed: 1.038 sec
Running org.apache.maven.doxia.linkcheck.validation.HTTPLinkValidatorTest
Tests run: 1, Failures: 0, Errors: 0, Skipped: 0, Time elapsed: 0.069 sec
Running org.apache.maven.doxia.linkcheck.validation.LinkValidatorManagerTest
Tests run: 1, Failures: 0, Errors: 0, Skipped: 0, Time elapsed: 0 sec
Running org.apache.maven.doxia.linkcheck.validation.AnchorsTest
Tests run: 1, Failures: 0, Errors: 0, Skipped: 0, Time elapsed: 0.001 sec

Results :

Tests run: 5, Failures: 0, Errors: 0, Skipped: 0

[INFO] [jar:jar {execution: default-jar}]
[INFO] Building jar: <https://builds.apache.org/job/doxia-tools/./jdk=JDK%201.5%20(latest),label=Ubuntu/ws/doxia-linkcheck/target/doxia-linkcheck-2.jar>
[INFO] [install:install {execution: default-install}]
[INFO] Installing <https://builds.apache.org/job/doxia-tools/./jdk=JDK%201.5%20(latest),label=Ubuntu/ws/doxia-linkcheck/target/doxia-linkcheck-2.jar>
to /home/jenkins/.m2/repository/org/apache/maven/doxia/doxia-linkcheck/2/doxia-linkcheck-2.jar
[INFO] ------------------------------------------------------------------------
[INFO] Building Doxia Tools Aggregator
[INFO]    task-segment: [clean, install]
[INFO] ------------------------------------------------------------------------
[INFO] [clean:clean {execution: default-clean}]
[WARNING] The parameter expression: 'project.build.resources' used in mojo: 'process' has
been deprecated. Use 'project.resources' instead.
[INFO] [remote-resources:process {execution: default}]
[INFO] [site:attach-descriptor {execution: default-attach-descriptor}]
[INFO] [install:install {execution: default-install}]
[INFO] Installing <https://builds.apache.org/job/doxia-tools/./jdk=JDK%201.5%20(latest),label=Ubuntu/ws/pom.xml>
to /home/jenkins/.m2/repository/org/apache/maven/doxia/doxia-tools-aggregator/1-SNAPSHOT/doxia-tools-aggregator-1-SNAPSHOT.pom
[INFO] 
[INFO] 
[INFO] ------------------------------------------------------------------------
[INFO] Reactor Summary:
[INFO] ------------------------------------------------------------------------
[INFO] Doxia Tools ........................................... SUCCESS [5.197s]
[INFO] Doxia Book Renderer ................................... SUCCESS [7.690s]
[INFO] Doxia Book Maven Plugin ............................... SUCCESS [7.187s]
[INFO] Doxia Converter ....................................... FAILED [8.069s]
[INFO] Doxia Integration Tools ............................... SUCCESS [3.793s]
[INFO] Doxia Linkcheck ....................................... SUCCESS [2.377s]
[INFO] Doxia Tools Aggregator ................................ SUCCESS [0.030s]
[INFO] ------------------------------------------------------------------------
[INFO] Error for project: Doxia Converter (during install)
[INFO] ------------------------------------------------------------------------
[INFO] Compilation failure

<https://builds.apache.org/job/doxia-tools/./jdk=JDK%201.5%20(latest),label=Ubuntu/ws/doxia-converter/src/main/java/org/apache/maven/doxia/DefaultConverter.java>:[52,27]
cannot find symbol
symbol  : class ContainerConfiguration
location: package org.codehaus.plexus
<https://builds.apache.org/job/doxia-tools/./jdk=JDK%201.5%20(latest),label=Ubuntu/ws/doxia-converter/src/main/java/org/apache/maven/doxia/DefaultConverter.java>:[53,27]
cannot find symbol
symbol  : class DefaultContainerConfiguration
location: package org.codehaus.plexus
<https://builds.apache.org/job/doxia-tools/./jdk=JDK%201.5%20(latest),label=Ubuntu/ws/doxia-converter/src/main/java/org/apache/maven/doxia/DefaultConverter.java>:[54,27]
cannot find symbol
symbol  : class DefaultPlexusContainer
location: package org.codehaus.plexus
<https://builds.apache.org/job/doxia-tools/./jdk=JDK%201.5%20(latest),label=Ubuntu/ws/doxia-converter/src/main/java/org/apache/maven/doxia/DefaultConverter.java>:[55,27]
cannot find symbol
symbol  : class PlexusContainer
location: package org.codehaus.plexus
<https://builds.apache.org/job/doxia-tools/./jdk=JDK%201.5%20(latest),label=Ubuntu/ws/doxia-converter/src/main/java/org/apache/maven/doxia/DefaultConverter.java>:[56,27]
cannot find symbol
symbol  : class PlexusContainerException
location: package org.codehaus.plexus
<https://builds.apache.org/job/doxia-tools/./jdk=JDK%201.5%20(latest),label=Ubuntu/ws/doxia-converter/src/main/java/org/apache/maven/doxia/DefaultConverter.java>:[57,58]
package org.codehaus.plexus.component.repository.exception does not exist
<https://builds.apache.org/job/doxia-tools/./jdk=JDK%201.5%20(latest),label=Ubuntu/ws/doxia-converter/src/main/java/org/apache/maven/doxia/DefaultConverter.java>:[129,12]
cannot find symbol
symbol  : class PlexusContainer
location: class org.apache.maven.doxia.DefaultConverter
<https://builds.apache.org/job/doxia-tools/./jdk=JDK%201.5%20(latest),label=Ubuntu/ws/doxia-converter/src/main/java/org/apache/maven/doxia/DefaultConverter.java>:[508,15]
cannot find symbol
symbol  : class PlexusContainerException
location: class org.apache.maven.doxia.DefaultConverter
<https://builds.apache.org/job/doxia-tools/./jdk=JDK%201.5%20(latest),label=Ubuntu/ws/doxia-converter/src/main/java/org/apache/maven/doxia/util/ConverterUtil.java>:[27,27]
cannot find symbol
symbol  : class PlexusContainer
location: package org.codehaus.plexus
<https://builds.apache.org/job/doxia-tools/./jdk=JDK%201.5%20(latest),label=Ubuntu/ws/doxia-converter/src/main/java/org/apache/maven/doxia/util/ConverterUtil.java>:[28,58]
package org.codehaus.plexus.component.repository.exception does not exist
<https://builds.apache.org/job/doxia-tools/./jdk=JDK%201.5%20(latest),label=Ubuntu/ws/doxia-converter/src/main/java/org/apache/maven/doxia/util/ConverterUtil.java>:[47,36]
cannot find symbol
symbol  : class PlexusContainer
location: class org.apache.maven.doxia.util.ConverterUtil
<https://builds.apache.org/job/doxia-tools/./jdk=JDK%201.5%20(latest),label=Ubuntu/ws/doxia-converter/src/main/java/org/apache/maven/doxia/util/ConverterUtil.java>:[48,15]
cannot find symbol
symbol  : class ComponentLookupException
location: class org.apache.maven.doxia.util.ConverterUtil
<https://builds.apache.org/job/doxia-tools/./jdk=JDK%201.5%20(latest),label=Ubuntu/ws/doxia-converter/src/main/java/org/apache/maven/doxia/util/ConverterUtil.java>:[93,46]
cannot find symbol
symbol  : class PlexusContainer
location: class org.apache.maven.doxia.util.ConverterUtil
<https://builds.apache.org/job/doxia-tools/./jdk=JDK%201.5%20(latest),label=Ubuntu/ws/doxia-converter/src/main/java/org/apache/maven/doxia/util/ConverterUtil.java>:[94,15]
cannot find symbol
symbol  : class ComponentLookupException
location: class org.apache.maven.doxia.util.ConverterUtil
<https://builds.apache.org/job/doxia-tools/./jdk=JDK%201.5%20(latest),label=Ubuntu/ws/doxia-converter/src/main/java/org/apache/maven/doxia/DefaultConverter.java>:[185,16]
cannot find symbol
symbol  : class PlexusContainerException
location: class org.apache.maven.doxia.DefaultConverter
<https://builds.apache.org/job/doxia-tools/./jdk=JDK%201.5%20(latest),label=Ubuntu/ws/doxia-converter/src/main/java/org/apache/maven/doxia/DefaultConverter.java>:[245,16]
cannot find symbol
symbol  : class PlexusContainerException
location: class org.apache.maven.doxia.DefaultConverter
<https://builds.apache.org/job/doxia-tools/./jdk=JDK%201.5%20(latest),label=Ubuntu/ws/doxia-converter/src/main/java/org/apache/maven/doxia/DefaultConverter.java>:[258,20]
cannot find symbol
symbol  : class ComponentLookupException
location: class org.apache.maven.doxia.DefaultConverter
<https://builds.apache.org/job/doxia-tools/./jdk=JDK%201.5%20(latest),label=Ubuntu/ws/doxia-converter/src/main/java/org/apache/maven/doxia/DefaultConverter.java>:[273,20]
cannot find symbol
symbol  : class ComponentLookupException
location: class org.apache.maven.doxia.DefaultConverter
<https://builds.apache.org/job/doxia-tools/./jdk=JDK%201.5%20(latest),label=Ubuntu/ws/doxia-converter/src/main/java/org/apache/maven/doxia/DefaultConverter.java>:[355,16]
cannot find symbol
symbol  : class ComponentLookupException
location: class org.apache.maven.doxia.DefaultConverter
<https://builds.apache.org/job/doxia-tools/./jdk=JDK%201.5%20(latest),label=Ubuntu/ws/doxia-converter/src/main/java/org/apache/maven/doxia/DefaultConverter.java>:[409,16]
cannot find symbol
symbol  : class ComponentLookupException
location: class org.apache.maven.doxia.DefaultConverter
<https://builds.apache.org/job/doxia-tools/./jdk=JDK%201.5%20(latest),label=Ubuntu/ws/doxia-converter/src/main/java/org/apache/maven/doxia/DefaultConverter.java>:[518,8]
cannot find symbol
symbol  : class ContainerConfiguration
location: class org.apache.maven.doxia.DefaultConverter
<https://builds.apache.org/job/doxia-tools/./jdk=JDK%201.5%20(latest),label=Ubuntu/ws/doxia-converter/src/main/java/org/apache/maven/doxia/DefaultConverter.java>:[518,60]
cannot find symbol
symbol  : class DefaultContainerConfiguration
location: class org.apache.maven.doxia.DefaultConverter
<https://builds.apache.org/job/doxia-tools/./jdk=JDK%201.5%20(latest),label=Ubuntu/ws/doxia-converter/src/main/java/org/apache/maven/doxia/DefaultConverter.java>:[522,21]
cannot find symbol
symbol  : class DefaultPlexusContainer
location: class org.apache.maven.doxia.DefaultConverter

[INFO] ------------------------------------------------------------------------
[INFO] Trace
org.apache.maven.BuildFailureException: Compilation failure
	at org.apache.maven.lifecycle.DefaultLifecycleExecutor.executeGoals(DefaultLifecycleExecutor.java:715)
	at org.apache.maven.lifecycle.DefaultLifecycleExecutor.executeGoalWithLifecycle(DefaultLifecycleExecutor.java:556)
	at org.apache.maven.lifecycle.DefaultLifecycleExecutor.executeGoal(DefaultLifecycleExecutor.java:535)
	at org.apache.maven.lifecycle.DefaultLifecycleExecutor.executeGoalAndHandleFailures(DefaultLifecycleExecutor.java:387)
	at org.apache.maven.lifecycle.DefaultLifecycleExecutor.executeTaskSegments(DefaultLifecycleExecutor.java:348)
	at org.apache.maven.lifecycle.DefaultLifecycleExecutor.execute(DefaultLifecycleExecutor.java:180)
	at org.apache.maven.DefaultMaven.doExecute(DefaultMaven.java:328)
	at org.apache.maven.DefaultMaven.execute(DefaultMaven.java:138)
	at org.apache.maven.cli.MavenCli.main(MavenCli.java:362)
	at org.apache.maven.cli.compat.CompatibleMain.main(CompatibleMain.java:60)
	at sun.reflect.NativeMethodAccessorImpl.invoke0(Native Method)
	at sun.reflect.NativeMethodAccessorImpl.invoke(NativeMethodAccessorImpl.java:39)
	at sun.reflect.DelegatingMethodAccessorImpl.invoke(DelegatingMethodAccessorImpl.java:25)
	at java.lang.reflect.Method.invoke(Method.java:592)
	at org.codehaus.classworlds.Launcher.launchEnhanced(Launcher.java:315)
	at org.codehaus.classworlds.Launcher.launch(Launcher.java:255)
	at org.codehaus.classworlds.Launcher.mainWithExitCode(Launcher.java:430)
	at org.codehaus.classworlds.Launcher.main(Launcher.java:375)
Caused by: org.apache.maven.plugin.CompilationFailureException: Compilation failure
	at org.apache.maven.plugin.AbstractCompilerMojo.execute(AbstractCompilerMojo.java:729)
	at org.apache.maven.plugin.CompilerMojo.execute(CompilerMojo.java:128)
	at org.apache.maven.plugin.DefaultPluginManager.executeMojo(DefaultPluginManager.java:490)
	at org.apache.maven.lifecycle.DefaultLifecycleExecutor.executeGoals(DefaultLifecycleExecutor.java:694)
	... 17 more
[INFO] ------------------------------------------------------------------------
[INFO] BUILD ERRORS
[INFO] ------------------------------------------------------------------------
[INFO] Total time: 34 seconds
[INFO] Finished at: Sat Sep 29 02:13:28 UTC 2012
[INFO] Final Memory: 76M/271M
[INFO] ------------------------------------------------------------------------
Build step 'Invoke top-level Maven targets' marked build as failure

Mime
View raw message