maven-notifications mailing list archives

Site index · List index
Message view « Date » · « Thread »
Top « Date » · « Thread »
From Apache Jenkins Server <jenk...@builds.apache.org>
Subject Build failed in Jenkins: maven-plugins #863
Date Wed, 01 Aug 2012 21:51:34 GMT
See <https://builds.apache.org/job/maven-plugins/863/changes>

Changes:

[hboutemy] [maven-release-plugin] prepare for next development iteration

[hboutemy] [maven-release-plugin] prepare release maven-project-info-reports-plugin-2.5

[hboutemy] updated released dependency

[hboutemy] [MDEP-98] improved error message to describe the real cause of the problem

[hboutemy] [MDEP-187] improved error message to describe the real cause of the problem

[hboutemy] fixed links

------------------------------------------
[...truncated 7882 lines...]
[INFO] Excluding de.zeigermann.xml:xml-im-exporter:jar:1.1 from the shaded jar.
[INFO] Excluding org.apache.maven.wagon:wagon-http-lightweight:jar:1.0-beta-2 from the shaded jar.
[INFO] Excluding org.apache.maven.wagon:wagon-http-shared:jar:1.0-beta-2 from the shaded jar.
[INFO] Excluding jtidy:jtidy:jar:4aug2000r7-dev from the shaded jar.
[INFO] Excluding xml-apis:xml-apis:jar:1.0.b2 from the shaded jar.
[INFO] Excluding org.apache.maven:maven-profile:jar:2.0.9 from the shaded jar.
[INFO] Excluding org.apache.maven:maven-repository-metadata:jar:2.0.9 from the shaded jar.
[INFO] Excluding org.apache.maven:maven-error-diagnostics:jar:2.0.9 from the shaded jar.
[INFO] Excluding commons-cli:commons-cli:jar:1.0 from the shaded jar.
[INFO] Excluding org.apache.maven.wagon:wagon-ssh-external:jar:1.0-beta-2 from the shaded jar.
[INFO] Excluding org.apache.maven.wagon:wagon-ssh-common:jar:1.0-beta-2 from the shaded jar.
[INFO] Excluding org.apache.maven:maven-plugin-descriptor:jar:2.0.9 from the shaded jar.
[INFO] Excluding org.codehaus.plexus:plexus-interactivity-api:jar:1.0-alpha-4 from the shaded jar.
[INFO] Excluding org.apache.maven:maven-monitor:jar:2.0.9 from the shaded jar.
[INFO] Excluding org.apache.maven.wagon:wagon-ssh:jar:1.0-beta-2 from the shaded jar.
[INFO] Excluding com.jcraft:jsch:jar:0.1.27 from the shaded jar.
[INFO] Excluding classworlds:classworlds:jar:1.1 from the shaded jar.
[INFO] Excluding org.apache.maven:maven-project:jar:2.0.9 from the shaded jar.
[INFO] Excluding org.apache.maven:maven-plugin-registry:jar:2.0.9 from the shaded jar.
[INFO] Excluding org.apache.maven:maven-model:jar:2.0.9 from the shaded jar.
[INFO] Excluding org.apache.maven:maven-settings:jar:2.0.9 from the shaded jar.
[INFO] Excluding org.apache.maven:maven-plugin-api:jar:2.0.9 from the shaded jar.
[INFO] Excluding org.apache.maven:maven-artifact:jar:2.0.9 from the shaded jar.
[INFO] Excluding org.apache.maven:maven-artifact-manager:jar:2.0.9 from the shaded jar.
[INFO] Excluding org.apache.maven.reporting:maven-reporting-api:jar:3.0 from the shaded jar.
[INFO] Excluding org.apache.maven:maven-archiver:jar:2.3 from the shaded jar.
[INFO] Excluding org.apache.maven.shared:maven-invoker:jar:2.0.9 from the shaded jar.
[INFO] Excluding org.apache.maven.shared:maven-common-artifact-filters:jar:1.3 from the shaded jar.
[INFO] Excluding org.apache.maven.doxia:doxia-sink-api:jar:1.0 from the shaded jar.
[INFO] Excluding org.apache.maven.doxia:doxia-site-renderer:jar:1.0 from the shaded jar.
[INFO] Excluding org.apache.maven.doxia:doxia-core:jar:1.0 from the shaded jar.
[INFO] Excluding org.codehaus.plexus:plexus-i18n:jar:1.0-beta-7 from the shaded jar.
[INFO] Excluding org.codehaus.plexus:plexus-velocity:jar:1.1.7 from the shaded jar.
[INFO] Excluding org.apache.velocity:velocity:jar:1.5 from the shaded jar.
[INFO] Excluding oro:oro:jar:2.0.8 from the shaded jar.
[INFO] Excluding org.apache.maven.doxia:doxia-decoration-model:jar:1.0 from the shaded jar.
[INFO] Excluding commons-collections:commons-collections:jar:3.2 from the shaded jar.
[INFO] Excluding org.apache.maven.doxia:doxia-module-apt:jar:1.0 from the shaded jar.
[INFO] Excluding org.apache.maven.doxia:doxia-module-fml:jar:1.0 from the shaded jar.
[INFO] Excluding org.apache.maven.doxia:doxia-module-xdoc:jar:1.0 from the shaded jar.
[INFO] Excluding org.apache.maven.doxia:doxia-module-xhtml:jar:1.0 from the shaded jar.
[INFO] Including org.apache.maven.wagon:wagon-provider-api:jar:1.0-beta-6 in the shaded jar.
[INFO] Excluding commons-lang:commons-lang:jar:2.4 from the shaded jar.
[INFO] Excluding commons-httpclient:commons-httpclient:jar:3.1 from the shaded jar.
[INFO] Excluding commons-codec:commons-codec:jar:1.2 from the shaded jar.
[INFO] Excluding commons-logging:commons-logging:jar:1.1.1 from the shaded jar.
[INFO] Excluding log4j:log4j:jar:1.2.14 from the shaded jar.
[INFO] Excluding com.thoughtworks.qdox:qdox:jar:1.12 from the shaded jar.
[INFO] Excluding org.codehaus.plexus:plexus-container-default:jar:1.0-alpha-9 from the shaded jar.
[INFO] Excluding org.codehaus.plexus:plexus-archiver:jar:1.0-alpha-9 from the shaded jar.
[INFO] Excluding org.codehaus.plexus:plexus-io:jar:1.0-alpha-1 from the shaded jar.
[INFO] Excluding org.apache.maven:maven-toolchain:jar:1.0 from the shaded jar.
[INFO] Excluding org.codehaus.plexus:plexus-utils:jar:1.5.8 from the shaded jar.
[INFO] Excluding org.mockito:mockito-core:jar:1.8.5 from the shaded jar.
[INFO] Excluding org.hamcrest:hamcrest-core:jar:1.1 from the shaded jar.
[INFO] Excluding org.objenesis:objenesis:jar:1.0 from the shaded jar.
[INFO] Replacing original artifact with shaded artifact.
[INFO] Replacing <https://builds.apache.org/job/maven-plugins/ws/maven-javadoc-plugin/target/maven-javadoc-plugin-2.8.2-SNAPSHOT.jar> with <https://builds.apache.org/job/maven-plugins/ws/maven-javadoc-plugin/target/maven-javadoc-plugin-2.8.2-SNAPSHOT-shaded.jar>
mojoSucceeded org.apache.maven.plugins:maven-shade-plugin:1.2.1(default)
mojoStarted org.apache.maven.plugins:maven-install-plugin:2.3.1(default-install)[INFO] Installing <https://builds.apache.org/job/maven-plugins/ws/maven-javadoc-plugin/target/maven-javadoc-plugin-2.8.2-SNAPSHOT.jar> to /home/jenkins/jenkins-slave/maven-repositories/0/org/apache/maven/plugins/maven-javadoc-plugin/2.8.2-SNAPSHOT/maven-javadoc-plugin-2.8.2-SNAPSHOT.jar
[INFO] Installing <https://builds.apache.org/job/maven-plugins/ws/maven-javadoc-plugin/pom.xml> to /home/jenkins/jenkins-slave/maven-repositories/0/org/apache/maven/plugins/maven-javadoc-plugin/2.8.2-SNAPSHOT/maven-javadoc-plugin-2.8.2-SNAPSHOT.pom

[INFO] 
[INFO] --- maven-install-plugin:2.3.1:install (default-install) @ maven-javadoc-plugin ---
mojoSucceeded org.apache.maven.plugins:maven-install-plugin:2.3.1(default-install)
projectSucceeded org.apache.maven.plugins:maven-javadoc-plugin:2.8.2-SNAPSHOT
sessionEnded
[INFO] ------------------------------------------------------------------------
[INFO] Reactor Summary:
[INFO] 
[INFO] Maven Plugins ..................................... SUCCESS [5.196s]
[INFO] Maven ACR Plugin .................................. SUCCESS [2.391s]
[INFO] Maven Ant Plugin .................................. SUCCESS [5.611s]
[INFO] Maven AntRun Plugin ............................... SUCCESS [2.649s]
[INFO] Maven Eclipse Plugin .............................. SUCCESS [11.761s]
[INFO] Maven Assembly Plugin ............................. SUCCESS [13.641s]
[INFO] Maven Changelog Plugin ............................ SUCCESS [5.737s]
[INFO] Maven Changes Report Plugin ....................... SUCCESS [8.673s]
[INFO] Maven Checkstyle Plugin ........................... SUCCESS [12.890s]
[INFO] Maven Clean Plugin ................................ SUCCESS [1.982s]
[INFO] Maven Compiler Plugin ............................. SUCCESS [4.620s]
[INFO] Maven Dependency Plugin ........................... SUCCESS [50.873s]
[INFO] Maven Deploy Plugin ............................... SUCCESS [3.052s]
[INFO] Maven DOAP Plugin ................................. SUCCESS [7.877s]
[INFO] Maven Documentation Checker Plugin ................ SUCCESS [1.901s]
[INFO] Maven EAR Plugin .................................. SUCCESS [3.625s]
[INFO] Maven EJB Plugin .................................. SUCCESS [4.725s]
[INFO] Maven GPG Plugin .................................. SUCCESS [1.643s]
[INFO] Maven Help Plugin ................................. SUCCESS [3.537s]
[INFO] Maven IDEA Plugin ................................. SUCCESS [13.690s]
[INFO] Maven Install Plugin .............................. SUCCESS [3.319s]
[INFO] Maven JAR Plugin .................................. SUCCESS [2.713s]
[INFO] Maven Jarsigner Plugin ............................ SUCCESS [1.527s]
[INFO] Maven Javadoc Plugin .............................. SUCCESS [1:34.341s]
[INFO] Maven Linkcheck Plugin ............................ SUCCESS [2.446s]
[INFO] Maven One Plugin .................................. SUCCESS [2.314s]
[INFO] Maven Patch Plugin ................................ SUCCESS [1.258s]
[INFO] Maven PDF Plugin .................................. SUCCESS [11.585s]
[INFO] Maven PMD Plugin .................................. SUCCESS [8.777s]
[INFO] Maven RAR Plugin .................................. SUCCESS [2.793s]
[INFO] Maven Reactor Plugin .............................. SUCCESS [2.524s]
[INFO] Maven Repository Plugin ........................... SUCCESS [2.797s]
[INFO] Maven Resources Plugin ............................ SUCCESS [3.742s]
[INFO] Maven Site Plugin 3 ............................... SUCCESS [8.795s]
[INFO] Maven Source Plugin ............................... SUCCESS [3.768s]
[INFO] Maven Stage Plugin ................................ SUCCESS [1.950s]
[INFO] Maven Toolchains Plugin ........................... SUCCESS [1.796s]
[INFO] Maven Verifier Plugin ............................. SUCCESS [1.575s]
[INFO] Maven WAR Plugin .................................. SUCCESS [10.640s]
[INFO] Maven Invoker Plugin .............................. SUCCESS [6.918s]
[INFO] Maven Project Info Reports Plugin ................. FAILURE [1.823s]
[INFO] Maven Remote Resources Plugin ..................... SUCCESS [3.689s]
[INFO] Maven Shade Plugin ................................ SUCCESS [5.693s]
[INFO] Maven Plugins Aggregator .......................... SUCCESS [0.269s]
[INFO] ------------------------------------------------------------------------
[INFO] BUILD FAILURE
[INFO] ------------------------------------------------------------------------
[INFO] Total time: 2:35.613s (Wall Clock)
[INFO] Finished at: Wed Aug 01 21:51:21 GMT 2012
[INFO] Final Memory: 81M/563M
[INFO] ------------------------------------------------------------------------
Projects to build: [MavenProject: org.apache.maven.plugins:maven-plugins:23-SNAPSHOT @ <https://builds.apache.org/job/maven-plugins/ws/maven-plugins/pom.xml,> MavenProject: org.apache.maven.plugins:maven-acr-plugin:1.0.1-SNAPSHOT @ <https://builds.apache.org/job/maven-plugins/ws/maven-acr-plugin/pom.xml,> MavenProject: org.apache.maven.plugins:maven-ant-plugin:2.4-SNAPSHOT @ <https://builds.apache.org/job/maven-plugins/ws/maven-ant-plugin/pom.xml,> MavenProject: org.apache.maven.plugins:maven-antrun-plugin:1.8-SNAPSHOT @ <https://builds.apache.org/job/maven-plugins/ws/maven-antrun-plugin/pom.xml,> MavenProject: org.apache.maven.plugins:maven-eclipse-plugin:2.10-SNAPSHOT @ <https://builds.apache.org/job/maven-plugins/ws/maven-eclipse-plugin/pom.xml,> MavenProject: org.apache.maven.plugins:maven-assembly-plugin:2.4-SNAPSHOT @ <https://builds.apache.org/job/maven-plugins/ws/maven-assembly-plugin/pom.xml,> MavenProject: org.apache.maven.plugins:maven-changelog-plugin:2.3-SNAPSHOT @ <https://builds.apache.org/job/maven-plugins/ws/maven-changelog-plugin/pom.xml,> MavenProject: org.apache.maven.plugins:maven-changes-plugin:2.8-SNAPSHOT @ <https://builds.apache.org/job/maven-plugins/ws/maven-changes-plugin/pom.xml,> MavenProject: org.apache.maven.plugins:maven-checkstyle-plugin:2.10-SNAPSHOT @ <https://builds.apache.org/job/maven-plugins/ws/maven-checkstyle-plugin/pom.xml,> MavenProject: org.apache.maven.plugins:maven-clean-plugin:2.6-SNAPSHOT @ <https://builds.apache.org/job/maven-plugins/ws/maven-clean-plugin/pom.xml,> MavenProject: org.apache.maven.plugins:maven-compiler-plugin:2.6-SNAPSHOT @ <https://builds.apache.org/job/maven-plugins/ws/maven-compiler-plugin/pom.xml,> MavenProject: org.apache.maven.plugins:maven-dependency-plugin:2.5-SNAPSHOT @ <https://builds.apache.org/job/maven-plugins/ws/maven-dependency-plugin/pom.xml,> MavenProject: org.apache.maven.plugins:maven-deploy-plugin:2.8-SNAPSHOT @ <https://builds.apache.org/job/maven-plugins/ws/maven-deploy-plugin/pom.xml,> MavenProject: org.apache.maven.plugins:maven-doap-plugin:1.2-SNAPSHOT @ <https://builds.apache.org/job/maven-plugins/ws/maven-doap-plugin/pom.xml,> MavenProject: org.apache.maven.plugins:maven-docck-plugin:1.1-SNAPSHOT @ <https://builds.apache.org/job/maven-plugins/ws/maven-docck-plugin/pom.xml,> MavenProject: org.apache.maven.plugins:maven-ear-plugin:2.8-SNAPSHOT @ <https://builds.apache.org/job/maven-plugins/ws/maven-ear-plugin/pom.xml,> MavenProject: org.apache.maven.plugins:maven-ejb-plugin:2.4-SNAPSHOT @ <https://builds.apache.org/job/maven-plugins/ws/maven-ejb-plugin/pom.xml,> MavenProject: org.apache.maven.plugins:maven-gpg-plugin:1.5-SNAPSHOT @ <https://builds.apache.org/job/maven-plugins/ws/maven-gpg-plugin/pom.xml,> MavenProject: org.apache.maven.plugins:maven-help-plugin:2.2-SNAPSHOT @ <https://builds.apache.org/job/maven-plugins/ws/maven-help-plugin/pom.xml,> MavenProject: org.apache.maven.plugins:maven-idea-plugin:2.3-SNAPSHOT @ <https://builds.apache.org/job/maven-plugins/ws/maven-idea-plugin/pom.xml,> MavenProject: org.apache.maven.plugins:maven-install-plugin:2.4-SNAPSHOT @ <https://builds.apache.org/job/maven-plugins/ws/maven-install-plugin/pom.xml,> MavenProject: org.apache.maven.plugins:maven-jar-plugin:2.5-SNAPSHOT @ <https://builds.apache.org/job/maven-plugins/ws/maven-jar-plugin/pom.xml,> MavenProject: org.apache.maven.plugins:maven-jarsigner-plugin:1.3-SNAPSHOT @ <https://builds.apache.org/job/maven-plugins/ws/maven-jarsigner-plugin/pom.xml,> MavenProject: org.apache.maven.plugins:maven-javadoc-plugin:2.8.2-SNAPSHOT @ <https://builds.apache.org/job/maven-plugins/ws/maven-javadoc-plugin/pom.xml,> MavenProject: org.apache.maven.plugins:maven-linkcheck-plugin:1.2-SNAPSHOT @ <https://builds.apache.org/job/maven-plugins/ws/maven-linkcheck-plugin/pom.xml,> MavenProject: org.apache.maven.plugins:maven-one-plugin:1.3-SNAPSHOT @ <https://builds.apache.org/job/maven-plugins/ws/maven-one-plugin/pom.xml,> MavenProject: org.apache.maven.plugins:maven-patch-plugin:1.1.2-SNAPSHOT @ <https://builds.apache.org/job/maven-plugins/ws/maven-patch-plugin/pom.xml,> MavenProject: org.apache.maven.plugins:maven-pdf-plugin:1.2-SNAPSHOT @ <https://builds.apache.org/job/maven-plugins/ws/maven-pdf-plugin/pom.xml,> MavenProject: org.apache.maven.plugins:maven-pmd-plugin:2.8-SNAPSHOT @ <https://builds.apache.org/job/maven-plugins/ws/maven-pmd-plugin/pom.xml,> MavenProject: org.apache.maven.plugins:maven-rar-plugin:2.3-SNAPSHOT @ <https://builds.apache.org/job/maven-plugins/ws/maven-rar-plugin/pom.xml,> MavenProject: org.apache.maven.plugins:maven-reactor-plugin:1.1-SNAPSHOT @ <https://builds.apache.org/job/maven-plugins/ws/maven-reactor-plugin/pom.xml,> MavenProject: org.apache.maven.plugins:maven-repository-plugin:2.3.3-SNAPSHOT @ <https://builds.apache.org/job/maven-plugins/ws/maven-repository-plugin/pom.xml,> MavenProject: org.apache.maven.plugins:maven-resources-plugin:2.6-SNAPSHOT @ <https://builds.apache.org/job/maven-plugins/ws/maven-resources-plugin/pom.xml,> MavenProject: org.apache.maven.plugins:maven-site-plugin:3.2-SNAPSHOT @ <https://builds.apache.org/job/maven-plugins/ws/maven-site-plugin/dependency-reduced-pom.xml,> MavenProject: org.apache.maven.plugins:maven-source-plugin:2.2-SNAPSHOT @ <https://builds.apache.org/job/maven-plugins/ws/maven-source-plugin/pom.xml,> MavenProject: org.apache.maven.plugins:maven-stage-plugin:1.0-alpha-3-SNAPSHOT @ <https://builds.apache.org/job/maven-plugins/ws/maven-stage-plugin/pom.xml,> MavenProject: org.apache.maven.plugins:maven-toolchains-plugin:1.1-SNAPSHOT @ <https://builds.apache.org/job/maven-plugins/ws/maven-toolchains-plugin/pom.xml,> MavenProject: org.apache.maven.plugins:maven-verifier-plugin:1.1-SNAPSHOT @ <https://builds.apache.org/job/maven-plugins/ws/maven-verifier-plugin/pom.xml,> MavenProject: org.apache.maven.plugins:maven-war-plugin:2.3-SNAPSHOT @ <https://builds.apache.org/job/maven-plugins/ws/maven-war-plugin/pom.xml,> MavenProject: org.apache.maven.plugins:maven-invoker-plugin:1.7-SNAPSHOT @ <https://builds.apache.org/job/maven-plugins/ws/maven-invoker-plugin/pom.xml,> MavenProject: org.apache.maven.plugins:maven-project-info-reports-plugin:2.6-SNAPSHOT @ <https://builds.apache.org/job/maven-plugins/ws/maven-project-info-reports-plugin/pom.xml,> MavenProject: org.apache.maven.plugins:maven-remote-resources-plugin:1.4-SNAPSHOT @ <https://builds.apache.org/job/maven-plugins/ws/maven-remote-resources-plugin/pom.xml,> MavenProject: org.apache.maven.plugins:maven-shade-plugin:2.0-SNAPSHOT @ <https://builds.apache.org/job/maven-plugins/ws/maven-shade-plugin/pom.xml,> MavenProject: org.apache.maven.plugins:maven-plugins-aggregator:1-SNAPSHOT @ <https://builds.apache.org/job/maven-plugins/ws/pom.xml]>
[JENKINS] Archiving <https://builds.apache.org/job/maven-plugins/ws/maven-war-plugin/pom.xml> to /home/hudson/hudson/jobs/maven-plugins/modules/org.apache.maven.plugins$maven-war-plugin/builds/2012-08-01_21-48-41/archive/org.apache.maven.plugins/maven-war-plugin/2.3-SNAPSHOT/maven-war-plugin-2.3-SNAPSHOT.pom
[JENKINS] Archiving <https://builds.apache.org/job/maven-plugins/ws/maven-war-plugin/target/maven-war-plugin-2.3-SNAPSHOT.jar> to /home/hudson/hudson/jobs/maven-plugins/modules/org.apache.maven.plugins$maven-war-plugin/builds/2012-08-01_21-48-41/archive/org.apache.maven.plugins/maven-war-plugin/2.3-SNAPSHOT/maven-war-plugin-2.3-SNAPSHOT.jar
[JENKINS] Archiving <https://builds.apache.org/job/maven-plugins/ws/maven-docck-plugin/pom.xml> to /home/hudson/hudson/jobs/maven-plugins/modules/org.apache.maven.plugins$maven-docck-plugin/builds/2012-08-01_21-48-41/archive/org.apache.maven.plugins/maven-docck-plugin/1.1-SNAPSHOT/maven-docck-plugin-1.1-SNAPSHOT.pom
[JENKINS] Archiving <https://builds.apache.org/job/maven-plugins/ws/maven-docck-plugin/target/maven-docck-plugin-1.1-SNAPSHOT.jar> to /home/hudson/hudson/jobs/maven-plugins/modules/org.apache.maven.plugins$maven-docck-plugin/builds/2012-08-01_21-48-41/archive/org.apache.maven.plugins/maven-docck-plugin/1.1-SNAPSHOT/maven-docck-plugin-1.1-SNAPSHOT.jar
[JENKINS] Archiving <https://builds.apache.org/job/maven-plugins/ws/pom.xml> to /home/hudson/hudson/jobs/maven-plugins/modules/org.apache.maven.plugins$maven-plugins-aggregator/builds/2012-08-01_21-48-41/archive/org.apache.maven.plugins/maven-plugins-aggregator/1-SNAPSHOT/maven-plugins-aggregator-1-SNAPSHOT.pom
[JENKINS] Archiving <https://builds.apache.org/job/maven-plugins/ws/maven-idea-plugin/pom.xml> to /home/hudson/hudson/jobs/maven-plugins/modules/org.apache.maven.plugins$maven-idea-plugin/builds/2012-08-01_21-48-41/archive/org.apache.maven.plugins/maven-idea-plugin/2.3-SNAPSHOT/maven-idea-plugin-2.3-SNAPSHOT.pom
[JENKINS] Archiving <https://builds.apache.org/job/maven-plugins/ws/maven-idea-plugin/target/maven-idea-plugin-2.3-SNAPSHOT.jar> to /home/hudson/hudson/jobs/maven-plugins/modules/org.apache.maven.plugins$maven-idea-plugin/builds/2012-08-01_21-48-41/archive/org.apache.maven.plugins/maven-idea-plugin/2.3-SNAPSHOT/maven-idea-plugin-2.3-SNAPSHOT.jar
[JENKINS] Archiving <https://builds.apache.org/job/maven-plugins/ws/maven-toolchains-plugin/pom.xml> to /home/hudson/hudson/jobs/maven-plugins/modules/org.apache.maven.plugins$maven-toolchains-plugin/builds/2012-08-01_21-48-41/archive/org.apache.maven.plugins/maven-toolchains-plugin/1.1-SNAPSHOT/maven-toolchains-plugin-1.1-SNAPSHOT.pom
[JENKINS] Archiving <https://builds.apache.org/job/maven-plugins/ws/maven-toolchains-plugin/target/maven-toolchains-plugin-1.1-SNAPSHOT.jar> to /home/hudson/hudson/jobs/maven-plugins/modules/org.apache.maven.plugins$maven-toolchains-plugin/builds/2012-08-01_21-48-41/archive/org.apache.maven.plugins/maven-toolchains-plugin/1.1-SNAPSHOT/maven-toolchains-plugin-1.1-SNAPSHOT.jar
[JENKINS] Archiving <https://builds.apache.org/job/maven-plugins/ws/maven-pmd-plugin/pom.xml> to /home/hudson/hudson/jobs/maven-plugins/modules/org.apache.maven.plugins$maven-pmd-plugin/builds/2012-08-01_21-48-41/archive/org.apache.maven.plugins/maven-pmd-plugin/2.8-SNAPSHOT/maven-pmd-plugin-2.8-SNAPSHOT.pom
[JENKINS] Archiving <https://builds.apache.org/job/maven-plugins/ws/maven-pmd-plugin/target/maven-pmd-plugin-2.8-SNAPSHOT.jar> to /home/hudson/hudson/jobs/maven-plugins/modules/org.apache.maven.plugins$maven-pmd-plugin/builds/2012-08-01_21-48-41/archive/org.apache.maven.plugins/maven-pmd-plugin/2.8-SNAPSHOT/maven-pmd-plugin-2.8-SNAPSHOT.jar
[JENKINS] Archiving <https://builds.apache.org/job/maven-plugins/ws/maven-eclipse-plugin/pom.xml> to /home/hudson/hudson/jobs/maven-plugins/modules/org.apache.maven.plugins$maven-eclipse-plugin/builds/2012-08-01_21-48-41/archive/org.apache.maven.plugins/maven-eclipse-plugin/2.10-SNAPSHOT/maven-eclipse-plugin-2.10-SNAPSHOT.pom
[JENKINS] Archiving <https://builds.apache.org/job/maven-plugins/ws/maven-eclipse-plugin/target/maven-eclipse-plugin-2.10-SNAPSHOT.jar> to /home/hudson/hudson/jobs/maven-plugins/modules/org.apache.maven.plugins$maven-eclipse-plugin/builds/2012-08-01_21-48-41/archive/org.apache.maven.plugins/maven-eclipse-plugin/2.10-SNAPSHOT/maven-eclipse-plugin-2.10-SNAPSHOT.jar
[JENKINS] Archiving <https://builds.apache.org/job/maven-plugins/ws/maven-gpg-plugin/pom.xml> to /home/hudson/hudson/jobs/maven-plugins/modules/org.apache.maven.plugins$maven-gpg-plugin/builds/2012-08-01_21-48-41/archive/org.apache.maven.plugins/maven-gpg-plugin/1.5-SNAPSHOT/maven-gpg-plugin-1.5-SNAPSHOT.pom
[JENKINS] Archiving <https://builds.apache.org/job/maven-plugins/ws/maven-gpg-plugin/target/maven-gpg-plugin-1.5-SNAPSHOT.jar> to /home/hudson/hudson/jobs/maven-plugins/modules/org.apache.maven.plugins$maven-gpg-plugin/builds/2012-08-01_21-48-41/archive/org.apache.maven.plugins/maven-gpg-plugin/1.5-SNAPSHOT/maven-gpg-plugin-1.5-SNAPSHOT.jar
[JENKINS] Archiving <https://builds.apache.org/job/maven-plugins/ws/maven-clean-plugin/pom.xml> to /home/hudson/hudson/jobs/maven-plugins/modules/org.apache.maven.plugins$maven-clean-plugin/builds/2012-08-01_21-48-41/archive/org.apache.maven.plugins/maven-clean-plugin/2.6-SNAPSHOT/maven-clean-plugin-2.6-SNAPSHOT.pom
[JENKINS] Archiving <https://builds.apache.org/job/maven-plugins/ws/maven-clean-plugin/target/maven-clean-plugin-2.6-SNAPSHOT.jar> to /home/hudson/hudson/jobs/maven-plugins/modules/org.apache.maven.plugins$maven-clean-plugin/builds/2012-08-01_21-48-41/archive/org.apache.maven.plugins/maven-clean-plugin/2.6-SNAPSHOT/maven-clean-plugin-2.6-SNAPSHOT.jar
[JENKINS] Archiving <https://builds.apache.org/job/maven-plugins/ws/maven-jar-plugin/pom.xml> to /home/hudson/hudson/jobs/maven-plugins/modules/org.apache.maven.plugins$maven-jar-plugin/builds/2012-08-01_21-48-41/archive/org.apache.maven.plugins/maven-jar-plugin/2.5-SNAPSHOT/maven-jar-plugin-2.5-SNAPSHOT.pom
[JENKINS] Archiving <https://builds.apache.org/job/maven-plugins/ws/maven-jar-plugin/target/maven-jar-plugin-2.5-SNAPSHOT.jar> to /home/hudson/hudson/jobs/maven-plugins/modules/org.apache.maven.plugins$maven-jar-plugin/builds/2012-08-01_21-48-41/archive/org.apache.maven.plugins/maven-jar-plugin/2.5-SNAPSHOT/maven-jar-plugin-2.5-SNAPSHOT.jar
[JENKINS] Archiving <https://builds.apache.org/job/maven-plugins/ws/maven-site-plugin/dependency-reduced-pom.xml> to /home/hudson/hudson/jobs/maven-plugins/modules/org.apache.maven.plugins$maven-site-plugin/builds/2012-08-01_21-48-41/archive/org.apache.maven.plugins/maven-site-plugin/3.2-SNAPSHOT/maven-site-plugin-3.2-SNAPSHOT.pom
[JENKINS] Archiving <https://builds.apache.org/job/maven-plugins/ws/maven-site-plugin/target/maven-site-plugin-3.2-SNAPSHOT.jar> to /home/hudson/hudson/jobs/maven-plugins/modules/org.apache.maven.plugins$maven-site-plugin/builds/2012-08-01_21-48-41/archive/org.apache.maven.plugins/maven-site-plugin/3.2-SNAPSHOT/maven-site-plugin-3.2-SNAPSHOT.jar
[JENKINS] Archiving <https://builds.apache.org/job/maven-plugins/ws/maven-patch-plugin/pom.xml> to /home/hudson/hudson/jobs/maven-plugins/modules/org.apache.maven.plugins$maven-patch-plugin/builds/2012-08-01_21-48-41/archive/org.apache.maven.plugins/maven-patch-plugin/1.1.2-SNAPSHOT/maven-patch-plugin-1.1.2-SNAPSHOT.pom
[JENKINS] Archiving <https://builds.apache.org/job/maven-plugins/ws/maven-patch-plugin/target/maven-patch-plugin-1.1.2-SNAPSHOT.jar> to /home/hudson/hudson/jobs/maven-plugins/modules/org.apache.maven.plugins$maven-patch-plugin/builds/2012-08-01_21-48-41/archive/org.apache.maven.plugins/maven-patch-plugin/1.1.2-SNAPSHOT/maven-patch-plugin-1.1.2-SNAPSHOT.jar
[JENKINS] Archiving <https://builds.apache.org/job/maven-plugins/ws/maven-install-plugin/pom.xml> to /home/hudson/hudson/jobs/maven-plugins/modules/org.apache.maven.plugins$maven-install-plugin/builds/2012-08-01_21-48-41/archive/org.apache.maven.plugins/maven-install-plugin/2.4-SNAPSHOT/maven-install-plugin-2.4-SNAPSHOT.pom
[JENKINS] Archiving <https://builds.apache.org/job/maven-plugins/ws/maven-install-plugin/target/maven-install-plugin-2.4-SNAPSHOT.jar> to /home/hudson/hudson/jobs/maven-plugins/modules/org.apache.maven.plugins$maven-install-plugin/builds/2012-08-01_21-48-41/archive/org.apache.maven.plugins/maven-install-plugin/2.4-SNAPSHOT/maven-install-plugin-2.4-SNAPSHOT.jar
[JENKINS] Archiving <https://builds.apache.org/job/maven-plugins/ws/maven-antrun-plugin/pom.xml> to /home/hudson/hudson/jobs/maven-plugins/modules/org.apache.maven.plugins$maven-antrun-plugin/builds/2012-08-01_21-48-41/archive/org.apache.maven.plugins/maven-antrun-plugin/1.8-SNAPSHOT/maven-antrun-plugin-1.8-SNAPSHOT.pom
[JENKINS] Archiving <https://builds.apache.org/job/maven-plugins/ws/maven-antrun-plugin/target/maven-antrun-plugin-1.8-SNAPSHOT.jar> to /home/hudson/hudson/jobs/maven-plugins/modules/org.apache.maven.plugins$maven-antrun-plugin/builds/2012-08-01_21-48-41/archive/org.apache.maven.plugins/maven-antrun-plugin/1.8-SNAPSHOT/maven-antrun-plugin-1.8-SNAPSHOT.jar
[JENKINS] Archiving <https://builds.apache.org/job/maven-plugins/ws/maven-changes-plugin/pom.xml> to /home/hudson/hudson/jobs/maven-plugins/modules/org.apache.maven.plugins$maven-changes-plugin/builds/2012-08-01_21-48-41/archive/org.apache.maven.plugins/maven-changes-plugin/2.8-SNAPSHOT/maven-changes-plugin-2.8-SNAPSHOT.pom
[JENKINS] Archiving <https://builds.apache.org/job/maven-plugins/ws/maven-changes-plugin/target/maven-changes-plugin-2.8-SNAPSHOT.jar> to /home/hudson/hudson/jobs/maven-plugins/modules/org.apache.maven.plugins$maven-changes-plugin/builds/2012-08-01_21-48-41/archive/org.apache.maven.plugins/maven-changes-plugin/2.8-SNAPSHOT/maven-changes-plugin-2.8-SNAPSHOT.jar
[JENKINS] Archiving <https://builds.apache.org/job/maven-plugins/ws/maven-rar-plugin/pom.xml> to /home/hudson/hudson/jobs/maven-plugins/modules/org.apache.maven.plugins$maven-rar-plugin/builds/2012-08-01_21-48-41/archive/org.apache.maven.plugins/maven-rar-plugin/2.3-SNAPSHOT/maven-rar-plugin-2.3-SNAPSHOT.pom
[JENKINS] Archiving <https://builds.apache.org/job/maven-plugins/ws/maven-rar-plugin/target/maven-rar-plugin-2.3-SNAPSHOT.jar> to /home/hudson/hudson/jobs/maven-plugins/modules/org.apache.maven.plugins$maven-rar-plugin/builds/2012-08-01_21-48-41/archive/org.apache.maven.plugins/maven-rar-plugin/2.3-SNAPSHOT/maven-rar-plugin-2.3-SNAPSHOT.jar
[JENKINS] Archiving <https://builds.apache.org/job/maven-plugins/ws/maven-jarsigner-plugin/pom.xml> to /home/hudson/hudson/jobs/maven-plugins/modules/org.apache.maven.plugins$maven-jarsigner-plugin/builds/2012-08-01_21-48-41/archive/org.apache.maven.plugins/maven-jarsigner-plugin/1.3-SNAPSHOT/maven-jarsigner-plugin-1.3-SNAPSHOT.pom
[JENKINS] Archiving <https://builds.apache.org/job/maven-plugins/ws/maven-jarsigner-plugin/target/maven-jarsigner-plugin-1.3-SNAPSHOT.jar> to /home/hudson/hudson/jobs/maven-plugins/modules/org.apache.maven.plugins$maven-jarsigner-plugin/builds/2012-08-01_21-48-41/archive/org.apache.maven.plugins/maven-jarsigner-plugin/1.3-SNAPSHOT/maven-jarsigner-plugin-1.3-SNAPSHOT.jar
[JENKINS] Archiving <https://builds.apache.org/job/maven-plugins/ws/maven-ear-plugin/pom.xml> to /home/hudson/hudson/jobs/maven-plugins/modules/org.apache.maven.plugins$maven-ear-plugin/builds/2012-08-01_21-48-41/archive/org.apache.maven.plugins/maven-ear-plugin/2.8-SNAPSHOT/maven-ear-plugin-2.8-SNAPSHOT.pom
[JENKINS] Archiving <https://builds.apache.org/job/maven-plugins/ws/maven-ear-plugin/target/maven-ear-plugin-2.8-SNAPSHOT.jar> to /home/hudson/hudson/jobs/maven-plugins/modules/org.apache.maven.plugins$maven-ear-plugin/builds/2012-08-01_21-48-41/archive/org.apache.maven.plugins/maven-ear-plugin/2.8-SNAPSHOT/maven-ear-plugin-2.8-SNAPSHOT.jar
[JENKINS] Archiving <https://builds.apache.org/job/maven-plugins/ws/maven-changelog-plugin/pom.xml> to /home/hudson/hudson/jobs/maven-plugins/modules/org.apache.maven.plugins$maven-changelog-plugin/builds/2012-08-01_21-48-41/archive/org.apache.maven.plugins/maven-changelog-plugin/2.3-SNAPSHOT/maven-changelog-plugin-2.3-SNAPSHOT.pom
[JENKINS] Archiving <https://builds.apache.org/job/maven-plugins/ws/maven-changelog-plugin/target/maven-changelog-plugin-2.3-SNAPSHOT.jar> to /home/hudson/hudson/jobs/maven-plugins/modules/org.apache.maven.plugins$maven-changelog-plugin/builds/2012-08-01_21-48-41/archive/org.apache.maven.plugins/maven-changelog-plugin/2.3-SNAPSHOT/maven-changelog-plugin-2.3-SNAPSHOT.jar
[JENKINS] Archiving <https://builds.apache.org/job/maven-plugins/ws/maven-verifier-plugin/pom.xml> to /home/hudson/hudson/jobs/maven-plugins/modules/org.apache.maven.plugins$maven-verifier-plugin/builds/2012-08-01_21-48-41/archive/org.apache.maven.plugins/maven-verifier-plugin/1.1-SNAPSHOT/maven-verifier-plugin-1.1-SNAPSHOT.pom
[JENKINS] Archiving <https://builds.apache.org/job/maven-plugins/ws/maven-verifier-plugin/target/maven-verifier-plugin-1.1-SNAPSHOT.jar> to /home/hudson/hudson/jobs/maven-plugins/modules/org.apache.maven.plugins$maven-verifier-plugin/builds/2012-08-01_21-48-41/archive/org.apache.maven.plugins/maven-verifier-plugin/1.1-SNAPSHOT/maven-verifier-plugin-1.1-SNAPSHOT.jar
[JENKINS] Archiving <https://builds.apache.org/job/maven-plugins/ws/maven-stage-plugin/pom.xml> to /home/hudson/hudson/jobs/maven-plugins/modules/org.apache.maven.plugins$maven-stage-plugin/builds/2012-08-01_21-48-41/archive/org.apache.maven.plugins/maven-stage-plugin/1.0-alpha-3-SNAPSHOT/maven-stage-plugin-1.0-alpha-3-SNAPSHOT.pom
[JENKINS] Archiving <https://builds.apache.org/job/maven-plugins/ws/maven-stage-plugin/target/maven-stage-plugin-1.0-alpha-3-SNAPSHOT.jar> to /home/hudson/hudson/jobs/maven-plugins/modules/org.apache.maven.plugins$maven-stage-plugin/builds/2012-08-01_21-48-41/archive/org.apache.maven.plugins/maven-stage-plugin/1.0-alpha-3-SNAPSHOT/maven-stage-plugin-1.0-alpha-3-SNAPSHOT.jar
[JENKINS] Archiving <https://builds.apache.org/job/maven-plugins/ws/maven-ant-plugin/pom.xml> to /home/hudson/hudson/jobs/maven-plugins/modules/org.apache.maven.plugins$maven-ant-plugin/builds/2012-08-01_21-48-41/archive/org.apache.maven.plugins/maven-ant-plugin/2.4-SNAPSHOT/maven-ant-plugin-2.4-SNAPSHOT.pom
[JENKINS] Archiving <https://builds.apache.org/job/maven-plugins/ws/maven-ant-plugin/target/maven-ant-plugin-2.4-SNAPSHOT.jar> to /home/hudson/hudson/jobs/maven-plugins/modules/org.apache.maven.plugins$maven-ant-plugin/builds/2012-08-01_21-48-41/archive/org.apache.maven.plugins/maven-ant-plugin/2.4-SNAPSHOT/maven-ant-plugin-2.4-SNAPSHOT.jar
[JENKINS] Archiving <https://builds.apache.org/job/maven-plugins/ws/maven-compiler-plugin/pom.xml> to /home/hudson/hudson/jobs/maven-plugins/modules/org.apache.maven.plugins$maven-compiler-plugin/builds/2012-08-01_21-48-41/archive/org.apache.maven.plugins/maven-compiler-plugin/2.6-SNAPSHOT/maven-compiler-plugin-2.6-SNAPSHOT.pom
[JENKINS] Archiving <https://builds.apache.org/job/maven-plugins/ws/maven-compiler-plugin/target/maven-compiler-plugin-2.6-SNAPSHOT.jar> to /home/hudson/hudson/jobs/maven-plugins/modules/org.apache.maven.plugins$maven-compiler-plugin/builds/2012-08-01_21-48-41/archive/org.apache.maven.plugins/maven-compiler-plugin/2.6-SNAPSHOT/maven-compiler-plugin-2.6-SNAPSHOT.jar
[JENKINS] Archiving <https://builds.apache.org/job/maven-plugins/ws/maven-ejb-plugin/pom.xml> to /home/hudson/hudson/jobs/maven-plugins/modules/org.apache.maven.plugins$maven-ejb-plugin/builds/2012-08-01_21-48-41/archive/org.apache.maven.plugins/maven-ejb-plugin/2.4-SNAPSHOT/maven-ejb-plugin-2.4-SNAPSHOT.pom
[JENKINS] Archiving <https://builds.apache.org/job/maven-plugins/ws/maven-ejb-plugin/target/maven-ejb-plugin-2.4-SNAPSHOT.jar> to /home/hudson/hudson/jobs/maven-plugins/modules/org.apache.maven.plugins$maven-ejb-plugin/builds/2012-08-01_21-48-41/archive/org.apache.maven.plugins/maven-ejb-plugin/2.4-SNAPSHOT/maven-ejb-plugin-2.4-SNAPSHOT.jar
[JENKINS] Archiving <https://builds.apache.org/job/maven-plugins/ws/maven-reactor-plugin/pom.xml> to /home/hudson/hudson/jobs/maven-plugins/modules/org.apache.maven.plugins$maven-reactor-plugin/builds/2012-08-01_21-48-41/archive/org.apache.maven.plugins/maven-reactor-plugin/1.1-SNAPSHOT/maven-reactor-plugin-1.1-SNAPSHOT.pom
[JENKINS] Archiving <https://builds.apache.org/job/maven-plugins/ws/maven-reactor-plugin/target/maven-reactor-plugin-1.1-SNAPSHOT.jar> to /home/hudson/hudson/jobs/maven-plugins/modules/org.apache.maven.plugins$maven-reactor-plugin/builds/2012-08-01_21-48-41/archive/org.apache.maven.plugins/maven-reactor-plugin/1.1-SNAPSHOT/maven-reactor-plugin-1.1-SNAPSHOT.jar
[JENKINS] Archiving <https://builds.apache.org/job/maven-plugins/ws/maven-doap-plugin/pom.xml> to /home/hudson/hudson/jobs/maven-plugins/modules/org.apache.maven.plugins$maven-doap-plugin/builds/2012-08-01_21-48-41/archive/org.apache.maven.plugins/maven-doap-plugin/1.2-SNAPSHOT/maven-doap-plugin-1.2-SNAPSHOT.pom
[JENKINS] Archiving <https://builds.apache.org/job/maven-plugins/ws/maven-doap-plugin/target/maven-doap-plugin-1.2-SNAPSHOT.jar> to /home/hudson/hudson/jobs/maven-plugins/modules/org.apache.maven.plugins$maven-doap-plugin/builds/2012-08-01_21-48-41/archive/org.apache.maven.plugins/maven-doap-plugin/1.2-SNAPSHOT/maven-doap-plugin-1.2-SNAPSHOT.jar
[JENKINS] Archiving <https://builds.apache.org/job/maven-plugins/ws/maven-checkstyle-plugin/pom.xml> to /home/hudson/hudson/jobs/maven-plugins/modules/org.apache.maven.plugins$maven-checkstyle-plugin/builds/2012-08-01_21-48-41/archive/org.apache.maven.plugins/maven-checkstyle-plugin/2.10-SNAPSHOT/maven-checkstyle-plugin-2.10-SNAPSHOT.pom
[JENKINS] Archiving <https://builds.apache.org/job/maven-plugins/ws/maven-checkstyle-plugin/target/maven-checkstyle-plugin-2.10-SNAPSHOT.jar> to /home/hudson/hudson/jobs/maven-plugins/modules/org.apache.maven.plugins$maven-checkstyle-plugin/builds/2012-08-01_21-48-41/archive/org.apache.maven.plugins/maven-checkstyle-plugin/2.10-SNAPSHOT/maven-checkstyle-plugin-2.10-SNAPSHOT.jar
[JENKINS] Archiving <https://builds.apache.org/job/maven-plugins/ws/maven-source-plugin/pom.xml> to /home/hudson/hudson/jobs/maven-plugins/modules/org.apache.maven.plugins$maven-source-plugin/builds/2012-08-01_21-48-41/archive/org.apache.maven.plugins/maven-source-plugin/2.2-SNAPSHOT/maven-source-plugin-2.2-SNAPSHOT.pom
[JENKINS] Archiving <https://builds.apache.org/job/maven-plugins/ws/maven-source-plugin/target/maven-source-plugin-2.2-SNAPSHOT.jar> to /home/hudson/hudson/jobs/maven-plugins/modules/org.apache.maven.plugins$maven-source-plugin/builds/2012-08-01_21-48-41/archive/org.apache.maven.plugins/maven-source-plugin/2.2-SNAPSHOT/maven-source-plugin-2.2-SNAPSHOT.jar
[JENKINS] Archiving <https://builds.apache.org/job/maven-plugins/ws/maven-dependency-plugin/pom.xml> to /home/hudson/hudson/jobs/maven-plugins/modules/org.apache.maven.plugins$maven-dependency-plugin/builds/2012-08-01_21-48-41/archive/org.apache.maven.plugins/maven-dependency-plugin/2.5-SNAPSHOT/maven-dependency-plugin-2.5-SNAPSHOT.pom
[JENKINS] Archiving <https://builds.apache.org/job/maven-plugins/ws/maven-dependency-plugin/target/maven-dependency-plugin-2.5-SNAPSHOT.jar> to /home/hudson/hudson/jobs/maven-plugins/modules/org.apache.maven.plugins$maven-dependency-plugin/builds/2012-08-01_21-48-41/archive/org.apache.maven.plugins/maven-dependency-plugin/2.5-SNAPSHOT/maven-dependency-plugin-2.5-SNAPSHOT.jar
[JENKINS] Archiving <https://builds.apache.org/job/maven-plugins/ws/maven-javadoc-plugin/pom.xml> to /home/hudson/hudson/jobs/maven-plugins/modules/org.apache.maven.plugins$maven-javadoc-plugin/builds/2012-08-01_21-48-41/archive/org.apache.maven.plugins/maven-javadoc-plugin/2.8.2-SNAPSHOT/maven-javadoc-plugin-2.8.2-SNAPSHOT.pom
[JENKINS] Archiving <https://builds.apache.org/job/maven-plugins/ws/maven-javadoc-plugin/target/maven-javadoc-plugin-2.8.2-SNAPSHOT.jar> to /home/hudson/hudson/jobs/maven-plugins/modules/org.apache.maven.plugins$maven-javadoc-plugin/builds/2012-08-01_21-48-41/archive/org.apache.maven.plugins/maven-javadoc-plugin/2.8.2-SNAPSHOT/maven-javadoc-plugin-2.8.2-SNAPSHOT.jar
[JENKINS] Archiving <https://builds.apache.org/job/maven-plugins/ws/maven-deploy-plugin/pom.xml> to /home/hudson/hudson/jobs/maven-plugins/modules/org.apache.maven.plugins$maven-deploy-plugin/builds/2012-08-01_21-48-41/archive/org.apache.maven.plugins/maven-deploy-plugin/2.8-SNAPSHOT/maven-deploy-plugin-2.8-SNAPSHOT.pom
[JENKINS] Archiving <https://builds.apache.org/job/maven-plugins/ws/maven-deploy-plugin/target/maven-deploy-plugin-2.8-SNAPSHOT.jar> to /home/hudson/hudson/jobs/maven-plugins/modules/org.apache.maven.plugins$maven-deploy-plugin/builds/2012-08-01_21-48-41/archive/org.apache.maven.plugins/maven-deploy-plugin/2.8-SNAPSHOT/maven-deploy-plugin-2.8-SNAPSHOT.jar
[JENKINS] Archiving <https://builds.apache.org/job/maven-plugins/ws/maven-acr-plugin/pom.xml> to /home/hudson/hudson/jobs/maven-plugins/modules/org.apache.maven.plugins$maven-acr-plugin/builds/2012-08-01_21-48-41/archive/org.apache.maven.plugins/maven-acr-plugin/1.0.1-SNAPSHOT/maven-acr-plugin-1.0.1-SNAPSHOT.pom
[JENKINS] Archiving <https://builds.apache.org/job/maven-plugins/ws/maven-acr-plugin/target/maven-acr-plugin-1.0.1-SNAPSHOT.jar> to /home/hudson/hudson/jobs/maven-plugins/modules/org.apache.maven.plugins$maven-acr-plugin/builds/2012-08-01_21-48-41/archive/org.apache.maven.plugins/maven-acr-plugin/1.0.1-SNAPSHOT/maven-acr-plugin-1.0.1-SNAPSHOT.jar
[JENKINS] Archiving <https://builds.apache.org/job/maven-plugins/ws/maven-repository-plugin/pom.xml> to /home/hudson/hudson/jobs/maven-plugins/modules/org.apache.maven.plugins$maven-repository-plugin/builds/2012-08-01_21-48-41/archive/org.apache.maven.plugins/maven-repository-plugin/2.3.3-SNAPSHOT/maven-repository-plugin-2.3.3-SNAPSHOT.pom
[JENKINS] Archiving <https://builds.apache.org/job/maven-plugins/ws/maven-repository-plugin/target/maven-repository-plugin-2.3.3-SNAPSHOT.jar> to /home/hudson/hudson/jobs/maven-plugins/modules/org.apache.maven.plugins$maven-repository-plugin/builds/2012-08-01_21-48-41/archive/org.apache.maven.plugins/maven-repository-plugin/2.3.3-SNAPSHOT/maven-repository-plugin-2.3.3-SNAPSHOT.jar
[JENKINS] Archiving <https://builds.apache.org/job/maven-plugins/ws/maven-assembly-plugin/pom.xml> to /home/hudson/hudson/jobs/maven-plugins/modules/org.apache.maven.plugins$maven-assembly-plugin/builds/2012-08-01_21-48-41/archive/org.apache.maven.plugins/maven-assembly-plugin/2.4-SNAPSHOT/maven-assembly-plugin-2.4-SNAPSHOT.pom
[JENKINS] Archiving <https://builds.apache.org/job/maven-plugins/ws/maven-assembly-plugin/target/maven-assembly-plugin-2.4-SNAPSHOT.jar> to /home/hudson/hudson/jobs/maven-plugins/modules/org.apache.maven.plugins$maven-assembly-plugin/builds/2012-08-01_21-48-41/archive/org.apache.maven.plugins/maven-assembly-plugin/2.4-SNAPSHOT/maven-assembly-plugin-2.4-SNAPSHOT.jar
[JENKINS] Archiving <https://builds.apache.org/job/maven-plugins/ws/maven-project-info-reports-plugin/pom.xml> to /home/hudson/hudson/jobs/maven-plugins/modules/org.apache.maven.plugins$maven-project-info-reports-plugin/builds/2012-08-01_21-48-41/archive/org.apache.maven.plugins/maven-project-info-reports-plugin/2.6-SNAPSHOT/maven-project-info-reports-plugin-2.6-SNAPSHOT.pom
[JENKINS] Archiving <https://builds.apache.org/job/maven-plugins/ws/maven-one-plugin/pom.xml> to /home/hudson/hudson/jobs/maven-plugins/modules/org.apache.maven.plugins$maven-one-plugin/builds/2012-08-01_21-48-41/archive/org.apache.maven.plugins/maven-one-plugin/1.3-SNAPSHOT/maven-one-plugin-1.3-SNAPSHOT.pom
[JENKINS] Archiving <https://builds.apache.org/job/maven-plugins/ws/maven-one-plugin/target/maven-one-plugin-1.3-SNAPSHOT.jar> to /home/hudson/hudson/jobs/maven-plugins/modules/org.apache.maven.plugins$maven-one-plugin/builds/2012-08-01_21-48-41/archive/org.apache.maven.plugins/maven-one-plugin/1.3-SNAPSHOT/maven-one-plugin-1.3-SNAPSHOT.jar
[JENKINS] Archiving <https://builds.apache.org/job/maven-plugins/ws/maven-help-plugin/pom.xml> to /home/hudson/hudson/jobs/maven-plugins/modules/org.apache.maven.plugins$maven-help-plugin/builds/2012-08-01_21-48-41/archive/org.apache.maven.plugins/maven-help-plugin/2.2-SNAPSHOT/maven-help-plugin-2.2-SNAPSHOT.pom
[JENKINS] Archiving <https://builds.apache.org/job/maven-plugins/ws/maven-help-plugin/target/maven-help-plugin-2.2-SNAPSHOT.jar> to /home/hudson/hudson/jobs/maven-plugins/modules/org.apache.maven.plugins$maven-help-plugin/builds/2012-08-01_21-48-41/archive/org.apache.maven.plugins/maven-help-plugin/2.2-SNAPSHOT/maven-help-plugin-2.2-SNAPSHOT.jar
[JENKINS] Archiving <https://builds.apache.org/job/maven-plugins/ws/maven-invoker-plugin/pom.xml> to /home/hudson/hudson/jobs/maven-plugins/modules/org.apache.maven.plugins$maven-invoker-plugin/builds/2012-08-01_21-48-41/archive/org.apache.maven.plugins/maven-invoker-plugin/1.7-SNAPSHOT/maven-invoker-plugin-1.7-SNAPSHOT.pom
[JENKINS] Archiving <https://builds.apache.org/job/maven-plugins/ws/maven-invoker-plugin/target/maven-invoker-plugin-1.7-SNAPSHOT.jar> to /home/hudson/hudson/jobs/maven-plugins/modules/org.apache.maven.plugins$maven-invoker-plugin/builds/2012-08-01_21-48-41/archive/org.apache.maven.plugins/maven-invoker-plugin/1.7-SNAPSHOT/maven-invoker-plugin-1.7-SNAPSHOT.jar
[JENKINS] Archiving <https://builds.apache.org/job/maven-plugins/ws/maven-remote-resources-plugin/pom.xml> to /home/hudson/hudson/jobs/maven-plugins/modules/org.apache.maven.plugins$maven-remote-resources-plugin/builds/2012-08-01_21-48-41/archive/org.apache.maven.plugins/maven-remote-resources-plugin/1.4-SNAPSHOT/maven-remote-resources-plugin-1.4-SNAPSHOT.pom
[JENKINS] Archiving <https://builds.apache.org/job/maven-plugins/ws/maven-remote-resources-plugin/target/maven-remote-resources-plugin-1.4-SNAPSHOT.jar> to /home/hudson/hudson/jobs/maven-plugins/modules/org.apache.maven.plugins$maven-remote-resources-plugin/builds/2012-08-01_21-48-41/archive/org.apache.maven.plugins/maven-remote-resources-plugin/1.4-SNAPSHOT/maven-remote-resources-plugin-1.4-SNAPSHOT.jar
[JENKINS] Archiving <https://builds.apache.org/job/maven-plugins/ws/maven-pdf-plugin/pom.xml> to /home/hudson/hudson/jobs/maven-plugins/modules/org.apache.maven.plugins$maven-pdf-plugin/builds/2012-08-01_21-48-41/archive/org.apache.maven.plugins/maven-pdf-plugin/1.2-SNAPSHOT/maven-pdf-plugin-1.2-SNAPSHOT.pom
[JENKINS] Archiving <https://builds.apache.org/job/maven-plugins/ws/maven-pdf-plugin/target/maven-pdf-plugin-1.2-SNAPSHOT.jar> to /home/hudson/hudson/jobs/maven-plugins/modules/org.apache.maven.plugins$maven-pdf-plugin/builds/2012-08-01_21-48-41/archive/org.apache.maven.plugins/maven-pdf-plugin/1.2-SNAPSHOT/maven-pdf-plugin-1.2-SNAPSHOT.jar
[JENKINS] Archiving <https://builds.apache.org/job/maven-plugins/ws/maven-shade-plugin/pom.xml> to /home/hudson/hudson/jobs/maven-plugins/modules/org.apache.maven.plugins$maven-shade-plugin/builds/2012-08-01_21-48-41/archive/org.apache.maven.plugins/maven-shade-plugin/2.0-SNAPSHOT/maven-shade-plugin-2.0-SNAPSHOT.pom
[JENKINS] Archiving <https://builds.apache.org/job/maven-plugins/ws/maven-shade-plugin/target/maven-shade-plugin-2.0-SNAPSHOT.jar> to /home/hudson/hudson/jobs/maven-plugins/modules/org.apache.maven.plugins$maven-shade-plugin/builds/2012-08-01_21-48-41/archive/org.apache.maven.plugins/maven-shade-plugin/2.0-SNAPSHOT/maven-shade-plugin-2.0-SNAPSHOT.jar
[JENKINS] Archiving <https://builds.apache.org/job/maven-plugins/ws/maven-plugins/pom.xml> to /home/hudson/hudson/jobs/maven-plugins/modules/org.apache.maven.plugins$maven-plugins/builds/2012-08-01_21-48-41/archive/org.apache.maven.plugins/maven-plugins/23-SNAPSHOT/maven-plugins-23-SNAPSHOT.pom
[JENKINS] Archiving <https://builds.apache.org/job/maven-plugins/ws/maven-plugins/target/maven-plugins-23-SNAPSHOT-site.xml> to /home/hudson/hudson/jobs/maven-plugins/modules/org.apache.maven.plugins$maven-plugins/builds/2012-08-01_21-48-41/archive/org.apache.maven.plugins/maven-plugins/23-SNAPSHOT/maven-plugins-23-SNAPSHOT-site.xml
[JENKINS] Archiving <https://builds.apache.org/job/maven-plugins/ws/maven-linkcheck-plugin/pom.xml> to /home/hudson/hudson/jobs/maven-plugins/modules/org.apache.maven.plugins$maven-linkcheck-plugin/builds/2012-08-01_21-48-41/archive/org.apache.maven.plugins/maven-linkcheck-plugin/1.2-SNAPSHOT/maven-linkcheck-plugin-1.2-SNAPSHOT.pom
[JENKINS] Archiving <https://builds.apache.org/job/maven-plugins/ws/maven-linkcheck-plugin/target/maven-linkcheck-plugin-1.2-SNAPSHOT.jar> to /home/hudson/hudson/jobs/maven-plugins/modules/org.apache.maven.plugins$maven-linkcheck-plugin/builds/2012-08-01_21-48-41/archive/org.apache.maven.plugins/maven-linkcheck-plugin/1.2-SNAPSHOT/maven-linkcheck-plugin-1.2-SNAPSHOT.jar
[JENKINS] Archiving <https://builds.apache.org/job/maven-plugins/ws/maven-resources-plugin/pom.xml> to /home/hudson/hudson/jobs/maven-plugins/modules/org.apache.maven.plugins$maven-resources-plugin/builds/2012-08-01_21-48-41/archive/org.apache.maven.plugins/maven-resources-plugin/2.6-SNAPSHOT/maven-resources-plugin-2.6-SNAPSHOT.pom
[JENKINS] Archiving <https://builds.apache.org/job/maven-plugins/ws/maven-resources-plugin/target/maven-resources-plugin-2.6-SNAPSHOT.jar> to /home/hudson/hudson/jobs/maven-plugins/modules/org.apache.maven.plugins$maven-resources-plugin/builds/2012-08-01_21-48-41/archive/org.apache.maven.plugins/maven-resources-plugin/2.6-SNAPSHOT/maven-resources-plugin-2.6-SNAPSHOT.jar
Waiting for Jenkins to finish collecting data
mavenExecutionResult exceptions not empty
message : Failed to execute goal on project maven-project-info-reports-plugin: Could not resolve dependencies for project org.apache.maven.plugins:maven-project-info-reports-plugin:maven-plugin:2.6-SNAPSHOT: Could not find artifact org.apache.maven.shared:maven-dependency-tree:jar:2.0 in central (http://repo.maven.apache.org/maven2)
cause : Could not resolve dependencies for project org.apache.maven.plugins:maven-project-info-reports-plugin:maven-plugin:2.6-SNAPSHOT: Could not find artifact org.apache.maven.shared:maven-dependency-tree:jar:2.0 in central (http://repo.maven.apache.org/maven2)
Stack trace : 
org.apache.maven.lifecycle.LifecycleExecutionException: Failed to execute goal on project maven-project-info-reports-plugin: Could not resolve dependencies for project org.apache.maven.plugins:maven-project-info-reports-plugin:maven-plugin:2.6-SNAPSHOT: Could not find artifact org.apache.maven.shared:maven-dependency-tree:jar:2.0 in central (http://repo.maven.apache.org/maven2)
	at org.apache.maven.lifecycle.internal.LifecycleDependencyResolver.getDependencies(LifecycleDependencyResolver.java:210)
	at org.apache.maven.lifecycle.internal.LifecycleDependencyResolver.resolveProjectDependencies(LifecycleDependencyResolver.java:117)
	at org.apache.maven.lifecycle.internal.MojoExecutor.ensureDependenciesAreResolved(MojoExecutor.java:258)
	at org.apache.maven.lifecycle.internal.MojoExecutor.execute(MojoExecutor.java:201)
	at org.apache.maven.lifecycle.internal.MojoExecutor.execute(MojoExecutor.java:153)
	at org.apache.maven.lifecycle.internal.MojoExecutor.execute(MojoExecutor.java:145)
	at org.apache.maven.lifecycle.internal.LifecycleModuleBuilder.buildProject(LifecycleModuleBuilder.java:84)
	at org.apache.maven.lifecycle.internal.LifecycleThreadedBuilder$1.call(LifecycleThreadedBuilder.java:167)
	at org.apache.maven.lifecycle.internal.LifecycleThreadedBuilder$1.call(LifecycleThreadedBuilder.java:163)
	at java.util.concurrent.FutureTask$Sync.innerRun(FutureTask.java:269)
	at java.util.concurrent.FutureTask.run(FutureTask.java:123)
	at java.util.concurrent.ThreadPoolExecutor$Worker.runTask(ThreadPoolExecutor.java:651)
	at java.util.concurrent.ThreadPoolExecutor$Worker.run(ThreadPoolExecutor.java:676)
	at java.lang.Thread.run(Thread.java:595)
Caused by: org.apache.maven.project.DependencyResolutionException: Could not resolve dependencies for project org.apache.maven.plugins:maven-project-info-reports-plugin:maven-plugin:2.6-SNAPSHOT: Could not find artifact org.apache.maven.shared:maven-dependency-tree:jar:2.0 in central (http://repo.maven.apache.org/maven2)
	at org.apache.maven.project.DefaultProjectDependenciesResolver.resolve(DefaultProjectDependenciesResolver.java:189)
	at org.apache.maven.lifecycle.internal.LifecycleDependencyResolver.getDependencies(LifecycleDependencyResolver.java:185)
	... 13 more
Caused by: org.sonatype.aether.resolution.DependencyResolutionException: Could not find artifact org.apache.maven.shared:maven-dependency-tree:jar:2.0 in central (http://repo.maven.apache.org/maven2)
	at org.sonatype.aether.impl.internal.DefaultRepositorySystem.resolveDependencies(DefaultRepositorySystem.java:375)
	at org.apache.maven.project.DefaultProjectDependenciesResolver.resolve(DefaultProjectDependenciesResolver.java:183)
	... 14 more
Caused by: org.sonatype.aether.resolution.ArtifactResolutionException: Could not find artifact org.apache.maven.shared:maven-dependency-tree:jar:2.0 in central (http://repo.maven.apache.org/maven2)
	at org.sonatype.aether.impl.internal.DefaultArtifactResolver.resolve(DefaultArtifactResolver.java:538)
	at org.sonatype.aether.impl.internal.DefaultArtifactResolver.resolveArtifacts(DefaultArtifactResolver.java:216)
	at org.sonatype.aether.impl.internal.DefaultRepositorySystem.resolveDependencies(DefaultRepositorySystem.java:358)
	... 15 more
Caused by: org.sonatype.aether.transfer.ArtifactNotFoundException: Could not find artifact org.apache.maven.shared:maven-dependency-tree:jar:2.0 in central (http://repo.maven.apache.org/maven2)
	at org.sonatype.aether.connector.wagon.WagonRepositoryConnector$4.wrap(WagonRepositoryConnector.java:947)
	at org.sonatype.aether.connector.wagon.WagonRepositoryConnector$4.wrap(WagonRepositoryConnector.java:941)
	at org.sonatype.aether.connector.wagon.WagonRepositoryConnector$GetTask.run(WagonRepositoryConnector.java:669)
	at org.sonatype.aether.util.concurrency.RunnableErrorForwarder$1.run(RunnableErrorForwarder.java:60)
	... 3 more
Sending e-mails to: notifications@maven.apache.org
channel stopped

Mime
View raw message