maven-notifications mailing list archives

Site index · List index
Message view « Date » · « Thread »
Top « Date » · « Thread »
From Apache Jenkins Server <jenk...@builds.apache.org>
Subject Build failed in Jenkins: maven-plugins-ITs-m2 #671
Date Mon, 06 Aug 2012 08:06:59 GMT
See <https://builds.apache.org/job/maven-plugins-ITs-m2/671/changes>

Changes:

[simonetripodi] fixed broken project.packaging property, see [MPIR-236]

------------------------------------------
[...truncated 9956 lines...]
[INFO] Processing overlay [ id wartests:overlay-full-2]
[INFO] Webapp assembled in [1165 msecs]
[INFO] Exploding webapp
[INFO] Assembling webapp [maven-war-plugin-test] in [<https://builds.apache.org/job/maven-plugins-ITs-m2/ws/maven-war-plugin/target/test-classes/unit/waroverlays/overlays-includes-excludes-multiple-defs2]>
[INFO] Processing overlay [ id wartests:overlay-full-3]
[INFO] Processing overlay [ id wartests:overlay-full-1]
[INFO] Processing overlay [ id wartests:overlay-full-3]
[INFO] Processing war project
[INFO] Copying webapp resources [<https://builds.apache.org/job/maven-plugins-ITs-m2/ws/maven-war-plugin/target/test-classes/unit/waroverlays/overlays-includes-excludes-multiple-defs2-test-data/source]>
[INFO] Processing overlay [ id wartests:overlay-full-2]
[INFO] Webapp assembled in [1157 msecs]
[INFO] Exploding webapp
[INFO] Assembling webapp [maven-war-plugin-test] in [<https://builds.apache.org/job/maven-plugins-ITs-m2/ws/maven-war-plugin/target/test-classes/unit/waroverlays/cache-updated-overlay]>
[INFO] Processing war project
[INFO] Copying webapp resources [<https://builds.apache.org/job/maven-plugins-ITs-m2/ws/maven-war-plugin/target/test-classes/unit/waroverlays/cache-updated-overlay-test-data/source]>
[INFO] Processing overlay [ id wartests:overlay-one]
[INFO] Processing overlay [ id wartests:overlay-two]
[INFO] Webapp assembled in [210 msecs]
[INFO] Exploding webapp
[INFO] Assembling webapp [maven-war-plugin-test] in [<https://builds.apache.org/job/maven-plugins-ITs-m2/ws/maven-war-plugin/target/test-classes/unit/waroverlays/cache-updated-overlay]>
[INFO] Processing war project
[INFO] Copying webapp resources [<https://builds.apache.org/job/maven-plugins-ITs-m2/ws/maven-war-plugin/target/test-classes/unit/waroverlays/cache-updated-overlay-test-data/source]>
[INFO] Processing overlay [ id wartests:overlay-two]
[INFO] File [index.jsp] belonged to overlay [wartests:overlay-one] so it will be overwritten.
[INFO] File [WEB-INF/web.xml] belonged to overlay [wartests:overlay-one] so it will be overwritten.
[INFO] Processing overlay [ id wartests:overlay-one]
[INFO] Webapp assembled in [8 msecs]
[INFO] Exploding webapp
[INFO] Assembling webapp [maven-war-plugin-test] in [<https://builds.apache.org/job/maven-plugins-ITs-m2/ws/maven-war-plugin/target/test-classes/unit/waroverlays/cache-removed-overlay]>
[INFO] Processing war project
[INFO] Copying webapp resources [<https://builds.apache.org/job/maven-plugins-ITs-m2/ws/maven-war-plugin/target/test-classes/unit/waroverlays/cache-removed-overlay-test-data/source]>
[INFO] Processing overlay [ id wartests:overlay-one]
[INFO] Processing overlay [ id wartests:overlay-two]
[INFO] Webapp assembled in [219 msecs]
[INFO] Exploding webapp
[INFO] Assembling webapp [maven-war-plugin-test] in [<https://builds.apache.org/job/maven-plugins-ITs-m2/ws/maven-war-plugin/target/test-classes/unit/waroverlays/cache-removed-overlay]>
[WARNING] Dependency [Dependency {groupId=wartests, artifactId=overlay-one, version=0.0-Test,
type=war}] has been removed from the project. If it was included in the build as an overlay,
consider cleaning the target directory of the project (mvn clean)
[INFO] Processing war project
[INFO] Copying webapp resources [<https://builds.apache.org/job/maven-plugins-ITs-m2/ws/maven-war-plugin/target/test-classes/unit/waroverlays/cache-removed-overlay-test-data/source]>
[INFO] Processing overlay [ id wartests:overlay-two]
[WARNING] File [index.jsp] belonged to overlay [wartests:overlay-one] which does not exist
anymore in the current project. It is recommended to invoke clean if the dependencies of the
project changed.
[WARNING] File [WEB-INF/web.xml] belonged to overlay [wartests:overlay-one] which does not
exist anymore in the current project. It is recommended to invoke clean if the dependencies
of the project changed.
[INFO] Webapp assembled in [5 msecs]
Tests run: 11, Failures: 0, Errors: 0, Skipped: 0, Time elapsed: 7.675 sec
Running org.apache.maven.plugin.war.WarManifestMojoTest
Tests run: 6, Failures: 0, Errors: 0, Skipped: 0, Time elapsed: 0.236 sec
Running org.apache.maven.plugin.war.WarExplodedMojoFilteringTest
[INFO] Exploding webapp
[INFO] Assembling webapp [maven-war-plugin-test] in [<https://builds.apache.org/job/maven-plugins-ITs-m2/ws/maven-war-plugin/target/test-classes/unit/warexplodedmojo/test-dir/ExplodedWar_WithResourceFiltering]>
[INFO] Processing war project
[INFO] Copying webapp webResources [<https://builds.apache.org/job/maven-plugins-ITs-m2/ws/maven-war-plugin/target/test-classes/unit/warexplodedmojo/test-dir/ExplodedWar_WithResourceFiltering-test-data/resources]>
to [<https://builds.apache.org/job/maven-plugins-ITs-m2/ws/maven-war-plugin/target/test-classes/unit/warexplodedmojo/test-dir/ExplodedWar_WithResourceFiltering]>
[INFO] Copying webapp resources [<https://builds.apache.org/job/maven-plugins-ITs-m2/ws/maven-war-plugin/target/test-classes/unit/warexplodedmojo/test-dir/ExplodedWar_WithResourceFiltering-test-data/source]>
[INFO] Webapp assembled in [16 msecs]
 line system_key_1=<https://builds.apache.org/job/maven-plugins-ITs-m2/ws/maven-war-plugin>
 need <https://builds.apache.org/job/maven-plugins-ITs-m2/ws/maven-war-plugin>
 line system_key_2=<https://builds.apache.org/job/maven-plugins-ITs-m2/ws/maven-war-plugin>
[INFO] Exploding webapp
[INFO] Assembling webapp [maven-war-plugin-test] in [<https://builds.apache.org/job/maven-plugins-ITs-m2/ws/maven-war-plugin/target/test-classes/unit/warexplodedmojo/test-dir/ExplodedWar_WithResourceFiltering]>
[INFO] Processing war project
[INFO] Copying webapp webResources [<https://builds.apache.org/job/maven-plugins-ITs-m2/ws/maven-war-plugin/target/test-classes/unit/warexplodedmojo/test-dir/ExplodedWar_WithResourceFiltering-test-data/resources]>
to [<https://builds.apache.org/job/maven-plugins-ITs-m2/ws/maven-war-plugin/target/test-classes/unit/warexplodedmojo/test-dir/ExplodedWar_WithResourceFiltering]>
[INFO] Copying webapp resources [<https://builds.apache.org/job/maven-plugins-ITs-m2/ws/maven-war-plugin/target/test-classes/unit/warexplodedmojo/test-dir/ExplodedWar_WithResourceFiltering-test-data/source]>
[INFO] Webapp assembled in [5 msecs]
[INFO] Exploding webapp
[INFO] Assembling webapp [maven-war-plugin-test] in [<https://builds.apache.org/job/maven-plugins-ITs-m2/ws/maven-war-plugin/target/test-classes/unit/warexplodedmojo/test-dir/ExplodedWar_WithResourceFiltering]>
[INFO] Processing war project
[INFO] Copying webapp webResources [<https://builds.apache.org/job/maven-plugins-ITs-m2/ws/maven-war-plugin/target/test-classes/unit/warexplodedmojo/test-dir/ExplodedWar_WithResourceFiltering-test-data/resources]>
to [<https://builds.apache.org/job/maven-plugins-ITs-m2/ws/maven-war-plugin/target/test-classes/unit/warexplodedmojo/test-dir/ExplodedWar_WithResourceFiltering]>
[INFO] Copying webapp resources [<https://builds.apache.org/job/maven-plugins-ITs-m2/ws/maven-war-plugin/target/test-classes/unit/warexplodedmojo/test-dir/ExplodedWar_WithResourceFiltering-test-data/source]>
[INFO] Webapp assembled in [6 msecs]
Tests run: 1, Failures: 0, Errors: 0, Skipped: 0, Time elapsed: 0.07 sec

Results :

Tests run: 85, Failures: 0, Errors: 0, Skipped: 0

[INFO] [jar:jar {execution: default-jar}]
[INFO] Building jar: <https://builds.apache.org/job/maven-plugins-ITs-m2/ws/maven-war-plugin/target/maven-war-plugin-2.3-SNAPSHOT.jar>
[INFO] [plugin:addPluginArtifactMetadata {execution: default-addPluginArtifactMetadata}]
[INFO] [invoker:install {execution: integration-test}]
[INFO] Installing <https://builds.apache.org/job/maven-plugins-ITs-m2/ws/maven-plugins/pom.xml>
to <https://builds.apache.org/job/maven-plugins-ITs-m2/ws/maven-war-plugin/target/local-repo/org/apache/maven/plugins/maven-plugins/23-SNAPSHOT/maven-plugins-23-SNAPSHOT.pom>
[INFO] Installing <https://builds.apache.org/job/maven-plugins-ITs-m2/ws/maven-war-plugin/pom.xml>
to <https://builds.apache.org/job/maven-plugins-ITs-m2/ws/maven-war-plugin/target/local-repo/org/apache/maven/plugins/maven-war-plugin/2.3-SNAPSHOT/maven-war-plugin-2.3-SNAPSHOT.pom>
[INFO] Installing <https://builds.apache.org/job/maven-plugins-ITs-m2/ws/maven-war-plugin/target/maven-war-plugin-2.3-SNAPSHOT.jar>
to <https://builds.apache.org/job/maven-plugins-ITs-m2/ws/maven-war-plugin/target/local-repo/org/apache/maven/plugins/maven-war-plugin/2.3-SNAPSHOT/maven-war-plugin-2.3-SNAPSHOT.jar>
[INFO] [invoker:integration-test {execution: integration-test}]
[INFO] Building: scoped-dependency-same-artifact/pom.xml
[INFO] run script <https://builds.apache.org/job/maven-plugins-ITs-m2/ws/maven-war-plugin/target/it/scoped-dependency-same-artifact/verify.bsh>
[INFO] ..SUCCESS (4.5 s)
[INFO] Building: MWAR-96/pom.xml
[INFO] run script <https://builds.apache.org/job/maven-plugins-ITs-m2/ws/maven-war-plugin/target/it/MWAR-96/verify.bsh>
[INFO] ..SUCCESS (2.9 s)
[INFO] Building: MWAR-240/pom.xml
[INFO] run script <https://builds.apache.org/job/maven-plugins-ITs-m2/ws/maven-war-plugin/target/it/MWAR-240/verify.bsh>
[INFO] ..SUCCESS (3.3 s)
[INFO] Building: simple-war-no-webxml/pom.xml
[INFO] run script <https://builds.apache.org/job/maven-plugins-ITs-m2/ws/maven-war-plugin/target/it/simple-war-no-webxml/verify.bsh>
[INFO] ..SUCCESS (3.7 s)
[INFO] Building: MWAR-131/pom.xml
[INFO] run script <https://builds.apache.org/job/maven-plugins-ITs-m2/ws/maven-war-plugin/target/it/MWAR-131/verify.bsh>
[INFO] ..FAILED (18.4 s)
[INFO]   The post-build script returned false.
[INFO] Building: MWAR-133/pom.xml
[INFO] run script <https://builds.apache.org/job/maven-plugins-ITs-m2/ws/maven-war-plugin/target/it/MWAR-133/verify.bsh>
[INFO] ..SUCCESS (2.2 s)
[INFO] Building: MWAR-129/pom.xml
[INFO] run script <https://builds.apache.org/job/maven-plugins-ITs-m2/ws/maven-war-plugin/target/it/MWAR-129/verify.bsh>
[INFO] ..SUCCESS (2.3 s)
[INFO] Building: manifest-content/pom.xml
[INFO] run script <https://builds.apache.org/job/maven-plugins-ITs-m2/ws/maven-war-plugin/target/it/manifest-content/verify.bsh>
[INFO] ..SUCCESS (2.8 s)
[INFO] Building: MWAR-62/pom.xml
[INFO] run script <https://builds.apache.org/job/maven-plugins-ITs-m2/ws/maven-war-plugin/target/it/MWAR-62/verify.bsh>
[INFO] ..SUCCESS (2.3 s)
[INFO] Building: default/pom.xml
[INFO] run script <https://builds.apache.org/job/maven-plugins-ITs-m2/ws/maven-war-plugin/target/it/default/verify.bsh>
[INFO] ..SUCCESS (8.0 s)
[INFO] Building: MWAR-143/pom.xml
[INFO] run script <https://builds.apache.org/job/maven-plugins-ITs-m2/ws/maven-war-plugin/target/it/MWAR-143/verify.bsh>
[INFO] ..SUCCESS (7.3 s)
[INFO] Building: web-resources-filtering/pom.xml
[INFO] run script <https://builds.apache.org/job/maven-plugins-ITs-m2/ws/maven-war-plugin/target/it/web-resources-filtering/verify.bsh>
[INFO] ..SUCCESS (4.1 s)
[INFO] Building: simple-war-project/pom.xml
[INFO] run script <https://builds.apache.org/job/maven-plugins-ITs-m2/ws/maven-war-plugin/target/it/simple-war-project/verify.bsh>
[INFO] ..SUCCESS (2.9 s)
[INFO] Building: MWAR-139/pom.xml
[INFO] run script <https://builds.apache.org/job/maven-plugins-ITs-m2/ws/maven-war-plugin/target/it/MWAR-139/verify.bsh>
[INFO] ..SUCCESS (2.9 s)
[INFO] [invoker:verify {execution: integration-test}]
[INFO] -------------------------------------------------
[INFO] Build Summary:
[INFO]   Passed: 13, Failed: 1, Errors: 0, Skipped: 0
[INFO] -------------------------------------------------
[ERROR] The following builds failed:
[ERROR] *  MWAR-131/pom.xml
[INFO] -------------------------------------------------
[INFO] ------------------------------------------------------------------------
[INFO] Building Maven Plugins Aggregator
[INFO]    task-segment: [clean, install]
[INFO] ------------------------------------------------------------------------
[INFO] [clean:clean {execution: default-clean}]
[INFO] Deleting <https://builds.apache.org/job/maven-plugins-ITs-m2/ws/target>
[INFO] [remote-resources:process {execution: default}]
[INFO] [site:attach-descriptor {execution: default-attach-descriptor}]
[INFO] [install:install {execution: default-install}]
[INFO] Installing <https://builds.apache.org/job/maven-plugins-ITs-m2/ws/pom.xml> to
<https://builds.apache.org/job/maven-plugins-ITs-m2/ws/.repository/org/apache/maven/plugins/maven-plugins-aggregator/1-SNAPSHOT/maven-plugins-aggregator-1-SNAPSHOT.pom>
[INFO] 
[INFO] 
[INFO] ------------------------------------------------------------------------
[INFO] Reactor Summary:
[INFO] ------------------------------------------------------------------------
[INFO] Maven Plugins ......................................... SUCCESS [14.446s]
[INFO] Maven ACR Plugin ...................................... SUCCESS [34.802s]
[INFO] Maven Ant Plugin ...................................... SUCCESS [1:10.927s]
[INFO] Maven AntRun Plugin ................................... SUCCESS [53.616s]
[INFO] Maven Eclipse Plugin .................................. SUCCESS [8:06.190s]
[INFO] Maven Assembly Plugin ................................. SUCCESS [13:02.750s]
[INFO] Maven Changelog Plugin ................................ SUCCESS [58.259s]
[INFO] Maven Compiler Plugin ................................. SUCCESS [43.104s]
[INFO] Maven Changes Report Plugin ........................... SUCCESS [1:29.832s]
[INFO] Maven Checkstyle Plugin ............................... SUCCESS [2:30.737s]
[INFO] Maven Clean Plugin .................................... SUCCESS [16.988s]
[INFO] Maven Dependency Plugin ............................... SUCCESS [2:32.342s]
[INFO] Maven Deploy Plugin ................................... SUCCESS [1:11.882s]
[INFO] Maven DOAP Plugin ..................................... SUCCESS [19.414s]
[INFO] Maven Documentation Checker Plugin .................... SUCCESS [11.609s]
[INFO] Maven EAR Plugin ...................................... SUCCESS [3:42.989s]
[INFO] Maven EJB Plugin ...................................... SUCCESS [29.391s]
[INFO] Maven GPG Plugin ...................................... SUCCESS [12.302s]
[INFO] Maven Help Plugin ..................................... SUCCESS [31.914s]
[INFO] Maven IDEA Plugin ..................................... SUCCESS [11.554s]
[INFO] Maven Install Plugin .................................. SUCCESS [39.215s]
[INFO] Maven JAR Plugin ...................................... SUCCESS [1:08.578s]
[INFO] Maven Jarsigner Plugin ................................ SUCCESS [29.613s]
[INFO] Maven Javadoc Plugin .................................. FAILED [2:42.965s]
[INFO] Maven Linkcheck Plugin ................................ SUCCESS [3.937s]
[INFO] Maven One Plugin ...................................... SUCCESS [3.804s]
[INFO] Maven Patch Plugin .................................... SUCCESS [11.379s]
[INFO] Maven PDF Plugin ...................................... FAILED [1:11.882s]
[INFO] Maven PMD Plugin ...................................... SUCCESS [54.950s]
[INFO] Maven RAR Plugin ...................................... SUCCESS [18.252s]
[INFO] Maven Reactor Plugin .................................. SUCCESS [4.490s]
[INFO] Maven Repository Plugin ............................... FAILED [27.162s]
[INFO] Maven Resources Plugin ................................ FAILED [0.841s]
[INFO] Maven Site Plugin 3 ................................... FAILED [7:22.410s]
[INFO] Maven Source Plugin ................................... SUCCESS [41.483s]
[INFO] Maven Stage Plugin .................................... SUCCESS [3.383s]
[INFO] Maven Toolchains Plugin ............................... SUCCESS [2.570s]
[INFO] Maven Verifier Plugin ................................. SUCCESS [15.106s]
[INFO] Maven WAR Plugin ...................................... FAILED [1:33.975s]
[INFO] Maven Plugins Aggregator .............................. SUCCESS [1.199s]
[INFO] ------------------------------------------------------------------------
[INFO] Error for project: Maven Javadoc Plugin (during install)
[INFO] ------------------------------------------------------------------------
[INFO] There are test failures.

Please refer to <https://builds.apache.org/job/maven-plugins-ITs-m2/ws/maven-javadoc-plugin/target/surefire-reports>
for the individual test results.
[INFO] ------------------------------------------------------------------------
[INFO] Error for project: Maven PDF Plugin (during install)
[INFO] ------------------------------------------------------------------------
[INFO] : org.apache.maven.plugin.invoker.InvokerSession@1d830ca
1 build failed.
[INFO] ------------------------------------------------------------------------
[INFO] Error for project: Maven Repository Plugin (during install)
[INFO] ------------------------------------------------------------------------
[INFO] There are test failures.

Please refer to <https://builds.apache.org/job/maven-plugins-ITs-m2/ws/maven-repository-plugin/target/surefire-reports>
for the individual test results.
[INFO] ------------------------------------------------------------------------
[INFO] Error for project: Maven Resources Plugin (during install)
[INFO] ------------------------------------------------------------------------
[INFO] A required plugin was not found: Plugin could not be found - check that the goal name
is correct: Unable to download the artifact from any repository

Try downloading the file manually from the project website.

Then, install it using the command: 
    mvn install:install-file -DgroupId=org.apache.maven.plugins -DartifactId=maven-invoker-plugin
-Dversion=1.7-SNAPSHOT -Dpackaging=maven-plugin -Dfile=/path/to/file

Alternatively, if you host your own repository you can deploy the file there: 
    mvn deploy:deploy-file -DgroupId=org.apache.maven.plugins -DartifactId=maven-invoker-plugin
-Dversion=1.7-SNAPSHOT -Dpackaging=maven-plugin -Dfile=/path/to/file -Durl=[url] -DrepositoryId=[id]


  org.apache.maven.plugins:maven-invoker-plugin:maven-plugin:1.7-SNAPSHOT

from the specified remote repositories:
  central (http://repo1.maven.org/maven2)


  org.apache.maven.plugins:maven-invoker-plugin:maven-plugin:1.7-SNAPSHOT

from the specified remote repositories:
  central (http://repo1.maven.org/maven2)


[INFO] ------------------------------------------------------------------------
[INFO] Error for project: Maven Site Plugin 3 (during install)
[INFO] ------------------------------------------------------------------------
[INFO] 1 build failed. See console output above for details.
[INFO] ------------------------------------------------------------------------
[INFO] Error for project: Maven WAR Plugin (during install)
[INFO] ------------------------------------------------------------------------
[INFO] 1 build failed. See console output above for details.
[INFO] ------------------------------------------------------------------------
[INFO] For more information, run Maven with the -e switch
[INFO] ------------------------------------------------------------------------
[INFO] BUILD ERRORS
[INFO] ------------------------------------------------------------------------
[INFO] Total time: 57 minutes 48 seconds
[INFO] Finished at: Mon Aug 06 08:06:57 UTC 2012
[INFO] Final Memory: 254M/1017M
[INFO] ------------------------------------------------------------------------
Build step 'Invoke top-level Maven targets' marked build as failure

Mime
View raw message