maven-notifications mailing list archives

Site index · List index
Message view « Date » · « Thread »
Top « Date » · « Thread »
From Apache Jenkins Server <jenk...@builds.apache.org>
Subject Build failed in Jenkins: maven-plugins-ITs-m2 #657
Date Tue, 31 Jul 2012 01:02:33 GMT
See <https://builds.apache.org/job/maven-plugins-ITs-m2/657/changes>

Changes:

[olamy] add contributor

[olamy] license header and format

[olamy] [MJAVADOC-334] Patch to make <additionalDependencies> easier and fix typo on
field name
Submitted by Ben Speakmon.

[olamy] add contributor

[olamy] [MWAR-281] Allow Synapse extensions (.xar files) to be imported into WEB-INF/extensions
Submitted by Auke Schrijnen.

[olamy] [MINSTALL-87] Install:install-file on missing file should fail, not indicate success
with bogus jar file message.

[olamy] [MINVOKER-136] upgrade groovy version used to 2.0.1.

[hboutemy] [maven-release-plugin] prepare for next development iteration

[hboutemy] [maven-release-plugin] prepare release maven-dependency-plugin-2.5

[hboutemy] fixed errors reported by Checkstyle

[hboutemy] updated dependencies to released versions

[hboutemy] [maven-release-plugin] prepare for next development iteration

[hboutemy] [maven-release-plugin] prepare release maven-project-info-reports-plugin-2.5

[hboutemy] fixed errors reported by Checkstyle

[hboutemy] updated dependencies to released versions

[olamy] add contributor

[olamy] missed to add new class

[olamy] [MSHADE-112] New property to enable shading the java text inside the sources artifact
(not just shading the java source file locations)
Submitted by Trask Stalnaker.

------------------------------------------
[...truncated 9987 lines...]
[INFO] Processing war project
[INFO] Copying webapp resources [<https://builds.apache.org/job/maven-plugins-ITs-m2/ws/maven-war-plugin/target/test-classes/unit/warexplodedmojo/test-dir/ExplodedWarWithMar-test-data/source]>
[INFO] Webapp assembled in [3 msecs]
[INFO] Exploding webapp
[INFO] Assembling webapp [maven-war-plugin-test] in [<https://builds.apache.org/job/maven-plugins-ITs-m2/ws/maven-war-plugin/target/test-classes/unit/warexplodedmojo/test-dir/ExplodedWarWithXar]>
[INFO] Processing war project
[INFO] Copying webapp resources [<https://builds.apache.org/job/maven-plugins-ITs-m2/ws/maven-war-plugin/target/test-classes/unit/warexplodedmojo/test-dir/ExplodedWarWithXar-test-data/source]>
[INFO] Webapp assembled in [3 msecs]
[INFO] Exploding webapp
[INFO] Assembling webapp [maven-war-plugin-test] in [<https://builds.apache.org/job/maven-plugins-ITs-m2/ws/maven-war-plugin/target/test-classes/unit/warexplodedmojo/test-dir/ExplodedWar_WithDuplicateDependencies]>
[INFO] Processing war project
[INFO] Copying webapp resources [<https://builds.apache.org/job/maven-plugins-ITs-m2/ws/maven-war-plugin/target/test-classes/unit/warexplodedmojo/test-dir/ExplodedWar_WithDuplicateDependencies-test-data/source]>
[INFO] Webapp assembled in [3 msecs]
[INFO] Exploding webapp
[INFO] Assembling webapp [maven-war-plugin-test] in [<https://builds.apache.org/job/maven-plugins-ITs-m2/ws/maven-war-plugin/target/test-classes/unit/warexplodedmojo/test-dir/ExplodedWar_DuplicateWithClassifier]>
[INFO] Processing war project
[INFO] Copying webapp resources [<https://builds.apache.org/job/maven-plugins-ITs-m2/ws/maven-war-plugin/target/test-classes/unit/warexplodedmojo/test-dir/ExplodedWar_DuplicateWithClassifier-test-data/source]>
[INFO] Webapp assembled in [4 msecs]
[INFO] Exploding webapp
[INFO] Assembling webapp [maven-war-plugin-test] in [<https://builds.apache.org/job/maven-plugins-ITs-m2/ws/maven-war-plugin/target/test-classes/unit/warexplodedmojo/test-dir/ExplodedWar_WithClasses]>
[INFO] Processing war project
[INFO] Copying webapp resources [<https://builds.apache.org/job/maven-plugins-ITs-m2/ws/maven-war-plugin/target/test-classes/unit/warexplodedmojo/test-dir/ExplodedWar_WithClasses-test-data/source]>
[INFO] Webapp assembled in [3 msecs]
[INFO] Exploding webapp
[INFO] Assembling webapp [maven-war-plugin-test] in [<https://builds.apache.org/job/maven-plugins-ITs-m2/ws/maven-war-plugin/target/test-classes/unit/warexplodedmojo/test-dir/ExplodedWar_WithSourceIncludeExclude]>
[INFO] Processing war project
[INFO] Copying webapp resources [<https://builds.apache.org/job/maven-plugins-ITs-m2/ws/maven-war-plugin/target/test-classes/unit/warexplodedmojo/test-dir/ExplodedWar_WithSourceIncludeExclude-test-data/source]>
[INFO] Webapp assembled in [1 msecs]
[INFO] Exploding webapp
[INFO] Assembling webapp [maven-war-plugin-test] in [<https://builds.apache.org/job/maven-plugins-ITs-m2/ws/maven-war-plugin/target/test-classes/unit/warexplodedmojo/test-dir/ExplodedWar_WithWarDependencyIncludeExclude]>
[INFO] Processing war project
[INFO] Copying webapp resources [<https://builds.apache.org/job/maven-plugins-ITs-m2/ws/maven-war-plugin/target/test-classes/unit/warexplodedmojo/test-dir/ExplodedWar_WithWarDependencyIncludeExclude-test-data/source]>
[INFO] Processing overlay [ id wartests:war-include-exclude]
[INFO] Webapp assembled in [7 msecs]
[INFO] Exploding webapp
[INFO] Assembling webapp [maven-war-plugin-test] in [<https://builds.apache.org/job/maven-plugins-ITs-m2/ws/maven-war-plugin/target/test-classes/unit/warexplodedmojo/test-dir/ExplodedWarWithSourceModificationCheck]>
[INFO] Processing war project
[INFO] Copying webapp resources [<https://builds.apache.org/job/maven-plugins-ITs-m2/ws/maven-war-plugin/target/test-classes/unit/warexplodedmojo/test-dir/ExplodedWarWithSourceModificationCheck-test-data/source]>
[INFO] Webapp assembled in [3 msecs]
[INFO] Exploding webapp
[INFO] Assembling webapp [maven-war-plugin-test] in [<https://builds.apache.org/job/maven-plugins-ITs-m2/ws/maven-war-plugin/target/test-classes/unit/warexplodedmojo/test-dir/ExplodedWarWithFileNameMapping]>
[INFO] Processing war project
[INFO] Copying webapp resources [<https://builds.apache.org/job/maven-plugins-ITs-m2/ws/maven-war-plugin/target/test-classes/unit/warexplodedmojo/test-dir/ExplodedWarWithFileNameMapping-test-data/source]>
[INFO] Webapp assembled in [2 msecs]
[INFO] Exploding webapp
[INFO] Assembling webapp [maven-war-plugin-test] in [<https://builds.apache.org/job/maven-plugins-ITs-m2/ws/maven-war-plugin/target/test-classes/unit/warexplodedmojo/test-dir/ExplodedWarWithFileNameMappingAndDuplicateDependencies]>
[INFO] Processing war project
[INFO] Copying webapp resources [<https://builds.apache.org/job/maven-plugins-ITs-m2/ws/maven-war-plugin/target/test-classes/unit/warexplodedmojo/test-dir/ExplodedWarWithFileNameMappingAndDuplicateDependencies-test-data/source]>
[INFO] Webapp assembled in [3 msecs]
Tests run: 22, Failures: 0, Errors: 0, Skipped: 0, Time elapsed: 0.956 sec
Running org.apache.maven.plugin.war.WarInPlaceMojoTest
[INFO] Generating webapp in source directory [<https://builds.apache.org/job/maven-plugins-ITs-m2/ws/maven-war-plugin/target/test-classes/unit/warexplodedinplacemojo/test-dir/SimpleExplodedInplaceWar-test-data/source]>
[INFO] Assembling webapp [maven-war-plugin-test] in [<https://builds.apache.org/job/maven-plugins-ITs-m2/ws/maven-war-plugin/target/test-classes/unit/warexplodedinplacemojo/test-dir/SimpleExplodedInplaceWar-test-data/source]>
[INFO] Processing war project
[INFO] Copying webapp webResources [<https://builds.apache.org/job/maven-plugins-ITs-m2/ws/maven-war-plugin/target/test-classes/unit/warexplodedinplacemojo/test-dir/resources]>
to [<https://builds.apache.org/job/maven-plugins-ITs-m2/ws/maven-war-plugin/target/test-classes/unit/warexplodedinplacemojo/test-dir/SimpleExplodedInplaceWar-test-data/source]>
[INFO] Webapp assembled in [2 msecs]
Tests run: 2, Failures: 0, Errors: 0, Skipped: 0, Time elapsed: 0.104 sec

Results :

Tests run: 85, Failures: 0, Errors: 0, Skipped: 0

[INFO] [jar:jar {execution: default-jar}]
[INFO] Building jar: <https://builds.apache.org/job/maven-plugins-ITs-m2/ws/maven-war-plugin/target/maven-war-plugin-2.3-SNAPSHOT.jar>
[INFO] [plugin:addPluginArtifactMetadata {execution: default-addPluginArtifactMetadata}]
[INFO] [invoker:install {execution: integration-test}]
[INFO] Installing <https://builds.apache.org/job/maven-plugins-ITs-m2/ws/maven-plugins/pom.xml>
to <https://builds.apache.org/job/maven-plugins-ITs-m2/ws/maven-war-plugin/target/local-repo/org/apache/maven/plugins/maven-plugins/23-SNAPSHOT/maven-plugins-23-SNAPSHOT.pom>
[INFO] Installing <https://builds.apache.org/job/maven-plugins-ITs-m2/ws/maven-war-plugin/pom.xml>
to <https://builds.apache.org/job/maven-plugins-ITs-m2/ws/maven-war-plugin/target/local-repo/org/apache/maven/plugins/maven-war-plugin/2.3-SNAPSHOT/maven-war-plugin-2.3-SNAPSHOT.pom>
[INFO] Installing <https://builds.apache.org/job/maven-plugins-ITs-m2/ws/maven-war-plugin/target/maven-war-plugin-2.3-SNAPSHOT.jar>
to <https://builds.apache.org/job/maven-plugins-ITs-m2/ws/maven-war-plugin/target/local-repo/org/apache/maven/plugins/maven-war-plugin/2.3-SNAPSHOT/maven-war-plugin-2.3-SNAPSHOT.jar>
[INFO] [invoker:integration-test {execution: integration-test}]
[INFO] Building: simple-war-project/pom.xml
[INFO] run script <https://builds.apache.org/job/maven-plugins-ITs-m2/ws/maven-war-plugin/target/it/simple-war-project/verify.bsh>
[INFO] ..SUCCESS (3.4 s)
[INFO] Building: MWAR-143/pom.xml
[INFO] run script <https://builds.apache.org/job/maven-plugins-ITs-m2/ws/maven-war-plugin/target/it/MWAR-143/verify.bsh>
[INFO] ..SUCCESS (7.9 s)
[INFO] Building: MWAR-139/pom.xml
[INFO] run script <https://builds.apache.org/job/maven-plugins-ITs-m2/ws/maven-war-plugin/target/it/MWAR-139/verify.bsh>
[INFO] ..SUCCESS (2.9 s)
[INFO] Building: MWAR-133/pom.xml
[INFO] run script <https://builds.apache.org/job/maven-plugins-ITs-m2/ws/maven-war-plugin/target/it/MWAR-133/verify.bsh>
[INFO] ..SUCCESS (2.2 s)
[INFO] Building: scoped-dependency-same-artifact/pom.xml
[INFO] run script <https://builds.apache.org/job/maven-plugins-ITs-m2/ws/maven-war-plugin/target/it/scoped-dependency-same-artifact/verify.bsh>
[INFO] ..SUCCESS (3.6 s)
[INFO] Building: simple-war-no-webxml/pom.xml
[INFO] run script <https://builds.apache.org/job/maven-plugins-ITs-m2/ws/maven-war-plugin/target/it/simple-war-no-webxml/verify.bsh>
[INFO] ..SUCCESS (2.8 s)
[INFO] Building: MWAR-62/pom.xml
[INFO] run script <https://builds.apache.org/job/maven-plugins-ITs-m2/ws/maven-war-plugin/target/it/MWAR-62/verify.bsh>
[INFO] ..SUCCESS (2.2 s)
[INFO] Building: web-resources-filtering/pom.xml
[INFO] run script <https://builds.apache.org/job/maven-plugins-ITs-m2/ws/maven-war-plugin/target/it/web-resources-filtering/verify.bsh>
[INFO] ..SUCCESS (3.7 s)
[INFO] Building: MWAR-96/pom.xml
[INFO] run script <https://builds.apache.org/job/maven-plugins-ITs-m2/ws/maven-war-plugin/target/it/MWAR-96/verify.bsh>
[INFO] ..SUCCESS (2.9 s)
[INFO] Building: MWAR-240/pom.xml
[INFO] run script <https://builds.apache.org/job/maven-plugins-ITs-m2/ws/maven-war-plugin/target/it/MWAR-240/verify.bsh>
[INFO] ..SUCCESS (3.2 s)
[INFO] Building: MWAR-131/pom.xml
[INFO] run script <https://builds.apache.org/job/maven-plugins-ITs-m2/ws/maven-war-plugin/target/it/MWAR-131/verify.bsh>
[INFO] ..SUCCESS (6.5 s)
[INFO] Building: default/pom.xml
[INFO] run script <https://builds.apache.org/job/maven-plugins-ITs-m2/ws/maven-war-plugin/target/it/default/verify.bsh>
[INFO] ..SUCCESS (3.4 s)
[INFO] Building: manifest-content/pom.xml
[INFO] run script <https://builds.apache.org/job/maven-plugins-ITs-m2/ws/maven-war-plugin/target/it/manifest-content/verify.bsh>
[INFO] ..SUCCESS (2.9 s)
[INFO] Building: MWAR-129/pom.xml
[INFO] run script <https://builds.apache.org/job/maven-plugins-ITs-m2/ws/maven-war-plugin/target/it/MWAR-129/verify.bsh>
[INFO] ..SUCCESS (2.3 s)
[INFO] [invoker:verify {execution: integration-test}]
[INFO] -------------------------------------------------
[INFO] Build Summary:
[INFO]   Passed: 14, Failed: 0, Errors: 0, Skipped: 0
[INFO] -------------------------------------------------
[INFO] [install:install {execution: default-install}]
[INFO] Installing <https://builds.apache.org/job/maven-plugins-ITs-m2/ws/maven-war-plugin/target/maven-war-plugin-2.3-SNAPSHOT.jar>
to <https://builds.apache.org/job/maven-plugins-ITs-m2/ws/.repository/org/apache/maven/plugins/maven-war-plugin/2.3-SNAPSHOT/maven-war-plugin-2.3-SNAPSHOT.jar>
[INFO] ------------------------------------------------------------------------
[INFO] Building Maven Plugins Aggregator
[INFO]    task-segment: [clean, install]
[INFO] ------------------------------------------------------------------------
[INFO] [clean:clean {execution: default-clean}]
[INFO] Deleting <https://builds.apache.org/job/maven-plugins-ITs-m2/ws/target>
[INFO] [remote-resources:process {execution: default}]
[INFO] [site:attach-descriptor {execution: default-attach-descriptor}]
[INFO] [install:install {execution: default-install}]
[INFO] Installing <https://builds.apache.org/job/maven-plugins-ITs-m2/ws/pom.xml> to
<https://builds.apache.org/job/maven-plugins-ITs-m2/ws/.repository/org/apache/maven/plugins/maven-plugins-aggregator/1-SNAPSHOT/maven-plugins-aggregator-1-SNAPSHOT.pom>
[INFO] 
[INFO] 
[INFO] ------------------------------------------------------------------------
[INFO] Reactor Summary:
[INFO] ------------------------------------------------------------------------
[INFO] Maven Plugins ......................................... SUCCESS [13.757s]
[INFO] Maven ACR Plugin ...................................... SUCCESS [25.069s]
[INFO] Maven Ant Plugin ...................................... SUCCESS [1:09.814s]
[INFO] Maven AntRun Plugin ................................... SUCCESS [49.854s]
[INFO] Maven Eclipse Plugin .................................. SUCCESS [6:47.681s]
[INFO] Maven Assembly Plugin ................................. SUCCESS [11:37.134s]
[INFO] Maven Changelog Plugin ................................ SUCCESS [46.832s]
[INFO] Maven Compiler Plugin ................................. SUCCESS [33.833s]
[INFO] Maven Changes Report Plugin ........................... SUCCESS [1:13.492s]
[INFO] Maven Checkstyle Plugin ............................... SUCCESS [1:52.688s]
[INFO] Maven Clean Plugin .................................... SUCCESS [17.086s]
[INFO] Maven Dependency Plugin ............................... FAILED [3.862s]
[INFO] Maven Deploy Plugin ................................... SUCCESS [59.698s]
[INFO] Maven DOAP Plugin ..................................... SUCCESS [17.868s]
[INFO] Maven Documentation Checker Plugin .................... SUCCESS [7.786s]
[INFO] Maven EAR Plugin ...................................... SUCCESS [3:16.828s]
[INFO] Maven EJB Plugin ...................................... SUCCESS [28.203s]
[INFO] Maven GPG Plugin ...................................... SUCCESS [10.971s]
[INFO] Maven Help Plugin ..................................... SUCCESS [30.732s]
[INFO] Maven IDEA Plugin ..................................... SUCCESS [9.147s]
[INFO] Maven Install Plugin .................................. SUCCESS [37.657s]
[INFO] Maven JAR Plugin ...................................... SUCCESS [1:06.105s]
[INFO] Maven Jarsigner Plugin ................................ SUCCESS [24.681s]
[INFO] Maven Javadoc Plugin .................................. SUCCESS [5:40.766s]
[INFO] Maven Linkcheck Plugin ................................ SUCCESS [3.298s]
[INFO] Maven One Plugin ...................................... SUCCESS [1.763s]
[INFO] Maven Patch Plugin .................................... SUCCESS [12.305s]
[INFO] Maven PDF Plugin ...................................... SUCCESS [46.416s]
[INFO] Maven PMD Plugin ...................................... SUCCESS [49.593s]
[INFO] Maven RAR Plugin ...................................... SUCCESS [6.786s]
[INFO] Maven Reactor Plugin .................................. SUCCESS [4.027s]
[INFO] Maven Repository Plugin ............................... FAILED [26.429s]
[INFO] Maven Resources Plugin ................................ FAILED [0.336s]
[INFO] Maven Site Plugin 3 ................................... SUCCESS [7:00.471s]
[INFO] Maven Source Plugin ................................... SUCCESS [43.064s]
[INFO] Maven Stage Plugin .................................... SUCCESS [2.583s]
[INFO] Maven Toolchains Plugin ............................... SUCCESS [2.392s]
[INFO] Maven Verifier Plugin ................................. SUCCESS [14.126s]
[INFO] Maven WAR Plugin ...................................... SUCCESS [1:08.234s]
[INFO] Maven Plugins Aggregator .............................. SUCCESS [1.183s]
[INFO] ------------------------------------------------------------------------
[INFO] Error for project: Maven Dependency Plugin (during install)
[INFO] ------------------------------------------------------------------------
[INFO] Failed to resolve artifact.

Missing:
----------
1) org.apache.maven.shared:maven-dependency-tree:jar:2.0

  Try downloading the file manually from the project website.

  Then, install it using the command: 
      mvn install:install-file -DgroupId=org.apache.maven.shared -DartifactId=maven-dependency-tree
-Dversion=2.0 -Dpackaging=jar -Dfile=/path/to/file

  Alternatively, if you host your own repository you can deploy the file there: 
      mvn deploy:deploy-file -DgroupId=org.apache.maven.shared -DartifactId=maven-dependency-tree
-Dversion=2.0 -Dpackaging=jar -Dfile=/path/to/file -Durl=[url] -DrepositoryId=[id]

  Path to dependency: 
  	1) org.apache.maven.plugins:maven-dependency-plugin:maven-plugin:2.6-SNAPSHOT
  	2) org.apache.maven.shared:maven-dependency-tree:jar:2.0

----------
1 required artifact is missing.

for artifact: 
  org.apache.maven.plugins:maven-dependency-plugin:maven-plugin:2.6-SNAPSHOT

from the specified remote repositories:
  central (http://repo1.maven.org/maven2),
  Nexus (http://repository.apache.org/snapshots)



[INFO] ------------------------------------------------------------------------
[INFO] Error for project: Maven Repository Plugin (during install)
[INFO] ------------------------------------------------------------------------
[INFO] There are test failures.

Please refer to <https://builds.apache.org/job/maven-plugins-ITs-m2/ws/maven-repository-plugin/target/surefire-reports>
for the individual test results.
[INFO] ------------------------------------------------------------------------
[INFO] Error for project: Maven Resources Plugin (during install)
[INFO] ------------------------------------------------------------------------
[INFO] A required plugin was not found: Plugin could not be found - check that the goal name
is correct: Unable to download the artifact from any repository

Try downloading the file manually from the project website.

Then, install it using the command: 
    mvn install:install-file -DgroupId=org.apache.maven.plugins -DartifactId=maven-invoker-plugin
-Dversion=1.7-SNAPSHOT -Dpackaging=maven-plugin -Dfile=/path/to/file

Alternatively, if you host your own repository you can deploy the file there: 
    mvn deploy:deploy-file -DgroupId=org.apache.maven.plugins -DartifactId=maven-invoker-plugin
-Dversion=1.7-SNAPSHOT -Dpackaging=maven-plugin -Dfile=/path/to/file -Durl=[url] -DrepositoryId=[id]


  org.apache.maven.plugins:maven-invoker-plugin:maven-plugin:1.7-SNAPSHOT

from the specified remote repositories:
  central (http://repo1.maven.org/maven2)


  org.apache.maven.plugins:maven-invoker-plugin:maven-plugin:1.7-SNAPSHOT

from the specified remote repositories:
  central (http://repo1.maven.org/maven2)


[INFO] ------------------------------------------------------------------------
[INFO] For more information, run Maven with the -e switch
[INFO] ------------------------------------------------------------------------
[INFO] BUILD ERRORS
[INFO] ------------------------------------------------------------------------
[INFO] Total time: 51 minutes 27 seconds
[INFO] Finished at: Tue Jul 31 01:02:29 UTC 2012
[INFO] Final Memory: 245M/1017M
[INFO] ------------------------------------------------------------------------
Build step 'Invoke top-level Maven targets' marked build as failure

Mime
View raw message