maven-notifications mailing list archives

Site index · List index
Message view « Date » · « Thread »
Top « Date » · « Thread »
From Apache Jenkins Server <jenk...@builds.apache.org>
Subject Build failed in Jenkins: maven-plugins-ITs-m3 #512
Date Tue, 03 Jul 2012 18:44:31 GMT
See <https://builds.apache.org/job/maven-plugins-ITs-m3/512/changes>

Changes:

[olamy] use last parent

[olamy] move plugin-plugin version to a property

[olamy] [MSITE-643] use maven-plugin-tools' java 5 annotations
Submitted by Tony Chemit.

[olamy] upgrade maven parent in it and set pmd plugin version use could break locally with
a snapshot installed

------------------------------------------
[...truncated 9906 lines...]
[INFO] Mojo extractor for language: java-annotations found 1 mojo descriptors.
[INFO] 
[INFO] --- plexus-component-metadata:1.5.5:generate-metadata (default) @ maven-shade-plugin
---
[INFO] Discovered 1 component descriptors(s)
[INFO] 
[INFO] --- maven-resources-plugin:2.5:testResources (default-testResources) @ maven-shade-plugin
---
[debug] execute contextualize
[INFO] Using 'UTF-8' encoding to copy filtered resources.
[INFO] Copying 3 resources
[INFO] Copying 3 resources
[INFO] 
[INFO] --- maven-compiler-plugin:2.3.2:testCompile (default-testCompile) @ maven-shade-plugin
---
[INFO] Compiling 15 source files to /x1/jenkins/jenkins-slave/workspace/maven-plugins-ITs-m3/maven-shade-plugin/target/test-classes
[INFO] 
[INFO] --- plexus-component-metadata:1.5.5:generate-test-metadata (default) @ maven-shade-plugin
---
[INFO] Discovered 1 component descriptors(s)
[INFO] 
[INFO] --- maven-surefire-plugin:2.9:test (default-test) @ maven-shade-plugin ---
[INFO] Surefire report directory: /x1/jenkins/jenkins-slave/workspace/maven-plugins-ITs-m3/maven-shade-plugin/target/surefire-reports

-------------------------------------------------------
 T E S T S
-------------------------------------------------------
Running org.apache.maven.plugins.shade.mojo.ArtifactSelectorTest
Tests run: 1, Failures: 0, Errors: 0, Skipped: 0, Time elapsed: 0.068 sec
Running org.apache.maven.plugins.shade.mojo.ShadeMojoTest
Tests run: 4, Failures: 0, Errors: 0, Skipped: 0, Time elapsed: 5.878 sec
Running org.apache.maven.plugins.shade.mojo.RelativizePathTest
Tests run: 1, Failures: 0, Errors: 0, Skipped: 0, Time elapsed: 0.026 sec
Running org.apache.maven.plugins.shade.mojo.ArtifactIdTest
Tests run: 2, Failures: 0, Errors: 0, Skipped: 0, Time elapsed: 0.003 sec
Running org.apache.maven.plugins.shade.DefaultShaderTest
Tests run: 4, Failures: 0, Errors: 0, Skipped: 0, Time elapsed: 1.71 sec
Running org.apache.maven.plugins.shade.relocation.SimpleRelocatorTest
Tests run: 7, Failures: 0, Errors: 0, Skipped: 0, Time elapsed: 0.014 sec
Running org.apache.maven.plugins.shade.relocation.SimpleRelocatorParameterTest
Tests run: 2, Failures: 0, Errors: 0, Skipped: 0, Time elapsed: 0.005 sec
Running org.apache.maven.plugins.shade.filter.SimpleFilterTest
Tests run: 1, Failures: 0, Errors: 0, Skipped: 0, Time elapsed: 0.004 sec
Running org.apache.maven.plugins.shade.resource.AppendingTransformerTest
Tests run: 1, Failures: 0, Errors: 0, Skipped: 0, Time elapsed: 0.006 sec
Running org.apache.maven.plugins.shade.resource.ApacheLicenseResourceTransformerTest
Tests run: 1, Failures: 0, Errors: 0, Skipped: 0, Time elapsed: 0.004 sec
Running org.apache.maven.plugins.shade.resource.ApacheNoticeResourceTransformerTest
Tests run: 1, Failures: 0, Errors: 0, Skipped: 0, Time elapsed: 0.006 sec
Running org.apache.maven.plugins.shade.resource.ComponentsXmlResourceTransformerTest
Tests run: 1, Failures: 0, Errors: 0, Skipped: 0, Time elapsed: 0.186 sec
Running org.apache.maven.plugins.shade.resource.XmlAppendingTransformerTest
Tests run: 1, Failures: 0, Errors: 0, Skipped: 0, Time elapsed: 0.017 sec

Results :

Tests run: 27, Failures: 0, Errors: 0, Skipped: 0

[INFO] 
[INFO] --- maven-jar-plugin:2.3.1:jar (default-jar) @ maven-shade-plugin ---
[INFO] Building jar: /x1/jenkins/jenkins-slave/workspace/maven-plugins-ITs-m3/maven-shade-plugin/target/maven-shade-plugin-2.0-SNAPSHOT.jar
[INFO] 
[INFO] --- maven-plugin-plugin:3.0:addPluginArtifactMetadata (default-addPluginArtifactMetadata)
@ maven-shade-plugin ---
[INFO] 
[INFO] --- maven-jar-plugin:2.3.1:test-jar (default) @ maven-shade-plugin ---
[INFO] Building jar: /x1/jenkins/jenkins-slave/workspace/maven-plugins-ITs-m3/maven-shade-plugin/target/maven-shade-plugin-2.0-SNAPSHOT-tests.jar
[INFO] 
[INFO] --- maven-invoker-plugin:1.5:install (integration-test) @ maven-shade-plugin ---
[INFO] Installing /x1/jenkins/jenkins-slave/workspace/maven-plugins-ITs-m3/maven-shade-plugin/pom.xml
to /x1/jenkins/jenkins-slave/workspace/maven-plugins-ITs-m3/maven-shade-plugin/target/local-repo/org/apache/maven/plugins/maven-shade-plugin/2.0-SNAPSHOT/maven-shade-plugin-2.0-SNAPSHOT.pom
[INFO] Installing /x1/jenkins/jenkins-slave/workspace/maven-plugins-ITs-m3/maven-shade-plugin/target/maven-shade-plugin-2.0-SNAPSHOT.jar
to /x1/jenkins/jenkins-slave/workspace/maven-plugins-ITs-m3/maven-shade-plugin/target/local-repo/org/apache/maven/plugins/maven-shade-plugin/2.0-SNAPSHOT/maven-shade-plugin-2.0-SNAPSHOT.jar
[INFO] Installing /x1/jenkins/jenkins-slave/workspace/maven-plugins-ITs-m3/maven-shade-plugin/target/maven-shade-plugin-2.0-SNAPSHOT-tests.jar
to /x1/jenkins/jenkins-slave/workspace/maven-plugins-ITs-m3/maven-shade-plugin/target/local-repo/org/apache/maven/plugins/maven-shade-plugin/2.0-SNAPSHOT/maven-shade-plugin-2.0-SNAPSHOT-tests.jar
[INFO] 
[INFO] --- maven-invoker-plugin:1.5:integration-test (integration-test) @ maven-shade-plugin
---
[INFO] Building: project-with-reactors-included/pom.xml
[INFO] ..SUCCESS (16.0 s)
[INFO] Building: manifest-retained/pom.xml
[INFO] ..SUCCESS (12.8 s)
[INFO] Building: duplicate-classes-with-reloc/pom.xml
[INFO] ..SUCCESS (8.4 s)
[INFO] Building: dep-reduced-pom/pom.xml
[INFO] ..SUCCESS (12.9 s)
[INFO] Building: dep-reduced-pom-with-local-parent/pom.xml
[INFO] ..SUCCESS (7.9 s)
[INFO] Building: mshade-123/pom.xml
[INFO] ..SUCCESS (16.7 s)
[INFO] Building: finalNameBuild/pom.xml
[INFO] ..SUCCESS (10.9 s)
[INFO] Building: empty-relocation-pattern/pom.xml
[INFO] ..SUCCESS (8.6 s)
[INFO] Building: non-runtime-scope-excluded/pom.xml
[INFO] ..SUCCESS (11.8 s)
[INFO] Building: attach-after-lifecycle-fork/pom.xml
[INFO] ..SUCCESS (10.1 s)
[INFO] Building: empty-relocation-shaded-pattern/pom.xml
[INFO] ..SUCCESS (11.2 s)
[INFO] Building: MSHADE-105/pom.xml
[INFO] ..SUCCESS (21.0 s)
[INFO] Building: rerun-without-reloc/pom.xml
[INFO] ..SUCCESS (7.8 s)
[INFO] Building: users-shader-impl/pom.xml
[INFO] ..SUCCESS (12.5 s)
[INFO] Building: finalNameBuild-attached/pom.xml
[INFO] ..SUCCESS (12.6 s)
[INFO] Building: reloc-enum-ref-from-anno/pom.xml
[INFO] ..SUCCESS (13.2 s)
[INFO] Building: xml-transformer-ignores-dtd/pom.xml
[INFO] ..SUCCESS (10.2 s)
[INFO] Building: empty-apache-notice-transform/pom.xml
[INFO] ..SUCCESS (13.0 s)
[INFO] Building: duplicate-classes-without-reloc/pom.xml
[INFO] ..SUCCESS (9.4 s)
[INFO] Building: component-descriptor-relocation/pom.xml
[INFO] ..SUCCESS (15.5 s)
[INFO] Building: manifest-transformed/pom.xml
[INFO] ..SUCCESS (16.3 s)
[INFO] Building: mini-jar-malformed-dependencies/pom.xml
[INFO] ..SUCCESS (18.2 s)
[INFO] Building: finalNameShade/pom.xml
[INFO] ..SUCCESS (9.6 s)
[INFO] Building: dep-reduced-pom-relocated-result/pom.xml
[INFO] ..SUCCESS (6.0 s)
[INFO] Building: reloc-abs-resource-path/pom.xml
[INFO] ..SUCCESS (15.9 s)
[INFO] Building: pom-packaging/pom.xml
[INFO] ..SUCCESS (7.8 s)
[INFO] Building: artifact-includes-excludes/pom.xml
[INFO] ..SUCCESS (10.5 s)
[INFO] Building: mini-jar-respect-includes/pom.xml
[INFO] ..SUCCESS (14.8 s)
[INFO] Building: services-resource-transformer/pom.xml
[INFO] ..SUCCESS (11.8 s)
[INFO] Building: shadePomDependency/pom.xml
[INFO] ..SUCCESS (12.9 s)
[INFO] Building: reloc-includes-excludes/pom.xml
[INFO] ..SUCCESS (11.3 s)
[INFO] Building: rerun-with-reloc/pom.xml
[INFO] ..SUCCESS (12.4 s)
[INFO] Building: mini-jar-package-info/pom.xml
[INFO] ..SUCCESS (14.1 s)
[INFO] Building: attached-artifact-type/pom.xml
[INFO] ..SUCCESS (7.8 s)
[INFO] Building: implicit-inclusion-of-project-artifact/pom.xml
[INFO] ..SUCCESS (9.9 s)
[INFO] Building: finalNameShade-attached/pom.xml
[INFO] ..SUCCESS (11.2 s)
[INFO] Building: mini-jar/pom.xml
[INFO] ..SUCCESS (11.8 s)
[INFO] Building: reloc-anno/pom.xml
[INFO] ..SUCCESS (10.0 s)
[INFO] Building: filter-artifact-contents/pom.xml
[INFO] ..SUCCESS (11.1 s)
[INFO] Building: reloc-class-from-string-pool/pom.xml
[INFO] ..SUCCESS (9.3 s)
[INFO] 
[INFO] --- maven-invoker-plugin:1.5:verify (integration-test) @ maven-shade-plugin ---
[INFO] -------------------------------------------------
[INFO] Build Summary:
[INFO]   Passed: 40, Failed: 0, Errors: 0, Skipped: 0
[INFO] -------------------------------------------------
[INFO] 
[INFO] --- maven-install-plugin:2.3.1:install (default-install) @ maven-shade-plugin ---
[INFO] Installing /x1/jenkins/jenkins-slave/workspace/maven-plugins-ITs-m3/maven-shade-plugin/target/maven-shade-plugin-2.0-SNAPSHOT.jar
to <https://builds.apache.org/job/maven-plugins-ITs-m3/ws/.repository/org/apache/maven/plugins/maven-shade-plugin/2.0-SNAPSHOT/maven-shade-plugin-2.0-SNAPSHOT.jar>
[INFO] Installing /x1/jenkins/jenkins-slave/workspace/maven-plugins-ITs-m3/maven-shade-plugin/pom.xml
to <https://builds.apache.org/job/maven-plugins-ITs-m3/ws/.repository/org/apache/maven/plugins/maven-shade-plugin/2.0-SNAPSHOT/maven-shade-plugin-2.0-SNAPSHOT.pom>
[INFO] Installing /x1/jenkins/jenkins-slave/workspace/maven-plugins-ITs-m3/maven-shade-plugin/target/maven-shade-plugin-2.0-SNAPSHOT-tests.jar
to <https://builds.apache.org/job/maven-plugins-ITs-m3/ws/.repository/org/apache/maven/plugins/maven-shade-plugin/2.0-SNAPSHOT/maven-shade-plugin-2.0-SNAPSHOT-tests.jar>
[INFO]                                                                         
[INFO] ------------------------------------------------------------------------
[INFO] Building Maven Plugins Aggregator 1-SNAPSHOT
[INFO] ------------------------------------------------------------------------
[INFO] 
[INFO] --- maven-clean-plugin:2.4.1:clean (default-clean) @ maven-plugins-aggregator ---
[INFO] Deleting /x1/jenkins/jenkins-slave/workspace/maven-plugins-ITs-m3/target
[INFO] 
[INFO] --- maven-remote-resources-plugin:1.1:process (default) @ maven-plugins-aggregator
---
[INFO] 
[INFO] --- maven-install-plugin:2.3.1:install (default-install) @ maven-plugins-aggregator
---
[INFO] Installing /x1/jenkins/jenkins-slave/workspace/maven-plugins-ITs-m3/pom.xml to <https://builds.apache.org/job/maven-plugins-ITs-m3/ws/.repository/org/apache/maven/plugins/maven-plugins-aggregator/1-SNAPSHOT/maven-plugins-aggregator-1-SNAPSHOT.pom>
[INFO] ------------------------------------------------------------------------
[INFO] Reactor Summary:
[INFO] 
[INFO] Maven Plugins ..................................... SUCCESS [10.384s]
[INFO] Maven ACR Plugin .................................. SUCCESS [59.323s]
[INFO] Maven Ant Plugin .................................. SUCCESS [3:16.066s]
[INFO] Maven AntRun Plugin ............................... SUCCESS [2:35.108s]
[INFO] Maven Eclipse Plugin .............................. SUCCESS [16:38.211s]
[INFO] Maven Assembly Plugin ............................. SUCCESS [30:49.182s]
[INFO] Maven Changelog Plugin ............................ SUCCESS [2:09.781s]
[INFO] Maven Changes Report Plugin ....................... FAILURE [0.004s]
[INFO] Maven Checkstyle Plugin ........................... SUCCESS [4:34.846s]
[INFO] Maven Clean Plugin ................................ SUCCESS [59.730s]
[INFO] Maven Compiler Plugin ............................. SUCCESS [1:46.071s]
[INFO] Maven Dependency Plugin ........................... SUCCESS [4:50.591s]
[INFO] Maven Deploy Plugin ............................... SUCCESS [2:55.967s]
[INFO] Maven DOAP Plugin ................................. SUCCESS [43.249s]
[INFO] Maven Documentation Checker Plugin ................ SUCCESS [15.045s]
[INFO] Maven EAR Plugin .................................. SUCCESS [10:02.070s]
[INFO] Maven EJB Plugin .................................. SUCCESS [1:18.201s]
[INFO] Maven GPG Plugin .................................. SUCCESS [1:53.301s]
[INFO] Maven Help Plugin ................................. SUCCESS [1:41.531s]
[INFO] Maven IDEA Plugin ................................. SUCCESS [16.987s]
[INFO] Maven Install Plugin .............................. SUCCESS [1:41.871s]
[INFO] Maven JAR Plugin .................................. FAILURE [0.001s]
[INFO] Maven Jarsigner Plugin ............................ SUCCESS [1:16.041s]
[INFO] Maven Javadoc Plugin .............................. SUCCESS [10:01.220s]
[INFO] Maven Linkcheck Plugin ............................ SUCCESS [4.411s]
[INFO] Maven One Plugin .................................. SUCCESS [2.274s]
[INFO] Maven Patch Plugin ................................ SUCCESS [30.776s]
[INFO] Maven PDF Plugin .................................. SUCCESS [1:11.087s]
[INFO] Maven PMD Plugin .................................. SUCCESS [1:30.914s]
[INFO] Maven RAR Plugin .................................. SUCCESS [17.178s]
[INFO] Maven Reactor Plugin .............................. SUCCESS [5.669s]
[INFO] Maven Repository Plugin ........................... FAILURE [1:11.609s]
[INFO] Maven Resources Plugin ............................ SUCCESS [2:23.014s]
[INFO] Maven Site Plugin 3 ............................... SUCCESS [16:36.499s]
[INFO] Maven Source Plugin ............................... SUCCESS [1:55.777s]
[INFO] Maven Stage Plugin ................................ SUCCESS [6.687s]
[INFO] Maven Toolchains Plugin ........................... SUCCESS [3.070s]
[INFO] Maven Verifier Plugin ............................. SUCCESS [23.989s]
[INFO] Maven WAR Plugin .................................. SUCCESS [3:27.083s]
[INFO] Maven Invoker Plugin .............................. FAILURE [9:57.659s]
[INFO] Maven Project Info Reports Plugin ................. SUCCESS [5:33.313s]
[INFO] Maven Remote Resources Plugin ..................... FAILURE [1:44.162s]
[INFO] Maven Shade Plugin ................................ SUCCESS [8:27.210s]
[INFO] Maven Plugins Aggregator .......................... SUCCESS [0.071s]
[INFO] ------------------------------------------------------------------------
[INFO] BUILD FAILURE
[INFO] ------------------------------------------------------------------------
[INFO] Total time: 2:36:31.083s
[INFO] Finished at: Tue Jul 03 18:44:23 GMT 2012
[INFO] Final Memory: 78M/1011M
[INFO] ------------------------------------------------------------------------
[WARNING] The requested profile "apache.snapshots" could not be activated because it does
not exist.
[ERROR] Plugin org.apache.maven.plugins:maven-plugin-plugin:3.1-SNAPSHOT or one of its dependencies
could not be resolved: Failed to read artifact descriptor for org.apache.maven.plugins:maven-plugin-plugin:jar:3.1-SNAPSHOT:
Could not find artifact org.apache.maven.plugins:maven-plugin-plugin:pom:3.1-SNAPSHOT ->
[Help 1]
[ERROR] Plugin org.apache.maven.plugins:maven-plugin-plugin:3.1-SNAPSHOT or one of its dependencies
could not be resolved: Failed to read artifact descriptor for org.apache.maven.plugins:maven-plugin-plugin:jar:3.1-SNAPSHOT:
Could not find artifact org.apache.maven.plugins:maven-plugin-plugin:pom:3.1-SNAPSHOT ->
[Help 1]
[ERROR] Failed to execute goal org.apache.maven.plugins:maven-surefire-plugin:2.12:test (integration-tests)
on project maven-repository-plugin: There are test failures.
[ERROR] 
[ERROR] Please refer to /x1/jenkins/jenkins-slave/workspace/maven-plugins-ITs-m3/maven-repository-plugin/target/surefire-reports
for the individual test results.
[ERROR] -> [Help 2]
[ERROR] Failed to execute goal org.apache.maven.plugins:maven-invoker-plugin:1.5:verify (integration-test)
on project maven-invoker-plugin: 2 builds failed. -> [Help 2]
[ERROR] Failed to execute goal org.apache.maven.plugins:maven-failsafe-plugin:2.9:verify (integration-tests)
on project maven-remote-resources-plugin: There are test failures.
[ERROR] 
[ERROR] Please refer to /x1/jenkins/jenkins-slave/workspace/maven-plugins-ITs-m3/maven-remote-resources-plugin/target/failsafe-reports
for the individual test results.
[ERROR] -> [Help 2]
[ERROR] 
[ERROR] To see the full stack trace of the errors, re-run Maven with the -e switch.
[ERROR] Re-run Maven using the -X switch to enable full debug logging.
[ERROR] 
[ERROR] For more information about the errors and possible solutions, please read the following
articles:
[ERROR] [Help 1] http://cwiki.apache.org/confluence/display/MAVEN/PluginResolutionException
[ERROR] [Help 2] http://cwiki.apache.org/confluence/display/MAVEN/MojoFailureException
[ERROR] 
[ERROR] After correcting the problems, you can resume the build with the command
[ERROR]   mvn <goals> -rf :maven-repository-plugin
Build step 'Invoke top-level Maven targets' marked build as failure

Mime
View raw message