maven-notifications mailing list archives

Site index · List index
Message view « Date » · « Thread »
Top « Date » · « Thread »
From Apache Jenkins Server <jenk...@builds.apache.org>
Subject Build failed in Jenkins: maven-plugin-tools #138
Date Tue, 03 Jul 2012 06:43:58 GMT
See <https://builds.apache.org/job/maven-plugin-tools/138/changes>

Changes:

[bimargulies] MPLUGIN-219: Instantiate spelled wrong in annotation
o new enum added with correct spelling
o compatibility arranged.

[hboutemy] [maven-release-plugin] prepare for next development iteration

[hboutemy] [maven-release-plugin] prepare release maven-plugin-tools-3.1

[hboutemy] removed duplicate dependency declaration

[hboutemy] use current maven-plugin-tools-annotations version

[olamy] add missing license headers

[olamy] add Tinguaro Barreno  in contributor section

[olamy] [MPLUGIN-218] Tag 'since' not recognized in the plugin model
Submitted by Tinguaro Barreno.

[olamy] fix 1.7 build

[hboutemy] code simplification

[hboutemy] use constant

[hboutemy] moved help mojo rewriting code to PluginHelpGenerator

[hboutemy] extracted writeHelpPropertiesFile() method

------------------------------------------
[...truncated 1280 lines...]
mojoSucceeded org.apache.maven.plugins:maven-compiler-plugin:2.5(default-compile)
mojoStarted org.apache.maven.plugins:maven-plugin-plugin:3.0(mojo-descriptor)[INFO] Using
'UTF-8' encoding to read mojo metadata.
[INFO] Applying mojo extractor for language: java

[INFO] 
[INFO] --- maven-plugin-plugin:3.0:descriptor (mojo-descriptor) @ maven-plugin-plugin ---
[WARNING] HelpMojo#detail:
[WARNING]   The syntax
[WARNING]     @parameter expression="${property}"
[WARNING]   is deprecated, please use
[WARNING]     @parameter property="property"
[WARNING]   instead.
[WARNING] HelpMojo#goal:
[WARNING]   The syntax
[WARNING]     @parameter expression="${property}"
[WARNING]   is deprecated, please use
[WARNING]     @parameter property="property"
[WARNING]   instead.
[WARNING] HelpMojo#indentSize:
[WARNING]   The syntax
[WARNING]     @parameter expression="${property}"
[WARNING]   is deprecated, please use
[WARNING]     @parameter property="property"
[WARNING]   instead.
[WARNING] HelpMojo#lineLength:
[WARNING]   The syntax
[WARNING]     @parameter expression="${property}"
[WARNING]   is deprecated, please use
[WARNING]     @parameter property="property"
[WARNING]   instead.
[INFO] Mojo extractor for language: java found 1 mojo descriptors.
[INFO] Applying mojo extractor for language: bsh
[INFO] Mojo extractor for language: bsh found 0 mojo descriptors.
[INFO] Applying mojo extractor for language: java-annotations
[INFO] Mojo extractor for language: java-annotations found 6 mojo descriptors.
mojoSucceeded org.apache.maven.plugins:maven-plugin-plugin:3.0(mojo-descriptor)
mojoStarted org.apache.maven.plugins:maven-resources-plugin:2.5(default-testResources)[debug]
execute contextualize
[INFO] Using 'UTF-8' encoding to copy filtered resources.

[INFO] skip non existing resourceDirectory <https://builds.apache.org/job/maven-plugin-tools/ws/maven-plugin-plugin/src/test/resources>
[INFO] Copying 3 resources
[INFO] 
[INFO] --- maven-resources-plugin:2.5:testResources (default-testResources) @ maven-plugin-plugin
---
mojoSucceeded org.apache.maven.plugins:maven-resources-plugin:2.5(default-testResources)
mojoStarted org.apache.maven.plugins:maven-compiler-plugin:2.5(default-testCompile)[INFO]
No sources to compile

[INFO] 
[INFO] --- maven-compiler-plugin:2.5:testCompile (default-testCompile) @ maven-plugin-plugin
---
mojoSucceeded org.apache.maven.plugins:maven-compiler-plugin:2.5(default-testCompile)
mojoStarted org.apache.maven.plugins:maven-surefire-plugin:2.9(default-test)[INFO] Surefire
report directory: <https://builds.apache.org/job/maven-plugin-tools/ws/maven-plugin-plugin/target/surefire-reports>

[INFO] 
-------------------------------------------------------
 T E S T S
-------------------------------------------------------

[INFO] --- maven-surefire-plugin:2.9:test (default-test) @ maven-plugin-plugin ---
mojoSucceeded org.apache.maven.plugins:maven-surefire-plugin:2.9(default-test)
Results :

Tests run: 0, Failures: 0, Errors: 0, Skipped: 0


[JENKINS] Recording test results
mojoStarted org.apache.maven.plugins:maven-jar-plugin:2.3.1(default-jar)
[INFO] 
[INFO] --- maven-jar-plugin:2.3.1:jar (default-jar) @ maven-plugin-plugin ---
[INFO] Building jar: <https://builds.apache.org/job/maven-plugin-tools/ws/maven-plugin-plugin/target/maven-plugin-plugin-3.1-SNAPSHOT.jar>
mojoSucceeded org.apache.maven.plugins:maven-jar-plugin:2.3.1(default-jar)
mojoStarted org.apache.maven.plugins:maven-plugin-plugin:3.0(default-addPluginArtifactMetadata)
[INFO] 
[INFO] --- maven-plugin-plugin:3.0:addPluginArtifactMetadata (default-addPluginArtifactMetadata)
@ maven-plugin-plugin ---
mojoSucceeded org.apache.maven.plugins:maven-plugin-plugin:3.0(default-addPluginArtifactMetadata)
mojoStarted org.apache.maven.plugins:maven-site-plugin:3.1(attach-descriptor)
[INFO] 
[INFO] --- maven-site-plugin:3.1:attach-descriptor (attach-descriptor) @ maven-plugin-plugin
---
mojoSucceeded org.apache.maven.plugins:maven-site-plugin:3.1(attach-descriptor)
mojoStarted org.apache.maven.plugins:maven-invoker-plugin:1.6(integration-test)
[INFO] 
[INFO] --- maven-invoker-plugin:1.6:install (integration-test) @ maven-plugin-plugin ---
[INFO] Installing <https://builds.apache.org/job/maven-plugin-tools/ws/maven-plugin-annotations/pom.xml>
to <https://builds.apache.org/job/maven-plugin-tools/ws/maven-plugin-plugin/target/local-repo/org/apache/maven/plugin-tools/maven-plugin-annotations/3.1-SNAPSHOT/maven-plugin-annotations-3.1-SNAPSHOT.pom>
[INFO] Installing <https://builds.apache.org/job/maven-plugin-tools/ws/maven-plugin-annotations/target/maven-plugin-annotations-3.1-SNAPSHOT.jar>
to <https://builds.apache.org/job/maven-plugin-tools/ws/maven-plugin-plugin/target/local-repo/org/apache/maven/plugin-tools/maven-plugin-annotations/3.1-SNAPSHOT/maven-plugin-annotations-3.1-SNAPSHOT.jar>
[INFO] Installing <https://builds.apache.org/job/maven-plugin-tools/ws/maven-plugin-annotations/pom.xml>
to <https://builds.apache.org/job/maven-plugin-tools/ws/maven-plugin-plugin/target/local-repo/org/apache/maven/plugin-tools/maven-plugin-annotations/3.1-SNAPSHOT/maven-plugin-annotations-3.1-SNAPSHOT.pom>
[INFO] Installing <https://builds.apache.org/job/maven-plugin-tools/ws/maven-plugin-plugin/pom.xml>
to <https://builds.apache.org/job/maven-plugin-tools/ws/maven-plugin-plugin/target/local-repo/org/apache/maven/plugins/maven-plugin-plugin/3.1-SNAPSHOT/maven-plugin-plugin-3.1-SNAPSHOT.pom>
[INFO] Installing <https://builds.apache.org/job/maven-plugin-tools/ws/maven-plugin-plugin/target/maven-plugin-plugin-3.1-SNAPSHOT.jar>
to <https://builds.apache.org/job/maven-plugin-tools/ws/maven-plugin-plugin/target/local-repo/org/apache/maven/plugins/maven-plugin-plugin/3.1-SNAPSHOT/maven-plugin-plugin-3.1-SNAPSHOT.jar>
mojoSucceeded org.apache.maven.plugins:maven-invoker-plugin:1.6(integration-test)
mojoStarted org.apache.maven.plugins:maven-invoker-plugin:1.6(integration-test)
[INFO] 
[INFO] --- maven-invoker-plugin:1.6:run (integration-test) @ maven-plugin-plugin ---
[INFO] Building: help-package/pom.xml
[INFO] run script <https://builds.apache.org/job/maven-plugin-tools/ws/maven-plugin-plugin/target/it/help-package/verify.bsh>
[INFO] ..SUCCESS (15.0 s)
[INFO] Building: source-encoding/pom.xml
[INFO] run script <https://builds.apache.org/job/maven-plugin-tools/ws/maven-plugin-plugin/target/it/source-encoding/verify.groovy>
[INFO] ..SUCCESS (25.5 s)
[INFO] Building: plugin-info-jdk-default-version/pom.xml
[INFO] run script <https://builds.apache.org/job/maven-plugin-tools/ws/maven-plugin-plugin/target/it/plugin-info-jdk-default-version/verify.groovy>
[INFO] ..SUCCESS (43.7 s)
[INFO] Building: java-basic/pom.xml
[INFO] run script <https://builds.apache.org/job/maven-plugin-tools/ws/maven-plugin-plugin/target/it/java-basic/verify.groovy>
[INFO] ..SUCCESS (27.3 s)
[INFO] Building: annotation-with-inheritance-reactor/pom.xml
[INFO] run script <https://builds.apache.org/job/maven-plugin-tools/ws/maven-plugin-plugin/target/it/annotation-with-inheritance-reactor/verify.groovy>
[INFO] ..SUCCESS (30.6 s)
[INFO] Building: ant-basic/pom.xml
[INFO] run script <https://builds.apache.org/job/maven-plugin-tools/ws/maven-plugin-plugin/target/it/ant-basic/verify.groovy>
[INFO] ..SUCCESS (24.4 s)
[INFO] Building: annotation-with-inheritance/pom.xml
[INFO] run script <https://builds.apache.org/job/maven-plugin-tools/ws/maven-plugin-plugin/target/it/annotation-with-inheritance/verify.groovy>
[INFO] ..SUCCESS (54.8 s)
[INFO] Building: plugin-report-annotations/pom.xml
[INFO] run script <https://builds.apache.org/job/maven-plugin-tools/ws/maven-plugin-plugin/target/it/plugin-report-annotations/verify.bsh>
[INFO] ..SUCCESS (26.0 s)
[INFO] Building: ignore-plugin-class-realm/pom.xml
[INFO] ..SUCCESS (25.6 s)
[INFO] Building: beanshell-simple/pom.xml
[INFO] run script <https://builds.apache.org/job/maven-plugin-tools/ws/maven-plugin-plugin/target/it/beanshell-simple/verify.groovy>
[INFO] ..SUCCESS (20.0 s)
[INFO] Building: ant-reference-parameter/pom.xml
[INFO] ..SUCCESS (29.2 s)
[INFO] Building: mplugin-187/pom.xml
[INFO] ..SUCCESS (9.1 s)
[INFO] Building: annotation-with-inheritance-from-deps/pom.xml
[INFO] run script <https://builds.apache.org/job/maven-plugin-tools/ws/maven-plugin-plugin/target/it/annotation-with-inheritance-from-deps/verify.groovy>
[INFO] ..FAILED (51.1 s)
[INFO]   The post-build script did not succeed. assert parameter.deprecated.text() == "wine
is better"
       |         |          |      |
       |         []         ""     false
       parameter[attributes={}; value=[name[attributes={}; value=[beer]], type[attributes={};
value=[java.lang.String]], required[attributes={}; value=[false]], editable[attributes={};
value=[true]], description[attributes={}; value=[]]]]
[INFO] Building: skip/pom.xml
[INFO] run script <https://builds.apache.org/job/maven-plugin-tools/ws/maven-plugin-plugin/target/it/skip/verify.groovy>
[INFO] ..SUCCESS (11.4 s)
[INFO] Building: ant-simple-usage/pom.xml
[INFO] ..SUCCESS (18.3 s)
[INFO] Building: java-basic-annotations/pom.xml
[INFO] run script <https://builds.apache.org/job/maven-plugin-tools/ws/maven-plugin-plugin/target/it/java-basic-annotations/verify.groovy>
[INFO] ..SUCCESS (41.6 s)
[INFO] Building: plugin-report/pom.xml
[INFO] run script <https://builds.apache.org/job/maven-plugin-tools/ws/maven-plugin-plugin/target/it/plugin-report/verify.bsh>
[INFO] ..SUCCESS (62.6 s)
[INFO] Building: help-basic/pom.xml
[INFO] ..SUCCESS (22.4 s)
[INFO] -------------------------------------------------
[INFO] Build Summary:
[INFO]   Passed: 17, Failed: 1, Errors: 0, Skipped: 0
[INFO] -------------------------------------------------
[ERROR] The following builds failed:
[ERROR] *  annotation-with-inheritance-from-deps/pom.xml
[INFO] -------------------------------------------------
mojoFailed org.apache.maven.plugins:maven-invoker-plugin:1.6(integration-test)
projectFailed org.apache.maven.plugins:maven-plugin-plugin:3.1-SNAPSHOT
sessionEnded
[INFO] ------------------------------------------------------------------------
[INFO] Reactor Summary:
[INFO] 
[INFO] Maven Plugin Tools ................................ SUCCESS [11.433s]
[INFO] Maven Script Mojo Support ......................... SUCCESS [0.400s]
[INFO] Maven Ant Mojo Support ............................ SUCCESS [16.499s]
[INFO] Maven Beanshell Mojo Support ...................... SUCCESS [2.946s]
[INFO] Maven Plugin Tools APIs ........................... SUCCESS [8.677s]
[INFO] Maven Plugin Tools Generators ..................... SUCCESS [11.243s]
[INFO] Maven Plugin Tool for Java with Javadoc Tags ...... SUCCESS [11.679s]
[INFO] Maven Plugin Tools Javadoc ........................ SUCCESS [21.219s]
[INFO] Maven Plugin Java 5 Annotations ................... SUCCESS [2.571s]
[INFO] Maven Plugin Tool for Annotations ................. SUCCESS [10.899s]
[INFO] Maven Plugin Tool for Ant ......................... SUCCESS [4.706s]
[INFO] Maven Plugin Tool for Beanshell ................... SUCCESS [3.527s]
[INFO] Maven Plugin Metadata Model ....................... SUCCESS [4.653s]
[INFO] Maven Plugin Plugin ............................... FAILURE [9:31.733s]
[INFO] ------------------------------------------------------------------------
[INFO] BUILD FAILURE
[INFO] ------------------------------------------------------------------------
[INFO] Total time: 11:25.334s
[INFO] Finished at: Tue Jul 03 06:43:52 GMT 2012
[INFO] Final Memory: 37M/429M
[INFO] ------------------------------------------------------------------------
Projects to build: [MavenProject: org.apache.maven.plugin-tools:maven-plugin-tools:3.2-SNAPSHOT
@ <https://builds.apache.org/job/maven-plugin-tools/ws/pom.xml,> MavenProject: org.apache.maven.plugin-tools:maven-script:3.2-SNAPSHOT
@ <https://builds.apache.org/job/maven-plugin-tools/ws/maven-script/pom.xml,> MavenProject:
org.apache.maven.plugin-tools:maven-script-ant:3.2-SNAPSHOT @ <https://builds.apache.org/job/maven-plugin-tools/ws/maven-script/maven-script-ant/pom.xml,>
MavenProject: org.apache.maven.plugin-tools:maven-script-beanshell:3.2-SNAPSHOT @ <https://builds.apache.org/job/maven-plugin-tools/ws/maven-script/maven-script-beanshell/pom.xml,>
MavenProject: org.apache.maven.plugin-tools:maven-plugin-tools-api:3.2-SNAPSHOT @ <https://builds.apache.org/job/maven-plugin-tools/ws/maven-plugin-tools-api/pom.xml,>
MavenProject: org.apache.maven.plugin-tools:maven-plugin-tools-generators:3.2-SNAPSHOT @ <https://builds.apache.org/job/maven-plugin-tools/ws/maven-plugin-tools-generators/pom.xml,>
MavenProject: org.apache.maven.plugin-tools:maven-plugin-tools-java:3.2-SNAPSHOT @ <https://builds.apache.org/job/maven-plugin-tools/ws/maven-plugin-tools-java/pom.xml,>
MavenProject: org.apache.maven.plugin-tools:maven-plugin-tools-javadoc:3.2-SNAPSHOT @ <https://builds.apache.org/job/maven-plugin-tools/ws/maven-plugin-tools-javadoc/pom.xml,>
MavenProject: org.apache.maven.plugin-tools:maven-plugin-annotations:3.1-SNAPSHOT @ <https://builds.apache.org/job/maven-plugin-tools/ws/maven-plugin-annotations/pom.xml,>
MavenProject: org.apache.maven.plugin-tools:maven-plugin-tools-annotations:3.2-SNAPSHOT @
<https://builds.apache.org/job/maven-plugin-tools/ws/maven-plugin-tools-annotations/pom.xml,>
MavenProject: org.apache.maven.plugin-tools:maven-plugin-tools-ant:3.2-SNAPSHOT @ <https://builds.apache.org/job/maven-plugin-tools/ws/maven-plugin-tools-ant/pom.xml,>
MavenProject: org.apache.maven.plugin-tools:maven-plugin-tools-beanshell:3.2-SNAPSHOT @ <https://builds.apache.org/job/maven-plugin-tools/ws/maven-plugin-tools-beanshell/pom.xml,>
MavenProject: org.apache.maven.plugin-tools:maven-plugin-tools-model:3.1-SNAPSHOT @ <https://builds.apache.org/job/maven-plugin-tools/ws/maven-plugin-tools-model/pom.xml,>
MavenProject: org.apache.maven.plugins:maven-plugin-plugin:3.1-SNAPSHOT @ <https://builds.apache.org/job/maven-plugin-tools/ws/maven-plugin-plugin/pom.xml]>
[JENKINS] Archiving <https://builds.apache.org/job/maven-plugin-tools/ws/maven-plugin-tools-beanshell/pom.xml>
to /home/hudson/hudson/jobs/maven-plugin-tools/modules/org.apache.maven.plugin-tools$maven-plugin-tools-beanshell/builds/2012-07-03_06-32-17/archive/org.apache.maven.plugin-tools/maven-plugin-tools-beanshell/3.2-SNAPSHOT/maven-plugin-tools-beanshell-3.2-SNAPSHOT.pom
[JENKINS] Archiving <https://builds.apache.org/job/maven-plugin-tools/ws/maven-plugin-tools-beanshell/target/maven-plugin-tools-beanshell-3.2-SNAPSHOT.jar>
to /home/hudson/hudson/jobs/maven-plugin-tools/modules/org.apache.maven.plugin-tools$maven-plugin-tools-beanshell/builds/2012-07-03_06-32-17/archive/org.apache.maven.plugin-tools/maven-plugin-tools-beanshell/3.2-SNAPSHOT/maven-plugin-tools-beanshell-3.2-SNAPSHOT.jar
[JENKINS] Archiving <https://builds.apache.org/job/maven-plugin-tools/ws/maven-plugin-tools-javadoc/pom.xml>
to /home/hudson/hudson/jobs/maven-plugin-tools/modules/org.apache.maven.plugin-tools$maven-plugin-tools-javadoc/builds/2012-07-03_06-32-17/archive/org.apache.maven.plugin-tools/maven-plugin-tools-javadoc/3.2-SNAPSHOT/maven-plugin-tools-javadoc-3.2-SNAPSHOT.pom
[JENKINS] Archiving <https://builds.apache.org/job/maven-plugin-tools/ws/maven-plugin-tools-javadoc/target/maven-plugin-tools-javadoc-3.2-SNAPSHOT.jar>
to /home/hudson/hudson/jobs/maven-plugin-tools/modules/org.apache.maven.plugin-tools$maven-plugin-tools-javadoc/builds/2012-07-03_06-32-17/archive/org.apache.maven.plugin-tools/maven-plugin-tools-javadoc/3.2-SNAPSHOT/maven-plugin-tools-javadoc-3.2-SNAPSHOT.jar
[JENKINS] Archiving <https://builds.apache.org/job/maven-plugin-tools/ws/maven-plugin-annotations/pom.xml>
to /home/hudson/hudson/jobs/maven-plugin-tools/modules/org.apache.maven.plugin-tools$maven-plugin-annotations/builds/2012-07-03_06-32-17/archive/org.apache.maven.plugin-tools/maven-plugin-annotations/3.1-SNAPSHOT/maven-plugin-annotations-3.1-SNAPSHOT.pom
[JENKINS] Archiving <https://builds.apache.org/job/maven-plugin-tools/ws/maven-plugin-annotations/target/maven-plugin-annotations-3.1-SNAPSHOT.jar>
to /home/hudson/hudson/jobs/maven-plugin-tools/modules/org.apache.maven.plugin-tools$maven-plugin-annotations/builds/2012-07-03_06-32-17/archive/org.apache.maven.plugin-tools/maven-plugin-annotations/3.1-SNAPSHOT/maven-plugin-annotations-3.1-SNAPSHOT.jar
[JENKINS] Archiving <https://builds.apache.org/job/maven-plugin-tools/ws/maven-plugin-plugin/pom.xml>
to /home/hudson/hudson/jobs/maven-plugin-tools/modules/org.apache.maven.plugins$maven-plugin-plugin/builds/2012-07-03_06-32-17/archive/org.apache.maven.plugins/maven-plugin-plugin/3.1-SNAPSHOT/maven-plugin-plugin-3.1-SNAPSHOT.pom
[JENKINS] Archiving <https://builds.apache.org/job/maven-plugin-tools/ws/maven-plugin-plugin/target/maven-plugin-plugin-3.1-SNAPSHOT.jar>
to /home/hudson/hudson/jobs/maven-plugin-tools/modules/org.apache.maven.plugins$maven-plugin-plugin/builds/2012-07-03_06-32-17/archive/org.apache.maven.plugins/maven-plugin-plugin/3.1-SNAPSHOT/maven-plugin-plugin-3.1-SNAPSHOT.jar
[JENKINS] Archiving <https://builds.apache.org/job/maven-plugin-tools/ws/maven-plugin-tools-model/pom.xml>
to /home/hudson/hudson/jobs/maven-plugin-tools/modules/org.apache.maven.plugin-tools$maven-plugin-tools-model/builds/2012-07-03_06-32-17/archive/org.apache.maven.plugin-tools/maven-plugin-tools-model/3.1-SNAPSHOT/maven-plugin-tools-model-3.1-SNAPSHOT.pom
[JENKINS] Archiving <https://builds.apache.org/job/maven-plugin-tools/ws/maven-plugin-tools-model/target/maven-plugin-tools-model-3.1-SNAPSHOT.jar>
to /home/hudson/hudson/jobs/maven-plugin-tools/modules/org.apache.maven.plugin-tools$maven-plugin-tools-model/builds/2012-07-03_06-32-17/archive/org.apache.maven.plugin-tools/maven-plugin-tools-model/3.1-SNAPSHOT/maven-plugin-tools-model-3.1-SNAPSHOT.jar
[JENKINS] Archiving <https://builds.apache.org/job/maven-plugin-tools/ws/maven-script/pom.xml>
to /home/hudson/hudson/jobs/maven-plugin-tools/modules/org.apache.maven.plugin-tools$maven-script/builds/2012-07-03_06-32-17/archive/org.apache.maven.plugin-tools/maven-script/3.2-SNAPSHOT/maven-script-3.2-SNAPSHOT.pom
[JENKINS] Archiving <https://builds.apache.org/job/maven-plugin-tools/ws/maven-script/target/maven-script-3.2-SNAPSHOT-site.xml>
to /home/hudson/hudson/jobs/maven-plugin-tools/modules/org.apache.maven.plugin-tools$maven-script/builds/2012-07-03_06-32-17/archive/org.apache.maven.plugin-tools/maven-script/3.2-SNAPSHOT/maven-script-3.2-SNAPSHOT-site.xml
[JENKINS] Archiving <https://builds.apache.org/job/maven-plugin-tools/ws/maven-plugin-tools-generators/pom.xml>
to /home/hudson/hudson/jobs/maven-plugin-tools/modules/org.apache.maven.plugin-tools$maven-plugin-tools-generators/builds/2012-07-03_06-32-17/archive/org.apache.maven.plugin-tools/maven-plugin-tools-generators/3.2-SNAPSHOT/maven-plugin-tools-generators-3.2-SNAPSHOT.pom
[JENKINS] Archiving <https://builds.apache.org/job/maven-plugin-tools/ws/maven-plugin-tools-generators/target/maven-plugin-tools-generators-3.2-SNAPSHOT.jar>
to /home/hudson/hudson/jobs/maven-plugin-tools/modules/org.apache.maven.plugin-tools$maven-plugin-tools-generators/builds/2012-07-03_06-32-17/archive/org.apache.maven.plugin-tools/maven-plugin-tools-generators/3.2-SNAPSHOT/maven-plugin-tools-generators-3.2-SNAPSHOT.jar
[JENKINS] Archiving <https://builds.apache.org/job/maven-plugin-tools/ws/maven-script/maven-script-ant/pom.xml>
to /home/hudson/hudson/jobs/maven-plugin-tools/modules/org.apache.maven.plugin-tools$maven-script-ant/builds/2012-07-03_06-32-17/archive/org.apache.maven.plugin-tools/maven-script-ant/3.2-SNAPSHOT/maven-script-ant-3.2-SNAPSHOT.pom
[JENKINS] Archiving <https://builds.apache.org/job/maven-plugin-tools/ws/maven-script/maven-script-ant/target/maven-script-ant-3.2-SNAPSHOT.jar>
to /home/hudson/hudson/jobs/maven-plugin-tools/modules/org.apache.maven.plugin-tools$maven-script-ant/builds/2012-07-03_06-32-17/archive/org.apache.maven.plugin-tools/maven-script-ant/3.2-SNAPSHOT/maven-script-ant-3.2-SNAPSHOT.jar
[JENKINS] Archiving <https://builds.apache.org/job/maven-plugin-tools/ws/maven-plugin-tools-java/pom.xml>
to /home/hudson/hudson/jobs/maven-plugin-tools/modules/org.apache.maven.plugin-tools$maven-plugin-tools-java/builds/2012-07-03_06-32-17/archive/org.apache.maven.plugin-tools/maven-plugin-tools-java/3.2-SNAPSHOT/maven-plugin-tools-java-3.2-SNAPSHOT.pom
[JENKINS] Archiving <https://builds.apache.org/job/maven-plugin-tools/ws/maven-plugin-tools-java/target/maven-plugin-tools-java-3.2-SNAPSHOT.jar>
to /home/hudson/hudson/jobs/maven-plugin-tools/modules/org.apache.maven.plugin-tools$maven-plugin-tools-java/builds/2012-07-03_06-32-17/archive/org.apache.maven.plugin-tools/maven-plugin-tools-java/3.2-SNAPSHOT/maven-plugin-tools-java-3.2-SNAPSHOT.jar
[JENKINS] Archiving <https://builds.apache.org/job/maven-plugin-tools/ws/maven-script/maven-script-beanshell/pom.xml>
to /home/hudson/hudson/jobs/maven-plugin-tools/modules/org.apache.maven.plugin-tools$maven-script-beanshell/builds/2012-07-03_06-32-17/archive/org.apache.maven.plugin-tools/maven-script-beanshell/3.2-SNAPSHOT/maven-script-beanshell-3.2-SNAPSHOT.pom
[JENKINS] Archiving <https://builds.apache.org/job/maven-plugin-tools/ws/maven-script/maven-script-beanshell/target/maven-script-beanshell-3.2-SNAPSHOT.jar>
to /home/hudson/hudson/jobs/maven-plugin-tools/modules/org.apache.maven.plugin-tools$maven-script-beanshell/builds/2012-07-03_06-32-17/archive/org.apache.maven.plugin-tools/maven-script-beanshell/3.2-SNAPSHOT/maven-script-beanshell-3.2-SNAPSHOT.jar
[JENKINS] Archiving <https://builds.apache.org/job/maven-plugin-tools/ws/maven-plugin-tools-annotations/pom.xml>
to /home/hudson/hudson/jobs/maven-plugin-tools/modules/org.apache.maven.plugin-tools$maven-plugin-tools-annotations/builds/2012-07-03_06-32-17/archive/org.apache.maven.plugin-tools/maven-plugin-tools-annotations/3.2-SNAPSHOT/maven-plugin-tools-annotations-3.2-SNAPSHOT.pom
[JENKINS] Archiving <https://builds.apache.org/job/maven-plugin-tools/ws/maven-plugin-tools-annotations/target/maven-plugin-tools-annotations-3.2-SNAPSHOT.jar>
to /home/hudson/hudson/jobs/maven-plugin-tools/modules/org.apache.maven.plugin-tools$maven-plugin-tools-annotations/builds/2012-07-03_06-32-17/archive/org.apache.maven.plugin-tools/maven-plugin-tools-annotations/3.2-SNAPSHOT/maven-plugin-tools-annotations-3.2-SNAPSHOT.jar
[JENKINS] Archiving <https://builds.apache.org/job/maven-plugin-tools/ws/maven-plugin-tools-annotations/target/maven-plugin-tools-annotations-3.2-SNAPSHOT-tests.jar>
to /home/hudson/hudson/jobs/maven-plugin-tools/modules/org.apache.maven.plugin-tools$maven-plugin-tools-annotations/builds/2012-07-03_06-32-17/archive/org.apache.maven.plugin-tools/maven-plugin-tools-annotations/3.2-SNAPSHOT/maven-plugin-tools-annotations-3.2-SNAPSHOT-tests.jar
[JENKINS] Archiving <https://builds.apache.org/job/maven-plugin-tools/ws/maven-plugin-tools-annotations/target/maven-plugin-tools-annotations-3.2-SNAPSHOT-test-sources.jar>
to /home/hudson/hudson/jobs/maven-plugin-tools/modules/org.apache.maven.plugin-tools$maven-plugin-tools-annotations/builds/2012-07-03_06-32-17/archive/org.apache.maven.plugin-tools/maven-plugin-tools-annotations/3.2-SNAPSHOT/maven-plugin-tools-annotations-3.2-SNAPSHOT-test-sources.jar
[JENKINS] Archiving <https://builds.apache.org/job/maven-plugin-tools/ws/maven-plugin-tools-api/pom.xml>
to /home/hudson/hudson/jobs/maven-plugin-tools/modules/org.apache.maven.plugin-tools$maven-plugin-tools-api/builds/2012-07-03_06-32-17/archive/org.apache.maven.plugin-tools/maven-plugin-tools-api/3.2-SNAPSHOT/maven-plugin-tools-api-3.2-SNAPSHOT.pom
[JENKINS] Archiving <https://builds.apache.org/job/maven-plugin-tools/ws/maven-plugin-tools-api/target/maven-plugin-tools-api-3.2-SNAPSHOT.jar>
to /home/hudson/hudson/jobs/maven-plugin-tools/modules/org.apache.maven.plugin-tools$maven-plugin-tools-api/builds/2012-07-03_06-32-17/archive/org.apache.maven.plugin-tools/maven-plugin-tools-api/3.2-SNAPSHOT/maven-plugin-tools-api-3.2-SNAPSHOT.jar
[JENKINS] Archiving <https://builds.apache.org/job/maven-plugin-tools/ws/maven-plugin-tools-ant/pom.xml>
to /home/hudson/hudson/jobs/maven-plugin-tools/modules/org.apache.maven.plugin-tools$maven-plugin-tools-ant/builds/2012-07-03_06-32-17/archive/org.apache.maven.plugin-tools/maven-plugin-tools-ant/3.2-SNAPSHOT/maven-plugin-tools-ant-3.2-SNAPSHOT.pom
[JENKINS] Archiving <https://builds.apache.org/job/maven-plugin-tools/ws/maven-plugin-tools-ant/target/maven-plugin-tools-ant-3.2-SNAPSHOT.jar>
to /home/hudson/hudson/jobs/maven-plugin-tools/modules/org.apache.maven.plugin-tools$maven-plugin-tools-ant/builds/2012-07-03_06-32-17/archive/org.apache.maven.plugin-tools/maven-plugin-tools-ant/3.2-SNAPSHOT/maven-plugin-tools-ant-3.2-SNAPSHOT.jar
[JENKINS] Archiving <https://builds.apache.org/job/maven-plugin-tools/ws/pom.xml> to
/home/hudson/hudson/jobs/maven-plugin-tools/modules/org.apache.maven.plugin-tools$maven-plugin-tools/builds/2012-07-03_06-32-17/archive/org.apache.maven.plugin-tools/maven-plugin-tools/3.2-SNAPSHOT/maven-plugin-tools-3.2-SNAPSHOT.pom
[JENKINS] Archiving <https://builds.apache.org/job/maven-plugin-tools/ws/target/maven-plugin-tools-3.2-SNAPSHOT-site.xml>
to /home/hudson/hudson/jobs/maven-plugin-tools/modules/org.apache.maven.plugin-tools$maven-plugin-tools/builds/2012-07-03_06-32-17/archive/org.apache.maven.plugin-tools/maven-plugin-tools/3.2-SNAPSHOT/maven-plugin-tools-3.2-SNAPSHOT-site.xml
Waiting for Jenkins to finish collecting data
mavenExecutionResult exceptions not empty
message : Failed to execute goal org.apache.maven.plugins:maven-invoker-plugin:1.6:run (integration-test)
on project maven-plugin-plugin: 1 build failed. See console output above for details.
cause : 1 build failed. See console output above for details.
Stack trace : 
org.apache.maven.lifecycle.LifecycleExecutionException: Failed to execute goal org.apache.maven.plugins:maven-invoker-plugin:1.6:run
(integration-test) on project maven-plugin-plugin: 1 build failed. See console output above
for details.
	at org.apache.maven.lifecycle.internal.MojoExecutor.execute(MojoExecutor.java:213)
	at org.apache.maven.lifecycle.internal.MojoExecutor.execute(MojoExecutor.java:153)
	at org.apache.maven.lifecycle.internal.MojoExecutor.execute(MojoExecutor.java:145)
	at org.apache.maven.lifecycle.internal.LifecycleModuleBuilder.buildProject(LifecycleModuleBuilder.java:84)
	at org.apache.maven.lifecycle.internal.LifecycleModuleBuilder.buildProject(LifecycleModuleBuilder.java:59)
	at org.apache.maven.lifecycle.internal.LifecycleStarter.singleThreadedBuild(LifecycleStarter.java:183)
	at org.apache.maven.lifecycle.internal.LifecycleStarter.execute(LifecycleStarter.java:161)
	at org.apache.maven.DefaultMaven.doExecute(DefaultMaven.java:320)
	at org.apache.maven.DefaultMaven.execute(DefaultMaven.java:156)
	at org.jvnet.hudson.maven3.launcher.Maven3Launcher.main(Maven3Launcher.java:79)
	at sun.reflect.NativeMethodAccessorImpl.invoke0(Native Method)
	at sun.reflect.NativeMethodAccessorImpl.invoke(NativeMethodAccessorImpl.java:39)
	at sun.reflect.DelegatingMethodAccessorImpl.invoke(DelegatingMethodAccessorImpl.java:25)
	at java.lang.reflect.Method.invoke(Method.java:592)
	at org.codehaus.plexus.classworlds.launcher.Launcher.launchStandard(Launcher.java:329)
	at org.codehaus.plexus.classworlds.launcher.Launcher.launch(Launcher.java:239)
	at org.jvnet.hudson.maven3.agent.Maven3Main.launch(Maven3Main.java:158)
	at hudson.maven.Maven3Builder.call(Maven3Builder.java:98)
	at hudson.maven.Maven3Builder.call(Maven3Builder.java:64)
	at hudson.remoting.UserRequest.perform(UserRequest.java:118)
	at hudson.remoting.UserRequest.perform(UserRequest.java:48)
	at hudson.remoting.Request$2.run(Request.java:326)
	at hudson.remoting.InterceptingExecutorService$1.call(InterceptingExecutorService.java:72)
	at java.util.concurrent.FutureTask$Sync.innerRun(FutureTask.java:269)
	at java.util.concurrent.FutureTask.run(FutureTask.java:123)
	at java.util.concurrent.ThreadPoolExecutor$Worker.runTask(ThreadPoolExecutor.java:651)
	at java.util.concurrent.ThreadPoolExecutor$Worker.run(ThreadPoolExecutor.java:676)
	at java.lang.Thread.run(Thread.java:595)
Caused by: org.apache.maven.plugin.MojoFailureException: 1 build failed. See console output
above for details.
	at org.apache.maven.plugin.invoker.InvokerSession.handleFailures(InvokerSession.java:258)
	at org.apache.maven.plugin.invoker.InvokerMojo.processResults(InvokerMojo.java:59)
	at org.apache.maven.plugin.invoker.AbstractInvokerMojo.execute(AbstractInvokerMojo.java:692)
	at org.apache.maven.plugin.DefaultBuildPluginManager.executeMojo(DefaultBuildPluginManager.java:101)
	at org.apache.maven.lifecycle.internal.MojoExecutor.execute(MojoExecutor.java:209)
	... 27 more
channel stopped

Mime
View raw message