maven-notifications mailing list archives

Site index · List index
Message view « Date » · « Thread »
Top « Date » · « Thread »
From Apache Jenkins Server <jenk...@builds.apache.org>
Subject Build failed in Jenkins: maven-plugins-ITs-m2 #645
Date Sun, 15 Jul 2012 23:59:13 GMT
See <https://builds.apache.org/job/maven-plugins-ITs-m2/645/changes>

Changes:

[hboutemy] [MINVOKER-135] log relative script path instead of full script path for pre-/post-build
scripts

------------------------------------------
[...truncated 10388 lines...]
[INFO] Exploding webapp
[INFO] Assembling webapp [maven-war-plugin-test] in [<https://builds.apache.org/job/maven-plugins-ITs-m2/ws/maven-war-plugin/target/test-classes/unit/waroverlays/no-overlay]>
[INFO] Processing war project
[INFO] Copying webapp resources [<https://builds.apache.org/job/maven-plugins-ITs-m2/ws/maven-war-plugin/target/test-classes/unit/waroverlays/no-overlay-test-data/source]>
[INFO] Webapp assembled in [2 msecs]
[INFO] Building jar: <https://builds.apache.org/job/maven-plugins-ITs-m2/ws/maven-war-plugin/target/test-overlays/overlay-one.war>
[INFO] Exploding webapp
[INFO] Assembling webapp [maven-war-plugin-test] in [<https://builds.apache.org/job/maven-plugins-ITs-m2/ws/maven-war-plugin/target/test-classes/unit/waroverlays/default-overlay]>
[INFO] Processing war project
[INFO] Copying webapp resources [<https://builds.apache.org/job/maven-plugins-ITs-m2/ws/maven-war-plugin/target/test-classes/unit/waroverlays/default-overlay-test-data/source]>
[INFO] Processing overlay [ id wartests:overlay-one]
[INFO] Webapp assembled in [102 msecs]
[INFO] Building jar: <https://builds.apache.org/job/maven-plugins-ITs-m2/ws/maven-war-plugin/target/test-overlays/overlay-two.war>
[INFO] Exploding webapp
[INFO] Assembling webapp [maven-war-plugin-test] in [<https://builds.apache.org/job/maven-plugins-ITs-m2/ws/maven-war-plugin/target/test-classes/unit/waroverlays/default-overlays]>
[INFO] Processing war project
[INFO] Copying webapp resources [<https://builds.apache.org/job/maven-plugins-ITs-m2/ws/maven-war-plugin/target/test-classes/unit/waroverlays/default-overlays-test-data/source]>
[INFO] Processing overlay [ id wartests:overlay-one]
[INFO] Processing overlay [ id wartests:overlay-two]
[INFO] Webapp assembled in [208 msecs]
[INFO] Exploding webapp
[INFO] Assembling webapp [maven-war-plugin-test] in [<https://builds.apache.org/job/maven-plugins-ITs-m2/ws/maven-war-plugin/target/test-classes/unit/waroverlays/scenario-one-default-settings]>
[INFO] Processing war project
[INFO] Copying webapp resources [<https://builds.apache.org/job/maven-plugins-ITs-m2/ws/maven-war-plugin/target/test-classes/unit/waroverlays/scenario-one-default-settings-test-data/source]>
[INFO] Processing overlay [ id wartests:overlay-full-1]
[INFO] Processing overlay [ id wartests:overlay-full-2]
[INFO] Processing overlay [ id wartests:overlay-full-3]
[INFO] Webapp assembled in [1147 msecs]
[INFO] Exploding webapp
[INFO] Assembling webapp [maven-war-plugin-test] in [<https://builds.apache.org/job/maven-plugins-ITs-m2/ws/maven-war-plugin/target/test-classes/unit/waroverlays/scenario-one-overlay-settings]>
[INFO] Processing war project
[INFO] Copying webapp resources [<https://builds.apache.org/job/maven-plugins-ITs-m2/ws/maven-war-plugin/target/test-classes/unit/waroverlays/scenario-one-overlay-settings-test-data/source]>
[INFO] Processing overlay [ id wartests:overlay-full-1]
[INFO] Processing overlay [ id wartests:overlay-full-2]
[INFO] Processing overlay [ id wartests:overlay-full-3]
[INFO] Webapp assembled in [1023 msecs]
[INFO] Exploding webapp
[INFO] Assembling webapp [maven-war-plugin-test] in [<https://builds.apache.org/job/maven-plugins-ITs-m2/ws/maven-war-plugin/target/test-classes/unit/waroverlays/scenario-one-full-settings]>
[INFO] Processing war project
[INFO] Copying webapp resources [<https://builds.apache.org/job/maven-plugins-ITs-m2/ws/maven-war-plugin/target/test-classes/unit/waroverlays/scenario-one-full-settings-test-data/source]>
[INFO] Processing overlay [ id wartests:overlay-full-1]
[INFO] Processing overlay [ id wartests:overlay-full-2]
[INFO] Processing overlay [ id wartests:overlay-full-3]
[INFO] Webapp assembled in [1012 msecs]
[INFO] Exploding webapp
[INFO] Assembling webapp [maven-war-plugin-test] in [<https://builds.apache.org/job/maven-plugins-ITs-m2/ws/maven-war-plugin/target/test-classes/unit/waroverlays/overlays-includes-excludes-multiple-defs]>
[INFO] Processing overlay [ id wartests:overlay-full-3]
[INFO] Processing overlay [ id wartests:overlay-full-1]
[INFO] Processing overlay [ id wartests:overlay-full-3]
[INFO] Processing war project
[INFO] Copying webapp resources [<https://builds.apache.org/job/maven-plugins-ITs-m2/ws/maven-war-plugin/target/test-classes/unit/waroverlays/overlays-includes-excludes-multiple-defs-test-data/source]>
[INFO] Processing overlay [ id wartests:overlay-full-2]
[INFO] Webapp assembled in [1072 msecs]
[INFO] Exploding webapp
[INFO] Assembling webapp [maven-war-plugin-test] in [<https://builds.apache.org/job/maven-plugins-ITs-m2/ws/maven-war-plugin/target/test-classes/unit/waroverlays/overlays-includes-excludes-multiple-defs2]>
[INFO] Processing overlay [ id wartests:overlay-full-3]
[INFO] Processing overlay [ id wartests:overlay-full-1]
[INFO] Processing overlay [ id wartests:overlay-full-3]
[INFO] Processing war project
[INFO] Copying webapp resources [<https://builds.apache.org/job/maven-plugins-ITs-m2/ws/maven-war-plugin/target/test-classes/unit/waroverlays/overlays-includes-excludes-multiple-defs2-test-data/source]>
[INFO] Processing overlay [ id wartests:overlay-full-2]
[INFO] Webapp assembled in [1088 msecs]
[INFO] Exploding webapp
[INFO] Assembling webapp [maven-war-plugin-test] in [<https://builds.apache.org/job/maven-plugins-ITs-m2/ws/maven-war-plugin/target/test-classes/unit/waroverlays/cache-updated-overlay]>
[INFO] Processing war project
[INFO] Copying webapp resources [<https://builds.apache.org/job/maven-plugins-ITs-m2/ws/maven-war-plugin/target/test-classes/unit/waroverlays/cache-updated-overlay-test-data/source]>
[INFO] Processing overlay [ id wartests:overlay-one]
[INFO] Processing overlay [ id wartests:overlay-two]
[INFO] Webapp assembled in [240 msecs]
[INFO] Exploding webapp
[INFO] Assembling webapp [maven-war-plugin-test] in [<https://builds.apache.org/job/maven-plugins-ITs-m2/ws/maven-war-plugin/target/test-classes/unit/waroverlays/cache-updated-overlay]>
[INFO] Processing war project
[INFO] Copying webapp resources [<https://builds.apache.org/job/maven-plugins-ITs-m2/ws/maven-war-plugin/target/test-classes/unit/waroverlays/cache-updated-overlay-test-data/source]>
[INFO] Processing overlay [ id wartests:overlay-two]
[INFO] File [WEB-INF/web.xml] belonged to overlay [wartests:overlay-one] so it will be overwritten.
[INFO] File [index.jsp] belonged to overlay [wartests:overlay-one] so it will be overwritten.
[INFO] Processing overlay [ id wartests:overlay-one]
[INFO] Webapp assembled in [7 msecs]
[INFO] Exploding webapp
[INFO] Assembling webapp [maven-war-plugin-test] in [<https://builds.apache.org/job/maven-plugins-ITs-m2/ws/maven-war-plugin/target/test-classes/unit/waroverlays/cache-removed-overlay]>
[INFO] Processing war project
[INFO] Copying webapp resources [<https://builds.apache.org/job/maven-plugins-ITs-m2/ws/maven-war-plugin/target/test-classes/unit/waroverlays/cache-removed-overlay-test-data/source]>
[INFO] Processing overlay [ id wartests:overlay-one]
[INFO] Processing overlay [ id wartests:overlay-two]
[INFO] Webapp assembled in [247 msecs]
[INFO] Exploding webapp
[INFO] Assembling webapp [maven-war-plugin-test] in [<https://builds.apache.org/job/maven-plugins-ITs-m2/ws/maven-war-plugin/target/test-classes/unit/waroverlays/cache-removed-overlay]>
[WARNING] Dependency [Dependency {groupId=wartests, artifactId=overlay-one, version=0.0-Test,
type=war}] has been removed from the project. If it was included in the build as an overlay,
consider cleaning the target directory of the project (mvn clean)
[INFO] Processing war project
[INFO] Copying webapp resources [<https://builds.apache.org/job/maven-plugins-ITs-m2/ws/maven-war-plugin/target/test-classes/unit/waroverlays/cache-removed-overlay-test-data/source]>
[INFO] Processing overlay [ id wartests:overlay-two]
[WARNING] File [WEB-INF/web.xml] belonged to overlay [wartests:overlay-one] which does not
exist anymore in the current project. It is recommended to invoke clean if the dependencies
of the project changed.
[WARNING] File [index.jsp] belonged to overlay [wartests:overlay-one] which does not exist
anymore in the current project. It is recommended to invoke clean if the dependencies of the
project changed.
[INFO] Webapp assembled in [6 msecs]
Tests run: 11, Failures: 0, Errors: 0, Skipped: 0, Time elapsed: 6.961 sec
Running org.apache.maven.plugin.war.WarInPlaceMojoTest
[INFO] Generating webapp in source directory [<https://builds.apache.org/job/maven-plugins-ITs-m2/ws/maven-war-plugin/target/test-classes/unit/warexplodedinplacemojo/test-dir/SimpleExplodedInplaceWar-test-data/source]>
[INFO] Assembling webapp [maven-war-plugin-test] in [<https://builds.apache.org/job/maven-plugins-ITs-m2/ws/maven-war-plugin/target/test-classes/unit/warexplodedinplacemojo/test-dir/SimpleExplodedInplaceWar-test-data/source]>
[INFO] Processing war project
[INFO] Copying webapp webResources [<https://builds.apache.org/job/maven-plugins-ITs-m2/ws/maven-war-plugin/target/test-classes/unit/warexplodedinplacemojo/test-dir/resources]>
to [<https://builds.apache.org/job/maven-plugins-ITs-m2/ws/maven-war-plugin/target/test-classes/unit/warexplodedinplacemojo/test-dir/SimpleExplodedInplaceWar-test-data/source]>
[INFO] Webapp assembled in [1 msecs]
Tests run: 2, Failures: 0, Errors: 0, Skipped: 0, Time elapsed: 0.107 sec

Results :

Tests run: 84, Failures: 0, Errors: 0, Skipped: 0

[INFO] [jar:jar {execution: default-jar}]
[INFO] Building jar: <https://builds.apache.org/job/maven-plugins-ITs-m2/ws/maven-war-plugin/target/maven-war-plugin-2.3-SNAPSHOT.jar>
[INFO] [plugin:addPluginArtifactMetadata {execution: default-addPluginArtifactMetadata}]
[INFO] [invoker:install {execution: integration-test}]
[INFO] Installing <https://builds.apache.org/job/maven-plugins-ITs-m2/ws/maven-plugins/pom.xml>
to <https://builds.apache.org/job/maven-plugins-ITs-m2/ws/maven-war-plugin/target/local-repo/org/apache/maven/plugins/maven-plugins/23-SNAPSHOT/maven-plugins-23-SNAPSHOT.pom>
[INFO] Installing <https://builds.apache.org/job/maven-plugins-ITs-m2/ws/maven-war-plugin/pom.xml>
to <https://builds.apache.org/job/maven-plugins-ITs-m2/ws/maven-war-plugin/target/local-repo/org/apache/maven/plugins/maven-war-plugin/2.3-SNAPSHOT/maven-war-plugin-2.3-SNAPSHOT.pom>
[INFO] Installing <https://builds.apache.org/job/maven-plugins-ITs-m2/ws/maven-war-plugin/target/maven-war-plugin-2.3-SNAPSHOT.jar>
to <https://builds.apache.org/job/maven-plugins-ITs-m2/ws/maven-war-plugin/target/local-repo/org/apache/maven/plugins/maven-war-plugin/2.3-SNAPSHOT/maven-war-plugin-2.3-SNAPSHOT.jar>
[INFO] [invoker:integration-test {execution: integration-test}]
[INFO] Building: MWAR-133/pom.xml
[INFO] run script <https://builds.apache.org/job/maven-plugins-ITs-m2/ws/maven-war-plugin/target/it/MWAR-133/verify.bsh>
[INFO] ..SUCCESS (2.6 s)
[INFO] Building: web-resources-filtering/pom.xml
[INFO] run script <https://builds.apache.org/job/maven-plugins-ITs-m2/ws/maven-war-plugin/target/it/web-resources-filtering/verify.bsh>
[INFO] ..SUCCESS (4.0 s)
[INFO] Building: MWAR-129/pom.xml
[INFO] run script <https://builds.apache.org/job/maven-plugins-ITs-m2/ws/maven-war-plugin/target/it/MWAR-129/verify.bsh>
[INFO] ..SUCCESS (2.3 s)
[INFO] Building: MWAR-131/pom.xml
[INFO] run script <https://builds.apache.org/job/maven-plugins-ITs-m2/ws/maven-war-plugin/target/it/MWAR-131/verify.bsh>
[INFO] ..SUCCESS (8.9 s)
[INFO] Building: MWAR-139/pom.xml
[INFO] run script <https://builds.apache.org/job/maven-plugins-ITs-m2/ws/maven-war-plugin/target/it/MWAR-139/verify.bsh>
[INFO] ..SUCCESS (2.9 s)
[INFO] Building: MWAR-143/pom.xml
[INFO] run script <https://builds.apache.org/job/maven-plugins-ITs-m2/ws/maven-war-plugin/target/it/MWAR-143/verify.bsh>
[INFO] ..SUCCESS (7.2 s)
[INFO] Building: manifest-content/pom.xml
[INFO] run script <https://builds.apache.org/job/maven-plugins-ITs-m2/ws/maven-war-plugin/target/it/manifest-content/verify.bsh>
[INFO] ..SUCCESS (2.9 s)
[INFO] Building: MWAR-240/pom.xml
[INFO] run script <https://builds.apache.org/job/maven-plugins-ITs-m2/ws/maven-war-plugin/target/it/MWAR-240/verify.bsh>
[INFO] ..SUCCESS (3.2 s)
[INFO] Building: MWAR-96/pom.xml
[INFO] run script <https://builds.apache.org/job/maven-plugins-ITs-m2/ws/maven-war-plugin/target/it/MWAR-96/verify.bsh>
[INFO] ..SUCCESS (3.0 s)
[INFO] Building: MWAR-62/pom.xml
[INFO] run script <https://builds.apache.org/job/maven-plugins-ITs-m2/ws/maven-war-plugin/target/it/MWAR-62/verify.bsh>
[INFO] ..SUCCESS (2.2 s)
[INFO] Building: default/pom.xml
[INFO] run script <https://builds.apache.org/job/maven-plugins-ITs-m2/ws/maven-war-plugin/target/it/default/verify.bsh>
[INFO] ..SUCCESS (3.3 s)
[INFO] Building: simple-war-no-webxml/pom.xml
[INFO] run script <https://builds.apache.org/job/maven-plugins-ITs-m2/ws/maven-war-plugin/target/it/simple-war-no-webxml/verify.bsh>
[INFO] ..SUCCESS (3.0 s)
[INFO] Building: simple-war-project/pom.xml
[INFO] run script <https://builds.apache.org/job/maven-plugins-ITs-m2/ws/maven-war-plugin/target/it/simple-war-project/verify.bsh>
[INFO] ..SUCCESS (2.9 s)
[INFO] Building: scoped-dependency-same-artifact/pom.xml
[INFO] run script <https://builds.apache.org/job/maven-plugins-ITs-m2/ws/maven-war-plugin/target/it/scoped-dependency-same-artifact/verify.bsh>
[INFO] ..SUCCESS (3.3 s)
[INFO] [invoker:verify {execution: integration-test}]
[INFO] -------------------------------------------------
[INFO] Build Summary:
[INFO]   Passed: 14, Failed: 0, Errors: 0, Skipped: 0
[INFO] -------------------------------------------------
[INFO] [install:install {execution: default-install}]
[INFO] Installing <https://builds.apache.org/job/maven-plugins-ITs-m2/ws/maven-war-plugin/target/maven-war-plugin-2.3-SNAPSHOT.jar>
to <https://builds.apache.org/job/maven-plugins-ITs-m2/ws/.repository/org/apache/maven/plugins/maven-war-plugin/2.3-SNAPSHOT/maven-war-plugin-2.3-SNAPSHOT.jar>
[INFO] ------------------------------------------------------------------------
[INFO] Building Maven Plugins Aggregator
[INFO]    task-segment: [clean, install]
[INFO] ------------------------------------------------------------------------
[INFO] [clean:clean {execution: default-clean}]
[INFO] Deleting <https://builds.apache.org/job/maven-plugins-ITs-m2/ws/target>
[INFO] [remote-resources:process {execution: default}]
[INFO] [site:attach-descriptor {execution: default-attach-descriptor}]
[INFO] [install:install {execution: default-install}]
[INFO] Installing <https://builds.apache.org/job/maven-plugins-ITs-m2/ws/pom.xml> to
<https://builds.apache.org/job/maven-plugins-ITs-m2/ws/.repository/org/apache/maven/plugins/maven-plugins-aggregator/1-SNAPSHOT/maven-plugins-aggregator-1-SNAPSHOT.pom>
[INFO] 
[INFO] 
[INFO] ------------------------------------------------------------------------
[INFO] Reactor Summary:
[INFO] ------------------------------------------------------------------------
[INFO] Maven Plugins ......................................... SUCCESS [45.513s]
[INFO] Maven ACR Plugin ...................................... SUCCESS [25.149s]
[INFO] Maven Ant Plugin ...................................... SUCCESS [1:57.851s]
[INFO] Maven AntRun Plugin ................................... SUCCESS [54.476s]
[INFO] Maven Eclipse Plugin .................................. SUCCESS [6:20.875s]
[INFO] Maven Assembly Plugin ................................. SUCCESS [11:34.243s]
[INFO] Maven Changelog Plugin ................................ SUCCESS [53.911s]
[INFO] Maven Compiler Plugin ................................. SUCCESS [33.005s]
[INFO] Maven Changes Report Plugin ........................... SUCCESS [1:13.556s]
[INFO] Maven Checkstyle Plugin ............................... SUCCESS [1:46.177s]
[INFO] Maven Clean Plugin .................................... SUCCESS [14.880s]
[INFO] Maven Dependency Plugin ............................... SUCCESS [2:19.163s]
[INFO] Maven Deploy Plugin ................................... SUCCESS [1:00.992s]
[INFO] Maven DOAP Plugin ..................................... SUCCESS [18.246s]
[INFO] Maven Documentation Checker Plugin .................... SUCCESS [8.203s]
[INFO] Maven EAR Plugin ...................................... FAILED [3:38.183s]
[INFO] Maven EJB Plugin ...................................... SUCCESS [24.842s]
[INFO] Maven GPG Plugin ...................................... SUCCESS [9.502s]
[INFO] Maven Help Plugin ..................................... SUCCESS [29.988s]
[INFO] Maven IDEA Plugin ..................................... SUCCESS [11.046s]
[INFO] Maven Install Plugin .................................. SUCCESS [44.133s]
[INFO] Maven JAR Plugin ...................................... SUCCESS [1:12.963s]
[INFO] Maven Jarsigner Plugin ................................ SUCCESS [24.569s]
[INFO] Maven Javadoc Plugin .................................. SUCCESS [5:44.681s]
[INFO] Maven Linkcheck Plugin ................................ SUCCESS [2.360s]
[INFO] Maven One Plugin ...................................... SUCCESS [2.150s]
[INFO] Maven Patch Plugin .................................... SUCCESS [12.377s]
[INFO] Maven PDF Plugin ...................................... SUCCESS [44.750s]
[INFO] Maven PMD Plugin ...................................... SUCCESS [45.271s]
[INFO] Maven RAR Plugin ...................................... SUCCESS [5.741s]
[INFO] Maven Reactor Plugin .................................. SUCCESS [2.178s]
[INFO] Maven Repository Plugin ............................... FAILED [26.115s]
[INFO] Maven Resources Plugin ................................ FAILED [58.104s]
[INFO] Maven Site Plugin 3 ................................... FAILED [3:48.166s]
[INFO] Maven Source Plugin ................................... SUCCESS [35.876s]
[INFO] Maven Stage Plugin .................................... SUCCESS [1.646s]
[INFO] Maven Toolchains Plugin ............................... SUCCESS [1.799s]
[INFO] Maven Verifier Plugin ................................. SUCCESS [13.274s]
[INFO] Maven WAR Plugin ...................................... SUCCESS [1:08.953s]
[INFO] Maven Plugins Aggregator .............................. SUCCESS [1.088s]
[INFO] ------------------------------------------------------------------------
[INFO] Error for project: Maven EAR Plugin (during install)
[INFO] ------------------------------------------------------------------------
[INFO] There are test failures.

Please refer to <https://builds.apache.org/job/maven-plugins-ITs-m2/ws/maven-ear-plugin/target/surefire-reports>
for the individual test results.
[INFO] ------------------------------------------------------------------------
[INFO] Error for project: Maven Repository Plugin (during install)
[INFO] ------------------------------------------------------------------------
[INFO] There are test failures.

Please refer to <https://builds.apache.org/job/maven-plugins-ITs-m2/ws/maven-repository-plugin/target/surefire-reports>
for the individual test results.
[INFO] ------------------------------------------------------------------------
[INFO] Error for project: Maven Resources Plugin (during install)
[INFO] ------------------------------------------------------------------------
[INFO] 1 build failed. See console output above for details.
[INFO] ------------------------------------------------------------------------
[INFO] Error for project: Maven Site Plugin 3 (during install)
[INFO] ------------------------------------------------------------------------
[INFO] 37 builds failed. See console output above for details.
[INFO] ------------------------------------------------------------------------
[INFO] For more information, run Maven with the -e switch
[INFO] ------------------------------------------------------------------------
[INFO] BUILD ERRORS
[INFO] ------------------------------------------------------------------------
[INFO] Total time: 52 minutes 38 seconds
[INFO] Finished at: Sun Jul 15 23:59:10 UTC 2012
[INFO] Final Memory: 257M/1018M
[INFO] ------------------------------------------------------------------------
Build step 'Invoke top-level Maven targets' marked build as failure

Mime
View raw message