maven-notifications mailing list archives

Site index · List index
Message view « Date » · « Thread »
Top « Date » · « Thread »
From Apache Jenkins Server <jenk...@builds.apache.org>
Subject Build failed in Jenkins: maven-plugins #783
Date Fri, 29 Jun 2012 22:26:00 GMT
See <https://builds.apache.org/job/maven-plugins/783/>

------------------------------------------
[...truncated 7716 lines...]
[WARNING] * Your build is requesting parallel execution, but project      *
[WARNING] * contains the following plugin(s) that are not marked as       *
[WARNING] * @threadSafe to support parallel building.                     *
[WARNING] * While this /may/ work fine, please look for plugin updates    *
[WARNING] * and/or request plugins be made thread-safe.                   *
[WARNING] * If reporting an issue, report it against the plugin in        *
[WARNING] * question, not against maven-core                              *
[WARNING] *****************************************************************
[WARNING] The following plugins are not marked @threadSafe in Maven Plugins Aggregator:
[WARNING] org.apache.maven.plugins:maven-remote-resources-plugin:1.1
[WARNING] *****************************************************************
[INFO] Deleting <https://builds.apache.org/job/maven-plugins/ws/target>
                                                                        
[INFO] ------------------------------------------------------------------------
[INFO] Building Maven Plugins Aggregator 1-SNAPSHOT
[INFO] ------------------------------------------------------------------------
mojoStarted org.apache.maven.plugins:maven-clean-plugin:2.4.1(default-clean)
[INFO] 
[INFO] --- maven-clean-plugin:2.4.1:clean (default-clean) @ maven-plugins-aggregator ---
[INFO] Replacing original artifact with shaded artifact.
[INFO] Replacing <https://builds.apache.org/job/maven-plugins/ws/maven-javadoc-plugin/target/maven-javadoc-plugin-2.8.2-SNAPSHOT.jar> with <https://builds.apache.org/job/maven-plugins/ws/maven-javadoc-plugin/target/maven-javadoc-plugin-2.8.2-SNAPSHOT-shaded.jar>
mojoSucceeded org.apache.maven.plugins:maven-clean-plugin:2.4.1(default-clean)
mojoSucceeded org.apache.maven.plugins:maven-shade-plugin:1.2.1(default)
mojoStarted org.apache.maven.plugins:maven-remote-resources-plugin:1.1(default)
[INFO] 
[INFO] Installing <https://builds.apache.org/job/maven-plugins/ws/maven-javadoc-plugin/target/maven-javadoc-plugin-2.8.2-SNAPSHOT.jar> to /home/hudson/hudson-slave/maven-repositories/0/org/apache/maven/plugins/maven-javadoc-plugin/2.8.2-SNAPSHOT/maven-javadoc-plugin-2.8.2-SNAPSHOT.jar
[INFO] --- maven-remote-resources-plugin:1.1:process (default) @ maven-plugins-aggregator ---
mojoSucceeded org.apache.maven.plugins:maven-remote-resources-plugin:1.1(default)
[INFO] Installing <https://builds.apache.org/job/maven-plugins/ws/maven-javadoc-plugin/pom.xml> to /home/hudson/hudson-slave/maven-repositories/0/org/apache/maven/plugins/maven-javadoc-plugin/2.8.2-SNAPSHOT/maven-javadoc-plugin-2.8.2-SNAPSHOT.pom
mojoStarted org.apache.maven.plugins:maven-install-plugin:2.3.1(default-install)
[INFO] 
[INFO] --- maven-install-plugin:2.3.1:install (default-install) @ maven-javadoc-plugin ---
mojoSucceeded org.apache.maven.plugins:maven-install-plugin:2.3.1(default-install)
[INFO] Installing <https://builds.apache.org/job/maven-plugins/ws/pom.xml> to /home/hudson/hudson-slave/maven-repositories/0/org/apache/maven/plugins/maven-plugins-aggregator/1-SNAPSHOT/maven-plugins-aggregator-1-SNAPSHOT.pom
mojoStarted org.apache.maven.plugins:maven-install-plugin:2.3.1(default-install)
[INFO] 
[INFO] --- maven-install-plugin:2.3.1:install (default-install) @ maven-plugins-aggregator ---
mojoSucceeded org.apache.maven.plugins:maven-install-plugin:2.3.1(default-install)
projectSucceeded org.apache.maven.plugins:maven-javadoc-plugin:2.8.2-SNAPSHOT
projectSucceeded org.apache.maven.plugins:maven-plugins-aggregator:1-SNAPSHOT
Tests run: 4, Failures: 0, Errors: 0, Skipped: 0, Time elapsed: 0.844 sec
Running org.apache.maven.plugins.shade.relocation.SimpleRelocatorTest
Tests run: 7, Failures: 0, Errors: 0, Skipped: 0, Time elapsed: 0.004 sec
Running org.apache.maven.plugins.shade.relocation.SimpleRelocatorParameterTest
Tests run: 2, Failures: 0, Errors: 0, Skipped: 0, Time elapsed: 0 sec
Running org.apache.maven.plugins.shade.resource.XmlAppendingTransformerTest
Tests run: 1, Failures: 0, Errors: 0, Skipped: 0, Time elapsed: 0.005 sec
Running org.apache.maven.plugins.shade.resource.ApacheNoticeResourceTransformerTest
Tests run: 1, Failures: 0, Errors: 0, Skipped: 0, Time elapsed: 0.001 sec
Running org.apache.maven.plugins.shade.resource.ComponentsXmlResourceTransformerTest
Tests run: 1, Failures: 0, Errors: 0, Skipped: 0, Time elapsed: 0.061 sec
Running org.apache.maven.plugins.shade.resource.ApacheLicenseResourceTransformerTest
Tests run: 1, Failures: 0, Errors: 0, Skipped: 0, Time elapsed: 0.001 sec
Running org.apache.maven.plugins.shade.resource.AppendingTransformerTest
Tests run: 1, Failures: 0, Errors: 0, Skipped: 0, Time elapsed: 0.001 sec

Results :

Tests run: 27, Failures: 0, Errors: 0, Skipped: 0

mojoSucceeded org.apache.maven.plugins:maven-surefire-plugin:2.9(default-test)
[JENKINS] Recording test results
mojoStarted org.apache.maven.plugins:maven-jar-plugin:2.3.1(default-jar)
[INFO] 
[INFO] --- maven-jar-plugin:2.3.1:jar (default-jar) @ maven-shade-plugin ---
[INFO] Building jar: <https://builds.apache.org/job/maven-plugins/ws/maven-shade-plugin/target/maven-shade-plugin-2.0-SNAPSHOT.jar>
mojoSucceeded org.apache.maven.plugins:maven-jar-plugin:2.3.1(default-jar)
mojoStarted org.apache.maven.plugins:maven-plugin-plugin:2.8(default-addPluginArtifactMetadata)
[INFO] 
[INFO] --- maven-plugin-plugin:2.8:addPluginArtifactMetadata (default-addPluginArtifactMetadata) @ maven-shade-plugin ---
mojoSucceeded org.apache.maven.plugins:maven-plugin-plugin:2.8(default-addPluginArtifactMetadata)
mojoStarted org.apache.maven.plugins:maven-install-plugin:2.3.1(default-install)[INFO] Installing <https://builds.apache.org/job/maven-plugins/ws/maven-shade-plugin/target/maven-shade-plugin-2.0-SNAPSHOT.jar> to /home/hudson/hudson-slave/maven-repositories/0/org/apache/maven/plugins/maven-shade-plugin/2.0-SNAPSHOT/maven-shade-plugin-2.0-SNAPSHOT.jar

[INFO] 
[INFO] --- maven-install-plugin:2.3.1:install (default-install) @ maven-shade-plugin ---
[INFO] Installing <https://builds.apache.org/job/maven-plugins/ws/maven-shade-plugin/pom.xml> to /home/hudson/hudson-slave/maven-repositories/0/org/apache/maven/plugins/maven-shade-plugin/2.0-SNAPSHOT/maven-shade-plugin-2.0-SNAPSHOT.pom
mojoSucceeded org.apache.maven.plugins:maven-install-plugin:2.3.1(default-install)
projectSucceeded org.apache.maven.plugins:maven-shade-plugin:2.0-SNAPSHOT
sessionEnded
[INFO] ------------------------------------------------------------------------
[INFO] Reactor Summary:
[INFO] 
[INFO] Maven Plugins ..................................... SUCCESS [30.712s]
[INFO] Maven ACR Plugin .................................. SUCCESS [37.232s]
[INFO] Maven Ant Plugin .................................. SUCCESS [47.850s]
[INFO] Maven AntRun Plugin ............................... SUCCESS [6.360s]
[INFO] Maven Eclipse Plugin .............................. SUCCESS [38.306s]
[INFO] Maven Assembly Plugin ............................. SUCCESS [28.361s]
[INFO] Maven Changelog Plugin ............................ SUCCESS [12.280s]
[INFO] Maven Changes Report Plugin ....................... SUCCESS [17.409s]
[INFO] Maven Checkstyle Plugin ........................... SUCCESS [21.628s]
[INFO] Maven Clean Plugin ................................ SUCCESS [7.999s]
[INFO] Maven Compiler Plugin ............................. SUCCESS [14.710s]
[INFO] Maven Dependency Plugin ........................... SUCCESS [1:07.408s]
[INFO] Maven Deploy Plugin ............................... SUCCESS [7.057s]
[INFO] Maven DOAP Plugin ................................. SUCCESS [9.755s]
[INFO] Maven Documentation Checker Plugin ................ SUCCESS [3.778s]
[INFO] Maven EAR Plugin .................................. SUCCESS [10.995s]
[INFO] Maven EJB Plugin .................................. SUCCESS [8.986s]
[INFO] Maven GPG Plugin .................................. SUCCESS [3.728s]
[INFO] Maven Help Plugin ................................. SUCCESS [5.982s]
[INFO] Maven IDEA Plugin ................................. SUCCESS [11.380s]
[INFO] Maven Install Plugin .............................. SUCCESS [9.413s]
[INFO] Maven JAR Plugin .................................. SUCCESS [4.815s]
[INFO] Maven Jarsigner Plugin ............................ SUCCESS [3.381s]
[INFO] Maven Javadoc Plugin .............................. SUCCESS [1:36.520s]
[INFO] Maven Linkcheck Plugin ............................ SUCCESS [3.764s]
[INFO] Maven One Plugin .................................. SUCCESS [4.943s]
[INFO] Maven Patch Plugin ................................ SUCCESS [3.240s]
[INFO] Maven PDF Plugin .................................. SUCCESS [15.128s]
[INFO] Maven PMD Plugin .................................. SUCCESS [15.531s]
[INFO] Maven RAR Plugin .................................. SUCCESS [9.235s]
[INFO] Maven Reactor Plugin .............................. SUCCESS [6.421s]
[INFO] Maven Repository Plugin ........................... SUCCESS [8.071s]
[INFO] Maven Resources Plugin ............................ SUCCESS [8.162s]
[INFO] Maven Site Plugin 3 ............................... SUCCESS [12.989s]
[INFO] Maven Source Plugin ............................... SUCCESS [6.476s]
[INFO] Maven Stage Plugin ................................ SUCCESS [4.720s]
[INFO] Maven Toolchains Plugin ........................... SUCCESS [3.705s]
[INFO] Maven Verifier Plugin ............................. SUCCESS [8.024s]
[INFO] Maven WAR Plugin .................................. FAILURE [7.784s]
[INFO] Maven Invoker Plugin .............................. SUCCESS [8.876s]
[INFO] Maven Project Info Reports Plugin ................. SUCCESS [23.467s]
[INFO] Maven Remote Resources Plugin ..................... SUCCESS [7.948s]
[INFO] Maven Shade Plugin ................................ SUCCESS [9.515s]
[INFO] Maven Plugins Aggregator .......................... SUCCESS [0.619s]
[INFO] ------------------------------------------------------------------------
[INFO] BUILD FAILURE
[INFO] ------------------------------------------------------------------------
[INFO] Total time: 3:52.602s (Wall Clock)
[INFO] Finished at: Fri Jun 29 22:25:07 UTC 2012
[INFO] Final Memory: 68M/987M
[INFO] ------------------------------------------------------------------------
Projects to build: [MavenProject: org.apache.maven.plugins:maven-plugins:23-SNAPSHOT @ <https://builds.apache.org/job/maven-plugins/ws/maven-plugins/pom.xml,> MavenProject: org.apache.maven.plugins:maven-acr-plugin:1.0.1-SNAPSHOT @ <https://builds.apache.org/job/maven-plugins/ws/maven-acr-plugin/pom.xml,> MavenProject: org.apache.maven.plugins:maven-ant-plugin:2.4-SNAPSHOT @ <https://builds.apache.org/job/maven-plugins/ws/maven-ant-plugin/pom.xml,> MavenProject: org.apache.maven.plugins:maven-antrun-plugin:1.8-SNAPSHOT @ <https://builds.apache.org/job/maven-plugins/ws/maven-antrun-plugin/pom.xml,> MavenProject: org.apache.maven.plugins:maven-eclipse-plugin:2.10-SNAPSHOT @ <https://builds.apache.org/job/maven-plugins/ws/maven-eclipse-plugin/pom.xml,> MavenProject: org.apache.maven.plugins:maven-assembly-plugin:2.4-SNAPSHOT @ <https://builds.apache.org/job/maven-plugins/ws/maven-assembly-plugin/pom.xml,> MavenProject: org.apache.maven.plugins:maven-changelog-plugin:2.3-SNAPSHOT @ <https://builds.apache.org/job/maven-plugins/ws/maven-changelog-plugin/pom.xml,> MavenProject: org.apache.maven.plugins:maven-changes-plugin:2.8-SNAPSHOT @ <https://builds.apache.org/job/maven-plugins/ws/maven-changes-plugin/pom.xml,> MavenProject: org.apache.maven.plugins:maven-checkstyle-plugin:2.10-SNAPSHOT @ <https://builds.apache.org/job/maven-plugins/ws/maven-checkstyle-plugin/pom.xml,> MavenProject: org.apache.maven.plugins:maven-clean-plugin:2.6-SNAPSHOT @ <https://builds.apache.org/job/maven-plugins/ws/maven-clean-plugin/pom.xml,> MavenProject: org.apache.maven.plugins:maven-compiler-plugin:2.6-SNAPSHOT @ <https://builds.apache.org/job/maven-plugins/ws/maven-compiler-plugin/pom.xml,> MavenProject: org.apache.maven.plugins:maven-dependency-plugin:2.5-SNAPSHOT @ <https://builds.apache.org/job/maven-plugins/ws/maven-dependency-plugin/pom.xml,> MavenProject: org.apache.maven.plugins:maven-deploy-plugin:2.8-SNAPSHOT @ <https://builds.apache.org/job/maven-plugins/ws/maven-deploy-plugin/pom.xml,> MavenProject: org.apache.maven.plugins:maven-doap-plugin:1.2-SNAPSHOT @ <https://builds.apache.org/job/maven-plugins/ws/maven-doap-plugin/pom.xml,> MavenProject: org.apache.maven.plugins:maven-docck-plugin:1.1-SNAPSHOT @ <https://builds.apache.org/job/maven-plugins/ws/maven-docck-plugin/pom.xml,> MavenProject: org.apache.maven.plugins:maven-ear-plugin:2.8-SNAPSHOT @ <https://builds.apache.org/job/maven-plugins/ws/maven-ear-plugin/pom.xml,> MavenProject: org.apache.maven.plugins:maven-ejb-plugin:2.4-SNAPSHOT @ <https://builds.apache.org/job/maven-plugins/ws/maven-ejb-plugin/pom.xml,> MavenProject: org.apache.maven.plugins:maven-gpg-plugin:1.5-SNAPSHOT @ <https://builds.apache.org/job/maven-plugins/ws/maven-gpg-plugin/pom.xml,> MavenProject: org.apache.maven.plugins:maven-help-plugin:2.2-SNAPSHOT @ <https://builds.apache.org/job/maven-plugins/ws/maven-help-plugin/pom.xml,> MavenProject: org.apache.maven.plugins:maven-idea-plugin:2.3-SNAPSHOT @ <https://builds.apache.org/job/maven-plugins/ws/maven-idea-plugin/pom.xml,> MavenProject: org.apache.maven.plugins:maven-install-plugin:2.4-SNAPSHOT @ <https://builds.apache.org/job/maven-plugins/ws/maven-install-plugin/pom.xml,> MavenProject: org.apache.maven.plugins:maven-jar-plugin:2.5-SNAPSHOT @ <https://builds.apache.org/job/maven-plugins/ws/maven-jar-plugin/pom.xml,> MavenProject: org.apache.maven.plugins:maven-jarsigner-plugin:1.3-SNAPSHOT @ <https://builds.apache.org/job/maven-plugins/ws/maven-jarsigner-plugin/pom.xml,> MavenProject: org.apache.maven.plugins:maven-javadoc-plugin:2.8.2-SNAPSHOT @ <https://builds.apache.org/job/maven-plugins/ws/maven-javadoc-plugin/pom.xml,> MavenProject: org.apache.maven.plugins:maven-linkcheck-plugin:1.2-SNAPSHOT @ <https://builds.apache.org/job/maven-plugins/ws/maven-linkcheck-plugin/pom.xml,> MavenProject: org.apache.maven.plugins:maven-one-plugin:1.3-SNAPSHOT @ <https://builds.apache.org/job/maven-plugins/ws/maven-one-plugin/pom.xml,> MavenProject: org.apache.maven.plugins:maven-patch-plugin:1.1.2-SNAPSHOT @ <https://builds.apache.org/job/maven-plugins/ws/maven-patch-plugin/pom.xml,> MavenProject: org.apache.maven.plugins:maven-pdf-plugin:1.2-SNAPSHOT @ <https://builds.apache.org/job/maven-plugins/ws/maven-pdf-plugin/pom.xml,> MavenProject: org.apache.maven.plugins:maven-pmd-plugin:2.8-SNAPSHOT @ <https://builds.apache.org/job/maven-plugins/ws/maven-pmd-plugin/pom.xml,> MavenProject: org.apache.maven.plugins:maven-rar-plugin:2.3-SNAPSHOT @ <https://builds.apache.org/job/maven-plugins/ws/maven-rar-plugin/pom.xml,> MavenProject: org.apache.maven.plugins:maven-reactor-plugin:1.1-SNAPSHOT @ <https://builds.apache.org/job/maven-plugins/ws/maven-reactor-plugin/pom.xml,> MavenProject: org.apache.maven.plugins:maven-repository-plugin:2.3.3-SNAPSHOT @ <https://builds.apache.org/job/maven-plugins/ws/maven-repository-plugin/pom.xml,> MavenProject: org.apache.maven.plugins:maven-resources-plugin:2.6-SNAPSHOT @ <https://builds.apache.org/job/maven-plugins/ws/maven-resources-plugin/pom.xml,> MavenProject: org.apache.maven.plugins:maven-site-plugin:3.2-SNAPSHOT @ <https://builds.apache.org/job/maven-plugins/ws/maven-site-plugin/dependency-reduced-pom.xml,> MavenProject: org.apache.maven.plugins:maven-source-plugin:2.2-SNAPSHOT @ <https://builds.apache.org/job/maven-plugins/ws/maven-source-plugin/pom.xml,> MavenProject: org.apache.maven.plugins:maven-stage-plugin:1.0-alpha-3-SNAPSHOT @ <https://builds.apache.org/job/maven-plugins/ws/maven-stage-plugin/pom.xml,> MavenProject: org.apache.maven.plugins:maven-toolchains-plugin:1.1-SNAPSHOT @ <https://builds.apache.org/job/maven-plugins/ws/maven-toolchains-plugin/pom.xml,> MavenProject: org.apache.maven.plugins:maven-verifier-plugin:1.1-SNAPSHOT @ <https://builds.apache.org/job/maven-plugins/ws/maven-verifier-plugin/pom.xml,> MavenProject: org.apache.maven.plugins:maven-war-plugin:2.3-SNAPSHOT @ <https://builds.apache.org/job/maven-plugins/ws/maven-war-plugin/pom.xml,> MavenProject: org.apache.maven.plugins:maven-invoker-plugin:1.7-SNAPSHOT @ <https://builds.apache.org/job/maven-plugins/ws/maven-invoker-plugin/pom.xml,> MavenProject: org.apache.maven.plugins:maven-project-info-reports-plugin:2.5-SNAPSHOT @ <https://builds.apache.org/job/maven-plugins/ws/maven-project-info-reports-plugin/pom.xml,> MavenProject: org.apache.maven.plugins:maven-remote-resources-plugin:1.4-SNAPSHOT @ <https://builds.apache.org/job/maven-plugins/ws/maven-remote-resources-plugin/pom.xml,> MavenProject: org.apache.maven.plugins:maven-shade-plugin:2.0-SNAPSHOT @ <https://builds.apache.org/job/maven-plugins/ws/maven-shade-plugin/pom.xml,> MavenProject: org.apache.maven.plugins:maven-plugins-aggregator:1-SNAPSHOT @ <https://builds.apache.org/job/maven-plugins/ws/pom.xml]>
[JENKINS] Archiving <https://builds.apache.org/job/maven-plugins/ws/maven-war-plugin/pom.xml> to /home/hudson/hudson/jobs/maven-plugins/modules/org.apache.maven.plugins$maven-war-plugin/builds/2012-06-29_22-20-58/archive/org.apache.maven.plugins/maven-war-plugin/2.3-SNAPSHOT/maven-war-plugin-2.3-SNAPSHOT.pom
[JENKINS] Archiving <https://builds.apache.org/job/maven-plugins/ws/maven-docck-plugin/pom.xml> to /home/hudson/hudson/jobs/maven-plugins/modules/org.apache.maven.plugins$maven-docck-plugin/builds/2012-06-29_22-20-55/archive/org.apache.maven.plugins/maven-docck-plugin/1.1-SNAPSHOT/maven-docck-plugin-1.1-SNAPSHOT.pom
[JENKINS] Archiving <https://builds.apache.org/job/maven-plugins/ws/maven-docck-plugin/target/maven-docck-plugin-1.1-SNAPSHOT.jar> to /home/hudson/hudson/jobs/maven-plugins/modules/org.apache.maven.plugins$maven-docck-plugin/builds/2012-06-29_22-20-55/archive/org.apache.maven.plugins/maven-docck-plugin/1.1-SNAPSHOT/maven-docck-plugin-1.1-SNAPSHOT.jar
[JENKINS] Archiving <https://builds.apache.org/job/maven-plugins/ws/pom.xml> to /home/hudson/hudson/jobs/maven-plugins/modules/org.apache.maven.plugins$maven-plugins-aggregator/builds/2012-06-29_22-20-53/archive/org.apache.maven.plugins/maven-plugins-aggregator/1-SNAPSHOT/maven-plugins-aggregator-1-SNAPSHOT.pom
[JENKINS] Archiving <https://builds.apache.org/job/maven-plugins/ws/maven-idea-plugin/pom.xml> to /home/hudson/hudson/jobs/maven-plugins/modules/org.apache.maven.plugins$maven-idea-plugin/builds/2012-06-29_22-20-56/archive/org.apache.maven.plugins/maven-idea-plugin/2.3-SNAPSHOT/maven-idea-plugin-2.3-SNAPSHOT.pom
[JENKINS] Archiving <https://builds.apache.org/job/maven-plugins/ws/maven-idea-plugin/target/maven-idea-plugin-2.3-SNAPSHOT.jar> to /home/hudson/hudson/jobs/maven-plugins/modules/org.apache.maven.plugins$maven-idea-plugin/builds/2012-06-29_22-20-56/archive/org.apache.maven.plugins/maven-idea-plugin/2.3-SNAPSHOT/maven-idea-plugin-2.3-SNAPSHOT.jar
[JENKINS] Archiving <https://builds.apache.org/job/maven-plugins/ws/maven-toolchains-plugin/pom.xml> to /home/hudson/hudson/jobs/maven-plugins/modules/org.apache.maven.plugins$maven-toolchains-plugin/builds/2012-06-29_22-20-58/archive/org.apache.maven.plugins/maven-toolchains-plugin/1.1-SNAPSHOT/maven-toolchains-plugin-1.1-SNAPSHOT.pom
[JENKINS] Archiving <https://builds.apache.org/job/maven-plugins/ws/maven-toolchains-plugin/target/maven-toolchains-plugin-1.1-SNAPSHOT.jar> to /home/hudson/hudson/jobs/maven-plugins/modules/org.apache.maven.plugins$maven-toolchains-plugin/builds/2012-06-29_22-20-58/archive/org.apache.maven.plugins/maven-toolchains-plugin/1.1-SNAPSHOT/maven-toolchains-plugin-1.1-SNAPSHOT.jar
[JENKINS] Archiving <https://builds.apache.org/job/maven-plugins/ws/maven-pmd-plugin/pom.xml> to /home/hudson/hudson/jobs/maven-plugins/modules/org.apache.maven.plugins$maven-pmd-plugin/builds/2012-06-29_22-20-56/archive/org.apache.maven.plugins/maven-pmd-plugin/2.8-SNAPSHOT/maven-pmd-plugin-2.8-SNAPSHOT.pom
[JENKINS] Archiving <https://builds.apache.org/job/maven-plugins/ws/maven-pmd-plugin/target/maven-pmd-plugin-2.8-SNAPSHOT.jar> to /home/hudson/hudson/jobs/maven-plugins/modules/org.apache.maven.plugins$maven-pmd-plugin/builds/2012-06-29_22-20-56/archive/org.apache.maven.plugins/maven-pmd-plugin/2.8-SNAPSHOT/maven-pmd-plugin-2.8-SNAPSHOT.jar
[JENKINS] Archiving <https://builds.apache.org/job/maven-plugins/ws/maven-eclipse-plugin/pom.xml> to /home/hudson/hudson/jobs/maven-plugins/modules/org.apache.maven.plugins$maven-eclipse-plugin/builds/2012-06-29_22-20-54/archive/org.apache.maven.plugins/maven-eclipse-plugin/2.10-SNAPSHOT/maven-eclipse-plugin-2.10-SNAPSHOT.pom
[JENKINS] Archiving <https://builds.apache.org/job/maven-plugins/ws/maven-eclipse-plugin/target/maven-eclipse-plugin-2.10-SNAPSHOT.jar> to /home/hudson/hudson/jobs/maven-plugins/modules/org.apache.maven.plugins$maven-eclipse-plugin/builds/2012-06-29_22-20-54/archive/org.apache.maven.plugins/maven-eclipse-plugin/2.10-SNAPSHOT/maven-eclipse-plugin-2.10-SNAPSHOT.jar
[JENKINS] Archiving <https://builds.apache.org/job/maven-plugins/ws/maven-gpg-plugin/pom.xml> to /home/hudson/hudson/jobs/maven-plugins/modules/org.apache.maven.plugins$maven-gpg-plugin/builds/2012-06-29_22-20-55/archive/org.apache.maven.plugins/maven-gpg-plugin/1.5-SNAPSHOT/maven-gpg-plugin-1.5-SNAPSHOT.pom
[JENKINS] Archiving <https://builds.apache.org/job/maven-plugins/ws/maven-gpg-plugin/target/maven-gpg-plugin-1.5-SNAPSHOT.jar> to /home/hudson/hudson/jobs/maven-plugins/modules/org.apache.maven.plugins$maven-gpg-plugin/builds/2012-06-29_22-20-55/archive/org.apache.maven.plugins/maven-gpg-plugin/1.5-SNAPSHOT/maven-gpg-plugin-1.5-SNAPSHOT.jar
[JENKINS] Archiving <https://builds.apache.org/job/maven-plugins/ws/maven-clean-plugin/pom.xml> to /home/hudson/hudson/jobs/maven-plugins/modules/org.apache.maven.plugins$maven-clean-plugin/builds/2012-06-29_22-20-54/archive/org.apache.maven.plugins/maven-clean-plugin/2.6-SNAPSHOT/maven-clean-plugin-2.6-SNAPSHOT.pom
[JENKINS] Archiving <https://builds.apache.org/job/maven-plugins/ws/maven-clean-plugin/target/maven-clean-plugin-2.6-SNAPSHOT.jar> to /home/hudson/hudson/jobs/maven-plugins/modules/org.apache.maven.plugins$maven-clean-plugin/builds/2012-06-29_22-20-54/archive/org.apache.maven.plugins/maven-clean-plugin/2.6-SNAPSHOT/maven-clean-plugin-2.6-SNAPSHOT.jar
[JENKINS] Archiving <https://builds.apache.org/job/maven-plugins/ws/maven-jar-plugin/pom.xml> to /home/hudson/hudson/jobs/maven-plugins/modules/org.apache.maven.plugins$maven-jar-plugin/builds/2012-06-29_22-20-56/archive/org.apache.maven.plugins/maven-jar-plugin/2.5-SNAPSHOT/maven-jar-plugin-2.5-SNAPSHOT.pom
[JENKINS] Archiving <https://builds.apache.org/job/maven-plugins/ws/maven-jar-plugin/target/maven-jar-plugin-2.5-SNAPSHOT.jar> to /home/hudson/hudson/jobs/maven-plugins/modules/org.apache.maven.plugins$maven-jar-plugin/builds/2012-06-29_22-20-56/archive/org.apache.maven.plugins/maven-jar-plugin/2.5-SNAPSHOT/maven-jar-plugin-2.5-SNAPSHOT.jar
[JENKINS] Archiving <https://builds.apache.org/job/maven-plugins/ws/maven-site-plugin/dependency-reduced-pom.xml> to /home/hudson/hudson/jobs/maven-plugins/modules/org.apache.maven.plugins$maven-site-plugin/builds/2012-06-29_22-20-57/archive/org.apache.maven.plugins/maven-site-plugin/3.2-SNAPSHOT/maven-site-plugin-3.2-SNAPSHOT.pom
[JENKINS] Archiving <https://builds.apache.org/job/maven-plugins/ws/maven-site-plugin/target/maven-site-plugin-3.2-SNAPSHOT.jar> to /home/hudson/hudson/jobs/maven-plugins/modules/org.apache.maven.plugins$maven-site-plugin/builds/2012-06-29_22-20-57/archive/org.apache.maven.plugins/maven-site-plugin/3.2-SNAPSHOT/maven-site-plugin-3.2-SNAPSHOT.jar
[JENKINS] Archiving <https://builds.apache.org/job/maven-plugins/ws/maven-patch-plugin/pom.xml> to /home/hudson/hudson/jobs/maven-plugins/modules/org.apache.maven.plugins$maven-patch-plugin/builds/2012-06-29_22-20-56/archive/org.apache.maven.plugins/maven-patch-plugin/1.1.2-SNAPSHOT/maven-patch-plugin-1.1.2-SNAPSHOT.pom
[JENKINS] Archiving <https://builds.apache.org/job/maven-plugins/ws/maven-patch-plugin/target/maven-patch-plugin-1.1.2-SNAPSHOT.jar> to /home/hudson/hudson/jobs/maven-plugins/modules/org.apache.maven.plugins$maven-patch-plugin/builds/2012-06-29_22-20-56/archive/org.apache.maven.plugins/maven-patch-plugin/1.1.2-SNAPSHOT/maven-patch-plugin-1.1.2-SNAPSHOT.jar
[JENKINS] Archiving <https://builds.apache.org/job/maven-plugins/ws/maven-install-plugin/pom.xml> to /home/hudson/hudson/jobs/maven-plugins/modules/org.apache.maven.plugins$maven-install-plugin/builds/2012-06-29_22-20-56/archive/org.apache.maven.plugins/maven-install-plugin/2.4-SNAPSHOT/maven-install-plugin-2.4-SNAPSHOT.pom
[JENKINS] Archiving <https://builds.apache.org/job/maven-plugins/ws/maven-install-plugin/target/maven-install-plugin-2.4-SNAPSHOT.jar> to /home/hudson/hudson/jobs/maven-plugins/modules/org.apache.maven.plugins$maven-install-plugin/builds/2012-06-29_22-20-56/archive/org.apache.maven.plugins/maven-install-plugin/2.4-SNAPSHOT/maven-install-plugin-2.4-SNAPSHOT.jar
[JENKINS] Archiving <https://builds.apache.org/job/maven-plugins/ws/maven-antrun-plugin/pom.xml> to /home/hudson/hudson/jobs/maven-plugins/modules/org.apache.maven.plugins$maven-antrun-plugin/builds/2012-06-29_22-20-54/archive/org.apache.maven.plugins/maven-antrun-plugin/1.8-SNAPSHOT/maven-antrun-plugin-1.8-SNAPSHOT.pom
[JENKINS] Archiving <https://builds.apache.org/job/maven-plugins/ws/maven-antrun-plugin/target/maven-antrun-plugin-1.8-SNAPSHOT.jar> to /home/hudson/hudson/jobs/maven-plugins/modules/org.apache.maven.plugins$maven-antrun-plugin/builds/2012-06-29_22-20-54/archive/org.apache.maven.plugins/maven-antrun-plugin/1.8-SNAPSHOT/maven-antrun-plugin-1.8-SNAPSHOT.jar
[JENKINS] Archiving <https://builds.apache.org/job/maven-plugins/ws/maven-changes-plugin/pom.xml> to /home/hudson/hudson/jobs/maven-plugins/modules/org.apache.maven.plugins$maven-changes-plugin/builds/2012-06-29_22-20-54/archive/org.apache.maven.plugins/maven-changes-plugin/2.8-SNAPSHOT/maven-changes-plugin-2.8-SNAPSHOT.pom
[JENKINS] Archiving <https://builds.apache.org/job/maven-plugins/ws/maven-changes-plugin/target/maven-changes-plugin-2.8-SNAPSHOT.jar> to /home/hudson/hudson/jobs/maven-plugins/modules/org.apache.maven.plugins$maven-changes-plugin/builds/2012-06-29_22-20-54/archive/org.apache.maven.plugins/maven-changes-plugin/2.8-SNAPSHOT/maven-changes-plugin-2.8-SNAPSHOT.jar
[JENKINS] Archiving <https://builds.apache.org/job/maven-plugins/ws/maven-rar-plugin/pom.xml> to /home/hudson/hudson/jobs/maven-plugins/modules/org.apache.maven.plugins$maven-rar-plugin/builds/2012-06-29_22-20-56/archive/org.apache.maven.plugins/maven-rar-plugin/2.3-SNAPSHOT/maven-rar-plugin-2.3-SNAPSHOT.pom
[JENKINS] Archiving <https://builds.apache.org/job/maven-plugins/ws/maven-rar-plugin/target/maven-rar-plugin-2.3-SNAPSHOT.jar> to /home/hudson/hudson/jobs/maven-plugins/modules/org.apache.maven.plugins$maven-rar-plugin/builds/2012-06-29_22-20-56/archive/org.apache.maven.plugins/maven-rar-plugin/2.3-SNAPSHOT/maven-rar-plugin-2.3-SNAPSHOT.jar
[JENKINS] Archiving <https://builds.apache.org/job/maven-plugins/ws/maven-jarsigner-plugin/pom.xml> to /home/hudson/hudson/jobs/maven-plugins/modules/org.apache.maven.plugins$maven-jarsigner-plugin/builds/2012-06-29_22-20-56/archive/org.apache.maven.plugins/maven-jarsigner-plugin/1.3-SNAPSHOT/maven-jarsigner-plugin-1.3-SNAPSHOT.pom
[JENKINS] Archiving <https://builds.apache.org/job/maven-plugins/ws/maven-jarsigner-plugin/target/maven-jarsigner-plugin-1.3-SNAPSHOT.jar> to /home/hudson/hudson/jobs/maven-plugins/modules/org.apache.maven.plugins$maven-jarsigner-plugin/builds/2012-06-29_22-20-56/archive/org.apache.maven.plugins/maven-jarsigner-plugin/1.3-SNAPSHOT/maven-jarsigner-plugin-1.3-SNAPSHOT.jar
[JENKINS] Archiving <https://builds.apache.org/job/maven-plugins/ws/maven-ear-plugin/pom.xml> to /home/hudson/hudson/jobs/maven-plugins/modules/org.apache.maven.plugins$maven-ear-plugin/builds/2012-06-29_22-20-55/archive/org.apache.maven.plugins/maven-ear-plugin/2.8-SNAPSHOT/maven-ear-plugin-2.8-SNAPSHOT.pom
[JENKINS] Archiving <https://builds.apache.org/job/maven-plugins/ws/maven-ear-plugin/target/maven-ear-plugin-2.8-SNAPSHOT.jar> to /home/hudson/hudson/jobs/maven-plugins/modules/org.apache.maven.plugins$maven-ear-plugin/builds/2012-06-29_22-20-55/archive/org.apache.maven.plugins/maven-ear-plugin/2.8-SNAPSHOT/maven-ear-plugin-2.8-SNAPSHOT.jar
[JENKINS] Archiving <https://builds.apache.org/job/maven-plugins/ws/maven-changelog-plugin/pom.xml> to /home/hudson/hudson/jobs/maven-plugins/modules/org.apache.maven.plugins$maven-changelog-plugin/builds/2012-06-29_22-20-54/archive/org.apache.maven.plugins/maven-changelog-plugin/2.3-SNAPSHOT/maven-changelog-plugin-2.3-SNAPSHOT.pom
[JENKINS] Archiving <https://builds.apache.org/job/maven-plugins/ws/maven-changelog-plugin/target/maven-changelog-plugin-2.3-SNAPSHOT.jar> to /home/hudson/hudson/jobs/maven-plugins/modules/org.apache.maven.plugins$maven-changelog-plugin/builds/2012-06-29_22-20-54/archive/org.apache.maven.plugins/maven-changelog-plugin/2.3-SNAPSHOT/maven-changelog-plugin-2.3-SNAPSHOT.jar
[JENKINS] Archiving <https://builds.apache.org/job/maven-plugins/ws/maven-verifier-plugin/pom.xml> to /home/hudson/hudson/jobs/maven-plugins/modules/org.apache.maven.plugins$maven-verifier-plugin/builds/2012-06-29_22-20-58/archive/org.apache.maven.plugins/maven-verifier-plugin/1.1-SNAPSHOT/maven-verifier-plugin-1.1-SNAPSHOT.pom
[JENKINS] Archiving <https://builds.apache.org/job/maven-plugins/ws/maven-verifier-plugin/target/maven-verifier-plugin-1.1-SNAPSHOT.jar> to /home/hudson/hudson/jobs/maven-plugins/modules/org.apache.maven.plugins$maven-verifier-plugin/builds/2012-06-29_22-20-58/archive/org.apache.maven.plugins/maven-verifier-plugin/1.1-SNAPSHOT/maven-verifier-plugin-1.1-SNAPSHOT.jar
[JENKINS] Archiving <https://builds.apache.org/job/maven-plugins/ws/maven-stage-plugin/pom.xml> to /home/hudson/hudson/jobs/maven-plugins/modules/org.apache.maven.plugins$maven-stage-plugin/builds/2012-06-29_22-20-57/archive/org.apache.maven.plugins/maven-stage-plugin/1.0-alpha-3-SNAPSHOT/maven-stage-plugin-1.0-alpha-3-SNAPSHOT.pom
[JENKINS] Archiving <https://builds.apache.org/job/maven-plugins/ws/maven-stage-plugin/target/maven-stage-plugin-1.0-alpha-3-SNAPSHOT.jar> to /home/hudson/hudson/jobs/maven-plugins/modules/org.apache.maven.plugins$maven-stage-plugin/builds/2012-06-29_22-20-57/archive/org.apache.maven.plugins/maven-stage-plugin/1.0-alpha-3-SNAPSHOT/maven-stage-plugin-1.0-alpha-3-SNAPSHOT.jar
[JENKINS] Archiving <https://builds.apache.org/job/maven-plugins/ws/maven-ant-plugin/pom.xml> to /home/hudson/hudson/jobs/maven-plugins/modules/org.apache.maven.plugins$maven-ant-plugin/builds/2012-06-29_22-20-53/archive/org.apache.maven.plugins/maven-ant-plugin/2.4-SNAPSHOT/maven-ant-plugin-2.4-SNAPSHOT.pom
[JENKINS] Archiving <https://builds.apache.org/job/maven-plugins/ws/maven-ant-plugin/target/maven-ant-plugin-2.4-SNAPSHOT.jar> to /home/hudson/hudson/jobs/maven-plugins/modules/org.apache.maven.plugins$maven-ant-plugin/builds/2012-06-29_22-20-53/archive/org.apache.maven.plugins/maven-ant-plugin/2.4-SNAPSHOT/maven-ant-plugin-2.4-SNAPSHOT.jar
[JENKINS] Archiving <https://builds.apache.org/job/maven-plugins/ws/maven-compiler-plugin/pom.xml> to /home/hudson/hudson/jobs/maven-plugins/modules/org.apache.maven.plugins$maven-compiler-plugin/builds/2012-06-29_22-20-55/archive/org.apache.maven.plugins/maven-compiler-plugin/2.6-SNAPSHOT/maven-compiler-plugin-2.6-SNAPSHOT.pom
[JENKINS] Archiving <https://builds.apache.org/job/maven-plugins/ws/maven-compiler-plugin/target/maven-compiler-plugin-2.6-SNAPSHOT.jar> to /home/hudson/hudson/jobs/maven-plugins/modules/org.apache.maven.plugins$maven-compiler-plugin/builds/2012-06-29_22-20-55/archive/org.apache.maven.plugins/maven-compiler-plugin/2.6-SNAPSHOT/maven-compiler-plugin-2.6-SNAPSHOT.jar
[JENKINS] Archiving <https://builds.apache.org/job/maven-plugins/ws/maven-ejb-plugin/pom.xml> to /home/hudson/hudson/jobs/maven-plugins/modules/org.apache.maven.plugins$maven-ejb-plugin/builds/2012-06-29_22-20-55/archive/org.apache.maven.plugins/maven-ejb-plugin/2.4-SNAPSHOT/maven-ejb-plugin-2.4-SNAPSHOT.pom
[JENKINS] Archiving <https://builds.apache.org/job/maven-plugins/ws/maven-ejb-plugin/target/maven-ejb-plugin-2.4-SNAPSHOT.jar> to /home/hudson/hudson/jobs/maven-plugins/modules/org.apache.maven.plugins$maven-ejb-plugin/builds/2012-06-29_22-20-55/archive/org.apache.maven.plugins/maven-ejb-plugin/2.4-SNAPSHOT/maven-ejb-plugin-2.4-SNAPSHOT.jar
[JENKINS] Archiving <https://builds.apache.org/job/maven-plugins/ws/maven-reactor-plugin/pom.xml> to /home/hudson/hudson/jobs/maven-plugins/modules/org.apache.maven.plugins$maven-reactor-plugin/builds/2012-06-29_22-20-57/archive/org.apache.maven.plugins/maven-reactor-plugin/1.1-SNAPSHOT/maven-reactor-plugin-1.1-SNAPSHOT.pom
[JENKINS] Archiving <https://builds.apache.org/job/maven-plugins/ws/maven-reactor-plugin/target/maven-reactor-plugin-1.1-SNAPSHOT.jar> to /home/hudson/hudson/jobs/maven-plugins/modules/org.apache.maven.plugins$maven-reactor-plugin/builds/2012-06-29_22-20-57/archive/org.apache.maven.plugins/maven-reactor-plugin/1.1-SNAPSHOT/maven-reactor-plugin-1.1-SNAPSHOT.jar
[JENKINS] Archiving <https://builds.apache.org/job/maven-plugins/ws/maven-doap-plugin/pom.xml> to /home/hudson/hudson/jobs/maven-plugins/modules/org.apache.maven.plugins$maven-doap-plugin/builds/2012-06-29_22-20-55/archive/org.apache.maven.plugins/maven-doap-plugin/1.2-SNAPSHOT/maven-doap-plugin-1.2-SNAPSHOT.pom
[JENKINS] Archiving <https://builds.apache.org/job/maven-plugins/ws/maven-doap-plugin/target/maven-doap-plugin-1.2-SNAPSHOT.jar> to /home/hudson/hudson/jobs/maven-plugins/modules/org.apache.maven.plugins$maven-doap-plugin/builds/2012-06-29_22-20-55/archive/org.apache.maven.plugins/maven-doap-plugin/1.2-SNAPSHOT/maven-doap-plugin-1.2-SNAPSHOT.jar
[JENKINS] Archiving <https://builds.apache.org/job/maven-plugins/ws/maven-checkstyle-plugin/pom.xml> to /home/hudson/hudson/jobs/maven-plugins/modules/org.apache.maven.plugins$maven-checkstyle-plugin/builds/2012-06-29_22-20-54/archive/org.apache.maven.plugins/maven-checkstyle-plugin/2.10-SNAPSHOT/maven-checkstyle-plugin-2.10-SNAPSHOT.pom
[JENKINS] Archiving <https://builds.apache.org/job/maven-plugins/ws/maven-checkstyle-plugin/target/maven-checkstyle-plugin-2.10-SNAPSHOT.jar> to /home/hudson/hudson/jobs/maven-plugins/modules/org.apache.maven.plugins$maven-checkstyle-plugin/builds/2012-06-29_22-20-54/archive/org.apache.maven.plugins/maven-checkstyle-plugin/2.10-SNAPSHOT/maven-checkstyle-plugin-2.10-SNAPSHOT.jar
[JENKINS] Archiving <https://builds.apache.org/job/maven-plugins/ws/maven-source-plugin/pom.xml> to /home/hudson/hudson/jobs/maven-plugins/modules/org.apache.maven.plugins$maven-source-plugin/builds/2012-06-29_22-20-57/archive/org.apache.maven.plugins/maven-source-plugin/2.2-SNAPSHOT/maven-source-plugin-2.2-SNAPSHOT.pom
[JENKINS] Archiving <https://builds.apache.org/job/maven-plugins/ws/maven-source-plugin/target/maven-source-plugin-2.2-SNAPSHOT.jar> to /home/hudson/hudson/jobs/maven-plugins/modules/org.apache.maven.plugins$maven-source-plugin/builds/2012-06-29_22-20-57/archive/org.apache.maven.plugins/maven-source-plugin/2.2-SNAPSHOT/maven-source-plugin-2.2-SNAPSHOT.jar
[JENKINS] Archiving <https://builds.apache.org/job/maven-plugins/ws/maven-dependency-plugin/pom.xml> to /home/hudson/hudson/jobs/maven-plugins/modules/org.apache.maven.plugins$maven-dependency-plugin/builds/2012-06-29_22-20-55/archive/org.apache.maven.plugins/maven-dependency-plugin/2.5-SNAPSHOT/maven-dependency-plugin-2.5-SNAPSHOT.pom
[JENKINS] Archiving <https://builds.apache.org/job/maven-plugins/ws/maven-dependency-plugin/target/maven-dependency-plugin-2.5-SNAPSHOT.jar> to /home/hudson/hudson/jobs/maven-plugins/modules/org.apache.maven.plugins$maven-dependency-plugin/builds/2012-06-29_22-20-55/archive/org.apache.maven.plugins/maven-dependency-plugin/2.5-SNAPSHOT/maven-dependency-plugin-2.5-SNAPSHOT.jar
[JENKINS] Archiving <https://builds.apache.org/job/maven-plugins/ws/maven-javadoc-plugin/pom.xml> to /home/hudson/hudson/jobs/maven-plugins/modules/org.apache.maven.plugins$maven-javadoc-plugin/builds/2012-06-29_22-20-56/archive/org.apache.maven.plugins/maven-javadoc-plugin/2.8.2-SNAPSHOT/maven-javadoc-plugin-2.8.2-SNAPSHOT.pom
[JENKINS] Archiving <https://builds.apache.org/job/maven-plugins/ws/maven-javadoc-plugin/target/maven-javadoc-plugin-2.8.2-SNAPSHOT.jar> to /home/hudson/hudson/jobs/maven-plugins/modules/org.apache.maven.plugins$maven-javadoc-plugin/builds/2012-06-29_22-20-56/archive/org.apache.maven.plugins/maven-javadoc-plugin/2.8.2-SNAPSHOT/maven-javadoc-plugin-2.8.2-SNAPSHOT.jar
[JENKINS] Archiving <https://builds.apache.org/job/maven-plugins/ws/maven-deploy-plugin/pom.xml> to /home/hudson/hudson/jobs/maven-plugins/modules/org.apache.maven.plugins$maven-deploy-plugin/builds/2012-06-29_22-20-55/archive/org.apache.maven.plugins/maven-deploy-plugin/2.8-SNAPSHOT/maven-deploy-plugin-2.8-SNAPSHOT.pom
[JENKINS] Archiving <https://builds.apache.org/job/maven-plugins/ws/maven-deploy-plugin/target/maven-deploy-plugin-2.8-SNAPSHOT.jar> to /home/hudson/hudson/jobs/maven-plugins/modules/org.apache.maven.plugins$maven-deploy-plugin/builds/2012-06-29_22-20-55/archive/org.apache.maven.plugins/maven-deploy-plugin/2.8-SNAPSHOT/maven-deploy-plugin-2.8-SNAPSHOT.jar
[JENKINS] Archiving <https://builds.apache.org/job/maven-plugins/ws/maven-acr-plugin/pom.xml> to /home/hudson/hudson/jobs/maven-plugins/modules/org.apache.maven.plugins$maven-acr-plugin/builds/2012-06-29_22-20-53/archive/org.apache.maven.plugins/maven-acr-plugin/1.0.1-SNAPSHOT/maven-acr-plugin-1.0.1-SNAPSHOT.pom
[JENKINS] Archiving <https://builds.apache.org/job/maven-plugins/ws/maven-acr-plugin/target/maven-acr-plugin-1.0.1-SNAPSHOT.jar> to /home/hudson/hudson/jobs/maven-plugins/modules/org.apache.maven.plugins$maven-acr-plugin/builds/2012-06-29_22-20-53/archive/org.apache.maven.plugins/maven-acr-plugin/1.0.1-SNAPSHOT/maven-acr-plugin-1.0.1-SNAPSHOT.jar
[JENKINS] Archiving <https://builds.apache.org/job/maven-plugins/ws/maven-repository-plugin/pom.xml> to /home/hudson/hudson/jobs/maven-plugins/modules/org.apache.maven.plugins$maven-repository-plugin/builds/2012-06-29_22-20-57/archive/org.apache.maven.plugins/maven-repository-plugin/2.3.3-SNAPSHOT/maven-repository-plugin-2.3.3-SNAPSHOT.pom
[JENKINS] Archiving <https://builds.apache.org/job/maven-plugins/ws/maven-repository-plugin/target/maven-repository-plugin-2.3.3-SNAPSHOT.jar> to /home/hudson/hudson/jobs/maven-plugins/modules/org.apache.maven.plugins$maven-repository-plugin/builds/2012-06-29_22-20-57/archive/org.apache.maven.plugins/maven-repository-plugin/2.3.3-SNAPSHOT/maven-repository-plugin-2.3.3-SNAPSHOT.jar
[JENKINS] Archiving <https://builds.apache.org/job/maven-plugins/ws/maven-assembly-plugin/pom.xml> to /home/hudson/hudson/jobs/maven-plugins/modules/org.apache.maven.plugins$maven-assembly-plugin/builds/2012-06-29_22-20-54/archive/org.apache.maven.plugins/maven-assembly-plugin/2.4-SNAPSHOT/maven-assembly-plugin-2.4-SNAPSHOT.pom
[JENKINS] Archiving <https://builds.apache.org/job/maven-plugins/ws/maven-assembly-plugin/target/maven-assembly-plugin-2.4-SNAPSHOT.jar> to /home/hudson/hudson/jobs/maven-plugins/modules/org.apache.maven.plugins$maven-assembly-plugin/builds/2012-06-29_22-20-54/archive/org.apache.maven.plugins/maven-assembly-plugin/2.4-SNAPSHOT/maven-assembly-plugin-2.4-SNAPSHOT.jar
[JENKINS] Archiving <https://builds.apache.org/job/maven-plugins/ws/maven-project-info-reports-plugin/pom.xml> to /home/hudson/hudson/jobs/maven-plugins/modules/org.apache.maven.plugins$maven-project-info-reports-plugin/builds/2012-06-29_22-20-58/archive/org.apache.maven.plugins/maven-project-info-reports-plugin/2.5-SNAPSHOT/maven-project-info-reports-plugin-2.5-SNAPSHOT.pom
[JENKINS] Archiving <https://builds.apache.org/job/maven-plugins/ws/maven-project-info-reports-plugin/target/maven-project-info-reports-plugin-2.5-SNAPSHOT.jar> to /home/hudson/hudson/jobs/maven-plugins/modules/org.apache.maven.plugins$maven-project-info-reports-plugin/builds/2012-06-29_22-20-58/archive/org.apache.maven.plugins/maven-project-info-reports-plugin/2.5-SNAPSHOT/maven-project-info-reports-plugin-2.5-SNAPSHOT.jar
[JENKINS] Archiving <https://builds.apache.org/job/maven-plugins/ws/maven-one-plugin/pom.xml> to /home/hudson/hudson/jobs/maven-plugins/modules/org.apache.maven.plugins$maven-one-plugin/builds/2012-06-29_22-20-56/archive/org.apache.maven.plugins/maven-one-plugin/1.3-SNAPSHOT/maven-one-plugin-1.3-SNAPSHOT.pom
[JENKINS] Archiving <https://builds.apache.org/job/maven-plugins/ws/maven-one-plugin/target/maven-one-plugin-1.3-SNAPSHOT.jar> to /home/hudson/hudson/jobs/maven-plugins/modules/org.apache.maven.plugins$maven-one-plugin/builds/2012-06-29_22-20-56/archive/org.apache.maven.plugins/maven-one-plugin/1.3-SNAPSHOT/maven-one-plugin-1.3-SNAPSHOT.jar
[JENKINS] Archiving <https://builds.apache.org/job/maven-plugins/ws/maven-help-plugin/pom.xml> to /home/hudson/hudson/jobs/maven-plugins/modules/org.apache.maven.plugins$maven-help-plugin/builds/2012-06-29_22-20-55/archive/org.apache.maven.plugins/maven-help-plugin/2.2-SNAPSHOT/maven-help-plugin-2.2-SNAPSHOT.pom
[JENKINS] Archiving <https://builds.apache.org/job/maven-plugins/ws/maven-help-plugin/target/maven-help-plugin-2.2-SNAPSHOT.jar> to /home/hudson/hudson/jobs/maven-plugins/modules/org.apache.maven.plugins$maven-help-plugin/builds/2012-06-29_22-20-55/archive/org.apache.maven.plugins/maven-help-plugin/2.2-SNAPSHOT/maven-help-plugin-2.2-SNAPSHOT.jar
[JENKINS] Archiving <https://builds.apache.org/job/maven-plugins/ws/maven-invoker-plugin/pom.xml> to /home/hudson/hudson/jobs/maven-plugins/modules/org.apache.maven.plugins$maven-invoker-plugin/builds/2012-06-29_22-20-58/archive/org.apache.maven.plugins/maven-invoker-plugin/1.7-SNAPSHOT/maven-invoker-plugin-1.7-SNAPSHOT.pom
[JENKINS] Archiving <https://builds.apache.org/job/maven-plugins/ws/maven-invoker-plugin/target/maven-invoker-plugin-1.7-SNAPSHOT.jar> to /home/hudson/hudson/jobs/maven-plugins/modules/org.apache.maven.plugins$maven-invoker-plugin/builds/2012-06-29_22-20-58/archive/org.apache.maven.plugins/maven-invoker-plugin/1.7-SNAPSHOT/maven-invoker-plugin-1.7-SNAPSHOT.jar
[JENKINS] Archiving <https://builds.apache.org/job/maven-plugins/ws/maven-remote-resources-plugin/pom.xml> to /home/hudson/hudson/jobs/maven-plugins/modules/org.apache.maven.plugins$maven-remote-resources-plugin/builds/2012-06-29_22-20-58/archive/org.apache.maven.plugins/maven-remote-resources-plugin/1.4-SNAPSHOT/maven-remote-resources-plugin-1.4-SNAPSHOT.pom
[JENKINS] Archiving <https://builds.apache.org/job/maven-plugins/ws/maven-remote-resources-plugin/target/maven-remote-resources-plugin-1.4-SNAPSHOT.jar> to /home/hudson/hudson/jobs/maven-plugins/modules/org.apache.maven.plugins$maven-remote-resources-plugin/builds/2012-06-29_22-20-58/archive/org.apache.maven.plugins/maven-remote-resources-plugin/1.4-SNAPSHOT/maven-remote-resources-plugin-1.4-SNAPSHOT.jar
[JENKINS] Archiving <https://builds.apache.org/job/maven-plugins/ws/maven-pdf-plugin/pom.xml> to /home/hudson/hudson/jobs/maven-plugins/modules/org.apache.maven.plugins$maven-pdf-plugin/builds/2012-06-29_22-20-56/archive/org.apache.maven.plugins/maven-pdf-plugin/1.2-SNAPSHOT/maven-pdf-plugin-1.2-SNAPSHOT.pom
[JENKINS] Archiving <https://builds.apache.org/job/maven-plugins/ws/maven-pdf-plugin/target/maven-pdf-plugin-1.2-SNAPSHOT.jar> to /home/hudson/hudson/jobs/maven-plugins/modules/org.apache.maven.plugins$maven-pdf-plugin/builds/2012-06-29_22-20-56/archive/org.apache.maven.plugins/maven-pdf-plugin/1.2-SNAPSHOT/maven-pdf-plugin-1.2-SNAPSHOT.jar
[JENKINS] Archiving <https://builds.apache.org/job/maven-plugins/ws/maven-shade-plugin/pom.xml> to /home/hudson/hudson/jobs/maven-plugins/modules/org.apache.maven.plugins$maven-shade-plugin/builds/2012-06-29_22-20-59/archive/org.apache.maven.plugins/maven-shade-plugin/2.0-SNAPSHOT/maven-shade-plugin-2.0-SNAPSHOT.pom
[JENKINS] Archiving <https://builds.apache.org/job/maven-plugins/ws/maven-shade-plugin/target/maven-shade-plugin-2.0-SNAPSHOT.jar> to /home/hudson/hudson/jobs/maven-plugins/modules/org.apache.maven.plugins$maven-shade-plugin/builds/2012-06-29_22-20-59/archive/org.apache.maven.plugins/maven-shade-plugin/2.0-SNAPSHOT/maven-shade-plugin-2.0-SNAPSHOT.jar
[JENKINS] Archiving <https://builds.apache.org/job/maven-plugins/ws/maven-plugins/pom.xml> to /home/hudson/hudson/jobs/maven-plugins/modules/org.apache.maven.plugins$maven-plugins/builds/2012-06-29_22-20-53/archive/org.apache.maven.plugins/maven-plugins/23-SNAPSHOT/maven-plugins-23-SNAPSHOT.pom
[JENKINS] Archiving <https://builds.apache.org/job/maven-plugins/ws/maven-plugins/target/maven-plugins-23-SNAPSHOT-site.xml> to /home/hudson/hudson/jobs/maven-plugins/modules/org.apache.maven.plugins$maven-plugins/builds/2012-06-29_22-20-53/archive/org.apache.maven.plugins/maven-plugins/23-SNAPSHOT/maven-plugins-23-SNAPSHOT-site.xml
[JENKINS] Archiving <https://builds.apache.org/job/maven-plugins/ws/maven-linkcheck-plugin/pom.xml> to /home/hudson/hudson/jobs/maven-plugins/modules/org.apache.maven.plugins$maven-linkcheck-plugin/builds/2012-06-29_22-20-56/archive/org.apache.maven.plugins/maven-linkcheck-plugin/1.2-SNAPSHOT/maven-linkcheck-plugin-1.2-SNAPSHOT.pom
[JENKINS] Archiving <https://builds.apache.org/job/maven-plugins/ws/maven-linkcheck-plugin/target/maven-linkcheck-plugin-1.2-SNAPSHOT.jar> to /home/hudson/hudson/jobs/maven-plugins/modules/org.apache.maven.plugins$maven-linkcheck-plugin/builds/2012-06-29_22-20-56/archive/org.apache.maven.plugins/maven-linkcheck-plugin/1.2-SNAPSHOT/maven-linkcheck-plugin-1.2-SNAPSHOT.jar
[JENKINS] Archiving <https://builds.apache.org/job/maven-plugins/ws/maven-resources-plugin/pom.xml> to /home/hudson/hudson/jobs/maven-plugins/modules/org.apache.maven.plugins$maven-resources-plugin/builds/2012-06-29_22-20-57/archive/org.apache.maven.plugins/maven-resources-plugin/2.6-SNAPSHOT/maven-resources-plugin-2.6-SNAPSHOT.pom
[JENKINS] Archiving <https://builds.apache.org/job/maven-plugins/ws/maven-resources-plugin/target/maven-resources-plugin-2.6-SNAPSHOT.jar> to /home/hudson/hudson/jobs/maven-plugins/modules/org.apache.maven.plugins$maven-resources-plugin/builds/2012-06-29_22-20-57/archive/org.apache.maven.plugins/maven-resources-plugin/2.6-SNAPSHOT/maven-resources-plugin-2.6-SNAPSHOT.jar
Waiting for Jenkins to finish collecting data
mavenExecutionResult exceptions not empty
message : Failed to execute goal org.apache.maven.plugins:maven-plugin-plugin:3.1-SNAPSHOT:helpmojo (generated-helpmojo) on project maven-war-plugin: Error extracting plugin descriptor: 'No mojo definitions were found for plugin: org.apache.maven.plugins:maven-war-plugin.'
cause : Error extracting plugin descriptor: 'No mojo definitions were found for plugin: org.apache.maven.plugins:maven-war-plugin.'
Stack trace : 
org.apache.maven.lifecycle.LifecycleExecutionException: Failed to execute goal org.apache.maven.plugins:maven-plugin-plugin:3.1-SNAPSHOT:helpmojo (generated-helpmojo) on project maven-war-plugin: Error extracting plugin descriptor: 'No mojo definitions were found for plugin: org.apache.maven.plugins:maven-war-plugin.'
	at org.apache.maven.lifecycle.internal.MojoExecutor.execute(MojoExecutor.java:217)
	at org.apache.maven.lifecycle.internal.MojoExecutor.execute(MojoExecutor.java:153)
	at org.apache.maven.lifecycle.internal.MojoExecutor.execute(MojoExecutor.java:145)
	at org.apache.maven.lifecycle.internal.LifecycleModuleBuilder.buildProject(LifecycleModuleBuilder.java:84)
	at org.apache.maven.lifecycle.internal.LifecycleThreadedBuilder$1.call(LifecycleThreadedBuilder.java:167)
	at org.apache.maven.lifecycle.internal.LifecycleThreadedBuilder$1.call(LifecycleThreadedBuilder.java:163)
	at java.util.concurrent.FutureTask$Sync.innerRun(FutureTask.java:269)
	at java.util.concurrent.FutureTask.run(FutureTask.java:123)
	at java.util.concurrent.ThreadPoolExecutor$Worker.runTask(ThreadPoolExecutor.java:651)
	at java.util.concurrent.ThreadPoolExecutor$Worker.run(ThreadPoolExecutor.java:676)
	at java.lang.Thread.run(Thread.java:595)
Caused by: org.apache.maven.plugin.MojoExecutionException: Error extracting plugin descriptor: 'No mojo definitions were found for plugin: org.apache.maven.plugins:maven-war-plugin.'
	at org.apache.maven.plugin.plugin.AbstractGeneratorMojo.execute(AbstractGeneratorMojo.java:245)
	at org.apache.maven.plugin.plugin.HelpGeneratorMojo.execute(HelpGeneratorMojo.java:87)
	at org.apache.maven.plugin.DefaultBuildPluginManager.executeMojo(DefaultBuildPluginManager.java:101)
	at org.apache.maven.lifecycle.internal.MojoExecutor.execute(MojoExecutor.java:209)
	... 10 more
Caused by: org.apache.maven.plugin.descriptor.InvalidPluginDescriptorException: No mojo definitions were found for plugin: org.apache.maven.plugins:maven-war-plugin.
	at org.apache.maven.tools.plugin.scanner.DefaultMojoScanner.populatePluginDescriptor(DefaultMojoScanner.java:126)
	at org.apache.maven.plugin.plugin.AbstractGeneratorMojo.execute(AbstractGeneratorMojo.java:233)
	... 13 more
Sending e-mails to: notifications@maven.apache.org
channel stopped

Mime
View raw message