maven-notifications mailing list archives

Site index · List index
Message view « Date » · « Thread »
Top « Date » · « Thread »
From Apache Jenkins Server <jenk...@builds.apache.org>
Subject Build failed in Jenkins: maven-plugins-ITs-m3 #506
Date Sat, 30 Jun 2012 11:57:16 GMT
See <https://builds.apache.org/job/maven-plugins-ITs-m3/506/changes>

Changes:

[Robert Scholte] Improve generics

------------------------------------------
[...truncated 9237 lines...]
[INFO] Mojo extractor for language: java-annotations found 1 mojo descriptors.
[INFO] 
[INFO] --- plexus-component-metadata:1.5.5:generate-metadata (default) @ maven-shade-plugin
---
[INFO] Discovered 1 component descriptors(s)
[INFO] 
[INFO] --- maven-resources-plugin:2.5:testResources (default-testResources) @ maven-shade-plugin
---
[debug] execute contextualize
[INFO] Using 'UTF-8' encoding to copy filtered resources.
[INFO] Copying 3 resources
[INFO] Copying 3 resources
[INFO] 
[INFO] --- maven-compiler-plugin:2.3.2:testCompile (default-testCompile) @ maven-shade-plugin
---
[INFO] Compiling 15 source files to <https://builds.apache.org/job/maven-plugins-ITs-m3/ws/maven-shade-plugin/target/test-classes>
[INFO] 
[INFO] --- plexus-component-metadata:1.5.5:generate-test-metadata (default) @ maven-shade-plugin
---
[INFO] Discovered 1 component descriptors(s)
[INFO] 
[INFO] --- maven-surefire-plugin:2.9:test (default-test) @ maven-shade-plugin ---
[INFO] Surefire report directory: <https://builds.apache.org/job/maven-plugins-ITs-m3/ws/maven-shade-plugin/target/surefire-reports>

-------------------------------------------------------
 T E S T S
-------------------------------------------------------
Running org.apache.maven.plugins.shade.DefaultShaderTest
Tests run: 4, Failures: 0, Errors: 0, Skipped: 0, Time elapsed: 2.394 sec
Running org.apache.maven.plugins.shade.resource.ApacheLicenseResourceTransformerTest
Tests run: 1, Failures: 0, Errors: 0, Skipped: 0, Time elapsed: 0.004 sec
Running org.apache.maven.plugins.shade.resource.XmlAppendingTransformerTest
Tests run: 1, Failures: 0, Errors: 0, Skipped: 0, Time elapsed: 0.008 sec
Running org.apache.maven.plugins.shade.resource.AppendingTransformerTest
Tests run: 1, Failures: 0, Errors: 0, Skipped: 0, Time elapsed: 0.001 sec
Running org.apache.maven.plugins.shade.resource.ApacheNoticeResourceTransformerTest
Tests run: 1, Failures: 0, Errors: 0, Skipped: 0, Time elapsed: 0.002 sec
Running org.apache.maven.plugins.shade.resource.ComponentsXmlResourceTransformerTest
Tests run: 1, Failures: 0, Errors: 0, Skipped: 0, Time elapsed: 0.09 sec
Running org.apache.maven.plugins.shade.mojo.ShadeMojoTest
Tests run: 4, Failures: 0, Errors: 0, Skipped: 0, Time elapsed: 2.267 sec
Running org.apache.maven.plugins.shade.mojo.RelativizePathTest
Tests run: 1, Failures: 0, Errors: 0, Skipped: 0, Time elapsed: 0.017 sec
Running org.apache.maven.plugins.shade.mojo.ArtifactSelectorTest
Tests run: 1, Failures: 0, Errors: 0, Skipped: 0, Time elapsed: 0.012 sec
Running org.apache.maven.plugins.shade.mojo.ArtifactIdTest
Tests run: 2, Failures: 0, Errors: 0, Skipped: 0, Time elapsed: 0.002 sec
Running org.apache.maven.plugins.shade.filter.SimpleFilterTest
Tests run: 1, Failures: 0, Errors: 0, Skipped: 0, Time elapsed: 0 sec
Running org.apache.maven.plugins.shade.relocation.SimpleRelocatorTest
Tests run: 7, Failures: 0, Errors: 0, Skipped: 0, Time elapsed: 0.003 sec
Running org.apache.maven.plugins.shade.relocation.SimpleRelocatorParameterTest
Tests run: 2, Failures: 0, Errors: 0, Skipped: 0, Time elapsed: 0 sec

Results :

Tests run: 27, Failures: 0, Errors: 0, Skipped: 0

[INFO] 
[INFO] --- maven-jar-plugin:2.3.1:jar (default-jar) @ maven-shade-plugin ---
[INFO] Building jar: <https://builds.apache.org/job/maven-plugins-ITs-m3/ws/maven-shade-plugin/target/maven-shade-plugin-2.0-SNAPSHOT.jar>
[INFO] 
[INFO] --- maven-plugin-plugin:3.0:addPluginArtifactMetadata (default-addPluginArtifactMetadata)
@ maven-shade-plugin ---
[INFO] 
[INFO] --- maven-jar-plugin:2.3.1:test-jar (default) @ maven-shade-plugin ---
[INFO] Building jar: <https://builds.apache.org/job/maven-plugins-ITs-m3/ws/maven-shade-plugin/target/maven-shade-plugin-2.0-SNAPSHOT-tests.jar>
[INFO] 
[INFO] --- maven-invoker-plugin:1.5:install (integration-test) @ maven-shade-plugin ---
[INFO] Installing <https://builds.apache.org/job/maven-plugins-ITs-m3/ws/maven-shade-plugin/pom.xml>
to <https://builds.apache.org/job/maven-plugins-ITs-m3/ws/maven-shade-plugin/target/local-repo/org/apache/maven/plugins/maven-shade-plugin/2.0-SNAPSHOT/maven-shade-plugin-2.0-SNAPSHOT.pom>
[INFO] Installing <https://builds.apache.org/job/maven-plugins-ITs-m3/ws/maven-shade-plugin/target/maven-shade-plugin-2.0-SNAPSHOT.jar>
to <https://builds.apache.org/job/maven-plugins-ITs-m3/ws/maven-shade-plugin/target/local-repo/org/apache/maven/plugins/maven-shade-plugin/2.0-SNAPSHOT/maven-shade-plugin-2.0-SNAPSHOT.jar>
[INFO] Installing <https://builds.apache.org/job/maven-plugins-ITs-m3/ws/maven-shade-plugin/target/maven-shade-plugin-2.0-SNAPSHOT-tests.jar>
to <https://builds.apache.org/job/maven-plugins-ITs-m3/ws/maven-shade-plugin/target/local-repo/org/apache/maven/plugins/maven-shade-plugin/2.0-SNAPSHOT/maven-shade-plugin-2.0-SNAPSHOT-tests.jar>
[INFO] 
[INFO] --- maven-invoker-plugin:1.5:integration-test (integration-test) @ maven-shade-plugin
---
[INFO] Building: artifact-includes-excludes/pom.xml
[INFO] ..SUCCESS (7.6 s)
[INFO] Building: dep-reduced-pom-with-local-parent/pom.xml
[INFO] ..SUCCESS (5.8 s)
[INFO] Building: implicit-inclusion-of-project-artifact/pom.xml
[INFO] ..SUCCESS (7.0 s)
[INFO] Building: reloc-class-from-string-pool/pom.xml
[INFO] ..SUCCESS (6.3 s)
[INFO] Building: non-runtime-scope-excluded/pom.xml
[INFO] ..SUCCESS (6.2 s)
[INFO] Building: manifest-transformed/pom.xml
[INFO] ..SUCCESS (7.6 s)
[INFO] Building: duplicate-classes-without-reloc/pom.xml
[INFO] ..SUCCESS (4.7 s)
[INFO] Building: mini-jar-respect-includes/pom.xml
[INFO] ..SUCCESS (7.4 s)
[INFO] Building: pom-packaging/pom.xml
[INFO] ..SUCCESS (3.9 s)
[INFO] Building: xml-transformer-ignores-dtd/pom.xml
[INFO] ..SUCCESS (6.4 s)
[INFO] Building: empty-relocation-shaded-pattern/pom.xml
[INFO] ..SUCCESS (6.4 s)
[INFO] Building: mshade-123/pom.xml
[INFO] ..SUCCESS (9.5 s)
[INFO] Building: manifest-retained/pom.xml
[INFO] ..SUCCESS (6.6 s)
[INFO] Building: finalNameBuild/pom.xml
[INFO] ..SUCCESS (6.3 s)
[INFO] Building: finalNameShade/pom.xml
[INFO] ..SUCCESS (6.9 s)
[INFO] Building: reloc-abs-resource-path/pom.xml
[INFO] ..SUCCESS (10.4 s)
[INFO] Building: empty-apache-notice-transform/pom.xml
[INFO] ..SUCCESS (7.2 s)
[INFO] Building: services-resource-transformer/pom.xml
[INFO] ..SUCCESS (6.7 s)
[INFO] Building: mini-jar-package-info/pom.xml
[INFO] ..SUCCESS (7.7 s)
[INFO] Building: rerun-without-reloc/pom.xml
[INFO] ..SUCCESS (6.1 s)
[INFO] Building: shadePomDependency/pom.xml
[INFO] ..SUCCESS (7.4 s)
[INFO] Building: reloc-includes-excludes/pom.xml
[INFO] ..SUCCESS (7.1 s)
[INFO] Building: finalNameShade-attached/pom.xml
[INFO] ..SUCCESS (6.1 s)
[INFO] Building: component-descriptor-relocation/pom.xml
[INFO] ..SUCCESS (7.1 s)
[INFO] Building: users-shader-impl/pom.xml
[INFO] ..SUCCESS (7.0 s)
[INFO] Building: mini-jar-malformed-dependencies/pom.xml
[INFO] ..SUCCESS (11.4 s)
[INFO] Building: finalNameBuild-attached/pom.xml
[INFO] ..SUCCESS (6.3 s)
[INFO] Building: attach-after-lifecycle-fork/pom.xml
[INFO] ..SUCCESS (5.1 s)
[INFO] Building: empty-relocation-pattern/pom.xml
[INFO] ..SUCCESS (5.7 s)
[INFO] Building: mini-jar/pom.xml
[INFO] ..SUCCESS (7.5 s)
[INFO] Building: reloc-anno/pom.xml
[INFO] ..SUCCESS (5.5 s)
[INFO] Building: MSHADE-105/pom.xml
[INFO] ..SUCCESS (12.3 s)
[INFO] Building: dep-reduced-pom-relocated-result/pom.xml
[INFO] ..SUCCESS (5.1 s)
[INFO] Building: attached-artifact-type/pom.xml
[INFO] ..SUCCESS (5.2 s)
[INFO] Building: dep-reduced-pom/pom.xml
[INFO] ..SUCCESS (6.1 s)
[INFO] Building: rerun-with-reloc/pom.xml
[INFO] ..SUCCESS (8.0 s)
[INFO] Building: duplicate-classes-with-reloc/pom.xml
[INFO] ..SUCCESS (4.5 s)
[INFO] Building: filter-artifact-contents/pom.xml
[INFO] ..SUCCESS (6.5 s)
[INFO] Building: project-with-reactors-included/pom.xml
[INFO] ..SUCCESS (8.9 s)
[INFO] Building: reloc-enum-ref-from-anno/pom.xml
[INFO] ..SUCCESS (5.0 s)
[INFO] 
[INFO] --- maven-invoker-plugin:1.5:verify (integration-test) @ maven-shade-plugin ---
[INFO] -------------------------------------------------
[INFO] Build Summary:
[INFO]   Passed: 40, Failed: 0, Errors: 0, Skipped: 0
[INFO] -------------------------------------------------
[INFO] 
[INFO] --- maven-install-plugin:2.3.1:install (default-install) @ maven-shade-plugin ---
[INFO] Installing <https://builds.apache.org/job/maven-plugins-ITs-m3/ws/maven-shade-plugin/target/maven-shade-plugin-2.0-SNAPSHOT.jar>
to <https://builds.apache.org/job/maven-plugins-ITs-m3/ws/.repository/org/apache/maven/plugins/maven-shade-plugin/2.0-SNAPSHOT/maven-shade-plugin-2.0-SNAPSHOT.jar>
[INFO] Installing <https://builds.apache.org/job/maven-plugins-ITs-m3/ws/maven-shade-plugin/pom.xml>
to <https://builds.apache.org/job/maven-plugins-ITs-m3/ws/.repository/org/apache/maven/plugins/maven-shade-plugin/2.0-SNAPSHOT/maven-shade-plugin-2.0-SNAPSHOT.pom>
[INFO] Installing <https://builds.apache.org/job/maven-plugins-ITs-m3/ws/maven-shade-plugin/target/maven-shade-plugin-2.0-SNAPSHOT-tests.jar>
to <https://builds.apache.org/job/maven-plugins-ITs-m3/ws/.repository/org/apache/maven/plugins/maven-shade-plugin/2.0-SNAPSHOT/maven-shade-plugin-2.0-SNAPSHOT-tests.jar>
[INFO]                                                                         
[INFO] ------------------------------------------------------------------------
[INFO] Building Maven Plugins Aggregator 1-SNAPSHOT
[INFO] ------------------------------------------------------------------------
[INFO] 
[INFO] --- maven-clean-plugin:2.4.1:clean (default-clean) @ maven-plugins-aggregator ---
[INFO] Deleting <https://builds.apache.org/job/maven-plugins-ITs-m3/ws/target>
[INFO] 
[INFO] --- maven-remote-resources-plugin:1.1:process (default) @ maven-plugins-aggregator
---
[INFO] 
[INFO] --- maven-install-plugin:2.3.1:install (default-install) @ maven-plugins-aggregator
---
[INFO] Installing <https://builds.apache.org/job/maven-plugins-ITs-m3/ws/pom.xml> to
<https://builds.apache.org/job/maven-plugins-ITs-m3/ws/.repository/org/apache/maven/plugins/maven-plugins-aggregator/1-SNAPSHOT/maven-plugins-aggregator-1-SNAPSHOT.pom>
[INFO] ------------------------------------------------------------------------
[INFO] Reactor Summary:
[INFO] 
[INFO] Maven Plugins ..................................... SUCCESS [39.731s]
[INFO] Maven ACR Plugin .................................. SUCCESS [41.956s]
[INFO] Maven Ant Plugin .................................. SUCCESS [1:55.357s]
[INFO] Maven AntRun Plugin ............................... SUCCESS [1:38.148s]
[INFO] Maven Eclipse Plugin .............................. SUCCESS [10:11.841s]
[INFO] Maven Assembly Plugin ............................. SUCCESS [18:10.202s]
[INFO] Maven Changelog Plugin ............................ SUCCESS [1:13.346s]
[INFO] Maven Changes Report Plugin ....................... SUCCESS [1:27.495s]
[INFO] Maven Checkstyle Plugin ........................... SUCCESS [2:29.702s]
[INFO] Maven Clean Plugin ................................ SUCCESS [36.099s]
[INFO] Maven Compiler Plugin ............................. SUCCESS [1:04.805s]
[INFO] Maven Dependency Plugin ........................... SUCCESS [3:33.375s]
[INFO] Maven Deploy Plugin ............................... SUCCESS [1:53.919s]
[INFO] Maven DOAP Plugin ................................. SUCCESS [24.921s]
[INFO] Maven Documentation Checker Plugin ................ SUCCESS [10.444s]
[INFO] Maven EAR Plugin .................................. SUCCESS [6:18.828s]
[INFO] Maven EJB Plugin .................................. SUCCESS [50.638s]
[INFO] Maven GPG Plugin .................................. SUCCESS [1:06.875s]
[INFO] Maven Help Plugin ................................. SUCCESS [1:02.412s]
[INFO] Maven IDEA Plugin ................................. SUCCESS [13.056s]
[INFO] Maven Install Plugin .............................. SUCCESS [1:03.952s]
[INFO] Maven JAR Plugin .................................. SUCCESS [2:00.566s]
[INFO] Maven Jarsigner Plugin ............................ SUCCESS [44.134s]
[INFO] Maven Javadoc Plugin .............................. SUCCESS [6:14.366s]
[INFO] Maven Linkcheck Plugin ............................ SUCCESS [3.144s]
[INFO] Maven One Plugin .................................. SUCCESS [3.520s]
[INFO] Maven Patch Plugin ................................ SUCCESS [22.119s]
[INFO] Maven PDF Plugin .................................. SUCCESS [48.210s]
[INFO] Maven PMD Plugin .................................. SUCCESS [1:01.101s]
[INFO] Maven RAR Plugin .................................. SUCCESS [11.308s]
[INFO] Maven Reactor Plugin .............................. SUCCESS [4.264s]
[INFO] Maven Repository Plugin ........................... FAILURE [32.488s]
[INFO] Maven Resources Plugin ............................ SUCCESS [1:46.421s]
[INFO] Maven Site Plugin 3 ............................... FAILURE [9:39.273s]
[INFO] Maven Source Plugin ............................... SUCCESS [1:08.371s]
[INFO] Maven Stage Plugin ................................ SUCCESS [2.931s]
[INFO] Maven Toolchains Plugin ........................... SUCCESS [2.433s]
[INFO] Maven Verifier Plugin ............................. SUCCESS [17.329s]
[INFO] Maven WAR Plugin .................................. FAILURE [0.002s]
[INFO] Maven Invoker Plugin .............................. FAILURE [6:22.855s]
[INFO] Maven Project Info Reports Plugin ................. SUCCESS [3:23.578s]
[INFO] Maven Remote Resources Plugin ..................... FAILURE [1:10.594s]
[INFO] Maven Shade Plugin ................................ SUCCESS [4:59.886s]
[INFO] Maven Plugins Aggregator .......................... SUCCESS [0.135s]
[INFO] ------------------------------------------------------------------------
[INFO] BUILD FAILURE
[INFO] ------------------------------------------------------------------------
[INFO] Total time: 1:38:01.133s
[INFO] Finished at: Sat Jun 30 11:57:15 UTC 2012
[INFO] Final Memory: 73M/1010M
[INFO] ------------------------------------------------------------------------
[WARNING] The requested profile "apache.snapshots" could not be activated because it does
not exist.
[ERROR] Failed to execute goal org.apache.maven.plugins:maven-surefire-plugin:2.9:test (integration-tests)
on project maven-repository-plugin: There are test failures.
[ERROR] 
[ERROR] Please refer to <https://builds.apache.org/job/maven-plugins-ITs-m3/ws/maven-repository-plugin/target/surefire-reports>
for the individual test results.
[ERROR] -> [Help 1]
[ERROR] Failed to execute goal org.apache.maven.plugins:maven-invoker-plugin:1.5:verify (integration-test)
on project maven-site-plugin: 1 build failed. -> [Help 1]
[ERROR] Plugin org.apache.maven.plugins:maven-plugin-plugin:3.1-SNAPSHOT or one of its dependencies
could not be resolved: Failed to read artifact descriptor for org.apache.maven.plugins:maven-plugin-plugin:jar:3.1-SNAPSHOT:
Could not find artifact org.apache.maven.plugins:maven-plugin-plugin:pom:3.1-SNAPSHOT ->
[Help 2]
[ERROR] Failed to execute goal org.apache.maven.plugins:maven-invoker-plugin:1.5:verify (integration-test)
on project maven-invoker-plugin: 2 builds failed. -> [Help 1]
[ERROR] Failed to execute goal org.apache.maven.plugins:maven-failsafe-plugin:2.9:verify (integration-tests)
on project maven-remote-resources-plugin: There are test failures.
[ERROR] 
[ERROR] Please refer to <https://builds.apache.org/job/maven-plugins-ITs-m3/ws/maven-remote-resources-plugin/target/failsafe-reports>
for the individual test results.
[ERROR] -> [Help 1]
[ERROR] 
[ERROR] To see the full stack trace of the errors, re-run Maven with the -e switch.
[ERROR] Re-run Maven using the -X switch to enable full debug logging.
[ERROR] 
[ERROR] For more information about the errors and possible solutions, please read the following
articles:
[ERROR] [Help 1] http://cwiki.apache.org/confluence/display/MAVEN/MojoFailureException
[ERROR] [Help 2] http://cwiki.apache.org/confluence/display/MAVEN/PluginResolutionException
[ERROR] 
[ERROR] After correcting the problems, you can resume the build with the command
[ERROR]   mvn <goals> -rf :maven-repository-plugin
Build step 'Invoke top-level Maven targets' marked build as failure

Mime
View raw message