maven-notifications mailing list archives

Site index · List index
Message view « Date » · « Thread »
Top « Date » · « Thread »
From Apache Jenkins Server <jenk...@builds.apache.org>
Subject Build failed in Jenkins: maven-plugin-tools-m2 #26
Date Mon, 14 May 2012 22:09:17 GMT
See <https://builds.apache.org/job/maven-plugin-tools-m2/26/changes>

Changes:

[hboutemy] improved documentation

[hboutemy] improved documentation

[hboutemy] fixed typos

[hboutemy] added link to Annotations section

[olamy] add it test for plugin report with annotations

[hboutemy] improved javadoc

[hboutemy] reworked documentation with links to javadoc

[hboutemy] removed unused import

[hboutemy] added javadoc

------------------------------------------
[...truncated 461 lines...]
[INFO] ..SUCCESS (11.0 s)
[INFO] Building: ant-basic/pom.xml
[INFO] ..SUCCESS (7.8 s)
[INFO] Building: help-package/pom.xml
[INFO] ..SUCCESS (4.7 s)
[INFO] Building: java-basic/pom.xml
[INFO] ..SUCCESS (5.7 s)
[INFO] Building: ignore-plugin-class-realm/pom.xml
[INFO] ..SUCCESS (7.8 s)
[INFO] Building: help-basic/pom.xml
[INFO] ..SUCCESS (6.2 s)
[INFO] Building: beanshell-simple/pom.xml
[INFO] ..SUCCESS (7.6 s)
[INFO] Building: mplugin-187/pom.xml
[INFO] ..SUCCESS (3.6 s)
[INFO] Building: plugin-info-jdk-default-version/pom.xml
[INFO] ..SUCCESS (12.7 s)
[INFO] Building: source-encoding/pom.xml
[INFO] ..SUCCESS (5.4 s)
[INFO] Building: skip/pom.xml
[INFO] ..SUCCESS (4.0 s)
[INFO] Building: plugin-report/pom.xml
[INFO] ..SUCCESS (26.7 s)
[INFO] [invoker:verify {execution: integration-test}]
[INFO] -------------------------------------------------
[INFO] Build Summary:
[INFO]   Passed: 17, Failed: 1, Errors: 0, Skipped: 0
[INFO] -------------------------------------------------
[ERROR] The following builds failed:
[ERROR] *  plugin-report-annotations/pom.xml
[INFO] -------------------------------------------------
[JENKINS] Archiving <https://builds.apache.org/job/maven-plugin-tools-m2/ws/maven-plugin-plugin/pom.xml>
to /home/hudson/hudson/jobs/maven-plugin-tools-m2/modules/org.apache.maven.plugins$maven-plugin-plugin/builds/2012-05-14_22-02-56/archive/org.apache.maven.plugins/maven-plugin-plugin/3.0-SNAPSHOT/maven-plugin-plugin-3.0-SNAPSHOT.pom
[JENKINS] Archiving <https://builds.apache.org/job/maven-plugin-tools-m2/ws/maven-plugin-plugin/target/maven-plugin-plugin-3.0-SNAPSHOT.jar>
to /home/hudson/hudson/jobs/maven-plugin-tools-m2/modules/org.apache.maven.plugins$maven-plugin-plugin/builds/2012-05-14_22-02-56/archive/org.apache.maven.plugins/maven-plugin-plugin/3.0-SNAPSHOT/maven-plugin-plugin-3.0-SNAPSHOT.jar
[INFO] ------------------------------------------------------------------------
[INFO] Building Maven Plugin Tools Javadoc
[INFO]    task-segment: [clean, install]
[INFO] ------------------------------------------------------------------------
[INFO] [clean:clean {execution: default-clean}]
[INFO] [remote-resources:process {execution: default}]
[debug] execute contextualize
[INFO] [resources:resources {execution: default-resources}]
[INFO] Using 'UTF-8' encoding to copy filtered resources.
[INFO] skip non existing resourceDirectory <https://builds.apache.org/job/maven-plugin-tools-m2/ws/maven-plugin-tools-javadoc/src/main/resources>
[INFO] Copying 3 resources
[INFO] [compiler:compile {execution: default-compile}]
[INFO] Compiling 22 source files to <https://builds.apache.org/job/maven-plugin-tools-m2/ws/maven-plugin-tools-javadoc/target/classes>
[debug] execute contextualize
[INFO] [resources:testResources {execution: default-testResources}]
[INFO] Using 'UTF-8' encoding to copy filtered resources.
[INFO] skip non existing resourceDirectory <https://builds.apache.org/job/maven-plugin-tools-m2/ws/maven-plugin-tools-javadoc/src/test/resources>
[INFO] Copying 3 resources
[INFO] [compiler:testCompile {execution: default-testCompile}]
[INFO] No sources to compile
[INFO] [surefire:test {execution: default-test}]
[INFO] Surefire report directory: <https://builds.apache.org/job/maven-plugin-tools-m2/ws/maven-plugin-tools-javadoc/target/surefire-reports>

-------------------------------------------------------
 T E S T S
-------------------------------------------------------

Results :

Tests run: 0, Failures: 0, Errors: 0, Skipped: 0
[JENKINS] Recording test results

[INFO] [jar:jar {execution: default-jar}]
[INFO] Building jar: <https://builds.apache.org/job/maven-plugin-tools-m2/ws/maven-plugin-tools-javadoc/target/maven-plugin-tools-javadoc-3.0-SNAPSHOT.jar>
[INFO] [invoker:install {execution: integration-test}]
[INFO] Installing <https://builds.apache.org/job/maven-plugin-tools-m2/ws/maven-plugin-tools-java/pom.xml>
to <https://builds.apache.org/job/maven-plugin-tools-m2/ws/maven-plugin-tools-javadoc/target/local-repo/org/apache/maven/plugin-tools/maven-plugin-tools-java/3.0-SNAPSHOT/maven-plugin-tools-java-3.0-SNAPSHOT.pom>
[INFO] Installing <https://builds.apache.org/job/maven-plugin-tools-m2/ws/maven-plugin-tools-java/target/maven-plugin-tools-java-3.0-SNAPSHOT.jar>
to <https://builds.apache.org/job/maven-plugin-tools-m2/ws/maven-plugin-tools-javadoc/target/local-repo/org/apache/maven/plugin-tools/maven-plugin-tools-java/3.0-SNAPSHOT/maven-plugin-tools-java-3.0-SNAPSHOT.jar>
[INFO] Installing <https://builds.apache.org/job/maven-plugin-tools-m2/ws/pom.xml> to
<https://builds.apache.org/job/maven-plugin-tools-m2/ws/maven-plugin-tools-javadoc/target/local-repo/org/apache/maven/plugin-tools/maven-plugin-tools/3.0-SNAPSHOT/maven-plugin-tools-3.0-SNAPSHOT.pom>
[INFO] Installing <https://builds.apache.org/job/maven-plugin-tools-m2/ws/maven-plugin-tools-api/pom.xml>
to <https://builds.apache.org/job/maven-plugin-tools-m2/ws/maven-plugin-tools-javadoc/target/local-repo/org/apache/maven/plugin-tools/maven-plugin-tools-api/3.0-SNAPSHOT/maven-plugin-tools-api-3.0-SNAPSHOT.pom>
[INFO] Installing <https://builds.apache.org/job/maven-plugin-tools-m2/ws/maven-plugin-tools-api/target/maven-plugin-tools-api-3.0-SNAPSHOT.jar>
to <https://builds.apache.org/job/maven-plugin-tools-m2/ws/maven-plugin-tools-javadoc/target/local-repo/org/apache/maven/plugin-tools/maven-plugin-tools-api/3.0-SNAPSHOT/maven-plugin-tools-api-3.0-SNAPSHOT.jar>
[INFO] Installing <https://builds.apache.org/job/maven-plugin-tools-m2/ws/maven-plugin-tools-javadoc/pom.xml>
to <https://builds.apache.org/job/maven-plugin-tools-m2/ws/maven-plugin-tools-javadoc/target/local-repo/org/apache/maven/plugin-tools/maven-plugin-tools-javadoc/3.0-SNAPSHOT/maven-plugin-tools-javadoc-3.0-SNAPSHOT.pom>
[INFO] Installing <https://builds.apache.org/job/maven-plugin-tools-m2/ws/maven-plugin-tools-javadoc/target/maven-plugin-tools-javadoc-3.0-SNAPSHOT.jar>
to <https://builds.apache.org/job/maven-plugin-tools-m2/ws/maven-plugin-tools-javadoc/target/local-repo/org/apache/maven/plugin-tools/maven-plugin-tools-javadoc/3.0-SNAPSHOT/maven-plugin-tools-javadoc-3.0-SNAPSHOT.jar>
[INFO] [invoker:run {execution: integration-test}]
[INFO] Building: basic/pom.xml
[INFO] ..SUCCESS (5.3 s)
[INFO] -------------------------------------------------
[INFO] Build Summary:
[INFO]   Passed: 1, Failed: 0, Errors: 0, Skipped: 0
[INFO] -------------------------------------------------
[INFO] [install:install {execution: default-install}]
[INFO] Installing <https://builds.apache.org/job/maven-plugin-tools-m2/ws/maven-plugin-tools-javadoc/target/maven-plugin-tools-javadoc-3.0-SNAPSHOT.jar>
to /home/jenkins/jenkins-slave/maven-repositories/1/org/apache/maven/plugin-tools/maven-plugin-tools-javadoc/3.0-SNAPSHOT/maven-plugin-tools-javadoc-3.0-SNAPSHOT.jar
[JENKINS] Archiving <https://builds.apache.org/job/maven-plugin-tools-m2/ws/maven-plugin-tools-javadoc/pom.xml>
to /home/hudson/hudson/jobs/maven-plugin-tools-m2/modules/org.apache.maven.plugin-tools$maven-plugin-tools-javadoc/builds/2012-05-14_22-02-57/archive/org.apache.maven.plugin-tools/maven-plugin-tools-javadoc/3.0-SNAPSHOT/maven-plugin-tools-javadoc-3.0-SNAPSHOT.pom
[JENKINS] Archiving <https://builds.apache.org/job/maven-plugin-tools-m2/ws/maven-plugin-tools-javadoc/target/maven-plugin-tools-javadoc-3.0-SNAPSHOT.jar>
to /home/hudson/hudson/jobs/maven-plugin-tools-m2/modules/org.apache.maven.plugin-tools$maven-plugin-tools-javadoc/builds/2012-05-14_22-02-57/archive/org.apache.maven.plugin-tools/maven-plugin-tools-javadoc/3.0-SNAPSHOT/maven-plugin-tools-javadoc-3.0-SNAPSHOT.jar
[INFO] ------------------------------------------------------------------------
[INFO] Building Maven Plugin Metadata Model
[INFO]    task-segment: [clean, install]
[INFO] ------------------------------------------------------------------------
[INFO] [clean:clean {execution: default-clean}]
[INFO] [modello:java {execution: standard}]
[INFO] outputDirectory: <https://builds.apache.org/job/maven-plugin-tools-m2/ws/maven-plugin-tools-model/target/generated-sources/modello>
[INFO] Working on model: src/main/mdo/plugin-metadata.mdo
[INFO] Generating current version: 1.0.0
[INFO] [modello:xpp3-reader {execution: standard}]
[INFO] outputDirectory: <https://builds.apache.org/job/maven-plugin-tools-m2/ws/maven-plugin-tools-model/target/generated-sources/modello>
[INFO] Working on model: src/main/mdo/plugin-metadata.mdo
[INFO] Generating current version: 1.0.0
[INFO] [modello:xpp3-writer {execution: standard}]
[INFO] outputDirectory: <https://builds.apache.org/job/maven-plugin-tools-m2/ws/maven-plugin-tools-model/target/generated-sources/modello>
[INFO] Working on model: src/main/mdo/plugin-metadata.mdo
[INFO] Generating current version: 1.0.0
[INFO] [remote-resources:process {execution: default}]
[debug] execute contextualize
[INFO] [resources:resources {execution: default-resources}]
[INFO] Using 'UTF-8' encoding to copy filtered resources.
[INFO] skip non existing resourceDirectory <https://builds.apache.org/job/maven-plugin-tools-m2/ws/maven-plugin-tools-model/src/main/resources>
[INFO] Copying 3 resources
[INFO] [compiler:compile {execution: default-compile}]
[INFO] Compiling 9 source files to <https://builds.apache.org/job/maven-plugin-tools-m2/ws/maven-plugin-tools-model/target/classes>
[debug] execute contextualize
[JENKINS] Recording test results[INFO] [resources:testResources {execution: default-testResources}]
[INFO] Using 'UTF-8' encoding to copy filtered resources.
[INFO] Copying 2 resources
[INFO] Copying 3 resources
[INFO] [compiler:testCompile {execution: default-testCompile}]
[INFO] Compiling 1 source file to <https://builds.apache.org/job/maven-plugin-tools-m2/ws/maven-plugin-tools-model/target/test-classes>
[INFO] [surefire:test {execution: default-test}]
[INFO] Surefire report directory: <https://builds.apache.org/job/maven-plugin-tools-m2/ws/maven-plugin-tools-model/target/surefire-reports>

-------------------------------------------------------
 T E S T S
-------------------------------------------------------
Running org.apache.maven.plugin.tools.model.PluginMetadataParserTest
Tests run: 2, Failures: 0, Errors: 0, Skipped: 0, Time elapsed: 0.051 sec

Results :

Tests run: 2, Failures: 0, Errors: 0, Skipped: 0


[INFO] [jar:jar {execution: default-jar}]
[INFO] Building jar: <https://builds.apache.org/job/maven-plugin-tools-m2/ws/maven-plugin-tools-model/target/maven-plugin-tools-model-3.0-SNAPSHOT.jar>
[INFO] [install:install {execution: default-install}]
[INFO] Installing <https://builds.apache.org/job/maven-plugin-tools-m2/ws/maven-plugin-tools-model/target/maven-plugin-tools-model-3.0-SNAPSHOT.jar>
to /home/jenkins/jenkins-slave/maven-repositories/1/org/apache/maven/plugin-tools/maven-plugin-tools-model/3.0-SNAPSHOT/maven-plugin-tools-model-3.0-SNAPSHOT.jar
[JENKINS] Archiving <https://builds.apache.org/job/maven-plugin-tools-m2/ws/maven-plugin-tools-model/pom.xml>
to /home/hudson/hudson/jobs/maven-plugin-tools-m2/modules/org.apache.maven.plugin-tools$maven-plugin-tools-model/builds/2012-05-14_22-02-59/archive/org.apache.maven.plugin-tools/maven-plugin-tools-model/3.0-SNAPSHOT/maven-plugin-tools-model-3.0-SNAPSHOT.pom
[JENKINS] Archiving <https://builds.apache.org/job/maven-plugin-tools-m2/ws/maven-plugin-tools-model/target/maven-plugin-tools-model-3.0-SNAPSHOT.jar>
to /home/hudson/hudson/jobs/maven-plugin-tools-m2/modules/org.apache.maven.plugin-tools$maven-plugin-tools-model/builds/2012-05-14_22-02-59/archive/org.apache.maven.plugin-tools/maven-plugin-tools-model/3.0-SNAPSHOT/maven-plugin-tools-model-3.0-SNAPSHOT.jar
[INFO] ------------------------------------------------------------------------
[INFO] Building Maven Plugin Tool for Ant
[INFO]    task-segment: [clean, install]
[INFO] ------------------------------------------------------------------------
[INFO] [clean:clean {execution: default-clean}]
[INFO] [remote-resources:process {execution: default}]
[debug] execute contextualize
[INFO] [resources:resources {execution: default-resources}]
[INFO] Using 'UTF-8' encoding to copy filtered resources.
[INFO] skip non existing resourceDirectory <https://builds.apache.org/job/maven-plugin-tools-m2/ws/maven-plugin-tools-ant/src/main/resources>
[INFO] Copying 3 resources
[INFO] [compiler:compile {execution: default-compile}]
[INFO] Compiling 1 source file to <https://builds.apache.org/job/maven-plugin-tools-m2/ws/maven-plugin-tools-ant/target/classes>
[INFO] [plexus-component-metadata:generate-metadata {execution: default}]
[INFO] Discovered 1 component descriptors(s)
[debug] execute contextualize
[INFO] [resources:testResources {execution: default-testResources}]
[INFO] Using 'UTF-8' encoding to copy filtered resources.
[INFO] Copying 2 resources
[INFO] Copying 3 resources
[INFO] [compiler:testCompile {execution: default-testCompile}]
[INFO] Compiling 1 source file to <https://builds.apache.org/job/maven-plugin-tools-m2/ws/maven-plugin-tools-ant/target/test-classes>
[INFO] [plexus-component-metadata:generate-test-metadata {execution: default}]
[INFO] [surefire:test {execution: default-test}]
[INFO] Surefire report directory: <https://builds.apache.org/job/maven-plugin-tools-m2/ws/maven-plugin-tools-ant/target/surefire-reports>

-------------------------------------------------------
 T E S T S
-------------------------------------------------------
Running org.apache.maven.tools.plugin.extractor.ant.AntMojoDescriptorExtractorTest
Tests run: 1, Failures: 0, Errors: 0, Skipped: 0, Time elapsed: 0.075 sec

Results :

Tests run: 1, Failures: 0, Errors: 0, Skipped: 0

[JENKINS] Recording test results
[INFO] [jar:jar {execution: default-jar}]
[INFO] Building jar: <https://builds.apache.org/job/maven-plugin-tools-m2/ws/maven-plugin-tools-ant/target/maven-plugin-tools-ant-3.0-SNAPSHOT.jar>
[INFO] [install:install {execution: default-install}]
[INFO] Installing <https://builds.apache.org/job/maven-plugin-tools-m2/ws/maven-plugin-tools-ant/target/maven-plugin-tools-ant-3.0-SNAPSHOT.jar>
to /home/jenkins/jenkins-slave/maven-repositories/1/org/apache/maven/plugin-tools/maven-plugin-tools-ant/3.0-SNAPSHOT/maven-plugin-tools-ant-3.0-SNAPSHOT.jar
[JENKINS] Archiving <https://builds.apache.org/job/maven-plugin-tools-m2/ws/maven-plugin-tools-ant/pom.xml>
to /home/hudson/hudson/jobs/maven-plugin-tools-m2/modules/org.apache.maven.plugin-tools$maven-plugin-tools-ant/builds/2012-05-14_22-02-59/archive/org.apache.maven.plugin-tools/maven-plugin-tools-ant/3.0-SNAPSHOT/maven-plugin-tools-ant-3.0-SNAPSHOT.pom
[JENKINS] Archiving <https://builds.apache.org/job/maven-plugin-tools-m2/ws/maven-plugin-tools-ant/target/maven-plugin-tools-ant-3.0-SNAPSHOT.jar>
to /home/hudson/hudson/jobs/maven-plugin-tools-m2/modules/org.apache.maven.plugin-tools$maven-plugin-tools-ant/builds/2012-05-14_22-02-59/archive/org.apache.maven.plugin-tools/maven-plugin-tools-ant/3.0-SNAPSHOT/maven-plugin-tools-ant-3.0-SNAPSHOT.jar
[INFO] 
[INFO] 
[INFO] ------------------------------------------------------------------------
[INFO] Reactor Summary:
[INFO] ------------------------------------------------------------------------
[INFO] Maven Plugin Tools .................................... SUCCESS [16.802s]
[INFO] Maven Plugin Tools APIs ............................... SUCCESS [17.880s]
[INFO] Maven Plugin Tools Generators ......................... SUCCESS [4.025s]
[INFO] Maven Plugin Tool for Java with Javadoc Tags .......... SUCCESS [3.200s]
[INFO] Maven Plugin Tool for Beanshell ....................... SUCCESS [0.968s]
[INFO] Maven Plugin Java 5 Annotations ....................... SUCCESS [0.846s]
[INFO] Maven Plugin Tool for Annotations ..................... SUCCESS [4.228s]
[INFO] Maven Plugin Plugin ................................... FAILED [2:57.613s]
[INFO] Maven Plugin Tools Javadoc ............................ SUCCESS [8.829s]
[INFO] Maven Plugin Metadata Model ........................... SUCCESS [2.597s]
[INFO] Maven Plugin Tool for Ant ............................. SUCCESS [7.824s]
[INFO] ------------------------------------------------------------------------
[INFO] Error for project: Maven Plugin Plugin (during install)
[INFO] ------------------------------------------------------------------------
[INFO] : org.apache.maven.plugin.invoker.InvokerSession@1055437
1 build failed.
[INFO] ------------------------------------------------------------------------
[INFO] Trace
org.apache.maven.BuildFailureException: 1 build failed.
	at org.apache.maven.lifecycle.DefaultLifecycleExecutor.executeGoals(DefaultLifecycleExecutor.java:715)
	at org.apache.maven.lifecycle.DefaultLifecycleExecutor.executeGoalWithLifecycle(DefaultLifecycleExecutor.java:556)
	at org.apache.maven.lifecycle.DefaultLifecycleExecutor.executeGoal(DefaultLifecycleExecutor.java:535)
	at org.apache.maven.lifecycle.DefaultLifecycleExecutor.executeGoalAndHandleFailures(DefaultLifecycleExecutor.java:387)
	at org.apache.maven.lifecycle.DefaultLifecycleExecutor.executeTaskSegments(DefaultLifecycleExecutor.java:348)
	at org.apache.maven.lifecycle.DefaultLifecycleExecutor.execute(DefaultLifecycleExecutor.java:180)
	at org.apache.maven.lifecycle.LifecycleExecutorInterceptor.execute(LifecycleExecutorInterceptor.java:65)
	at org.apache.maven.DefaultMaven.doExecute(DefaultMaven.java:328)
	at org.apache.maven.DefaultMaven.execute(DefaultMaven.java:138)
	at org.apache.maven.cli.MavenCli.main(MavenCli.java:362)
	at sun.reflect.NativeMethodAccessorImpl.invoke0(Native Method)
	at sun.reflect.NativeMethodAccessorImpl.invoke(NativeMethodAccessorImpl.java:39)
	at sun.reflect.DelegatingMethodAccessorImpl.invoke(DelegatingMethodAccessorImpl.java:25)
	at java.lang.reflect.Method.invoke(Method.java:592)
	at org.codehaus.classworlds.Launcher.launchEnhanced(Launcher.java:315)
	at org.codehaus.classworlds.Launcher.launch(Launcher.java:255)
	at hudson.maven.agent.Main.launch(Main.java:185)
	at hudson.maven.MavenBuilder.call(MavenBuilder.java:151)
	at hudson.maven.Maven2Builder.call(Maven2Builder.java:77)
	at hudson.maven.Maven2Builder.call(Maven2Builder.java:53)
	at hudson.remoting.UserRequest.perform(UserRequest.java:118)
	at hudson.remoting.UserRequest.perform(UserRequest.java:48)
	at hudson.remoting.Request$2.run(Request.java:287)
	at hudson.remoting.InterceptingExecutorService$1.call(InterceptingExecutorService.java:72)
	at java.util.concurrent.FutureTask$Sync.innerRun(FutureTask.java:269)
	at java.util.concurrent.FutureTask.run(FutureTask.java:123)
	at java.util.concurrent.ThreadPoolExecutor$Worker.runTask(ThreadPoolExecutor.java:651)
	at java.util.concurrent.ThreadPoolExecutor$Worker.run(ThreadPoolExecutor.java:676)
	at java.lang.Thread.run(Thread.java:595)
Caused by: org.apache.maven.plugin.MojoFailureException: 1 build failed.
	at org.apache.maven.plugin.invoker.InvokerSession.handleFailures(InvokerSession.java:263)
	at org.apache.maven.plugin.invoker.VerifyMojo.execute(VerifyMojo.java:124)
	at org.apache.maven.plugin.DefaultPluginManager.executeMojo(DefaultPluginManager.java:490)
	at hudson.maven.agent.PluginManagerInterceptor.executeMojo(PluginManagerInterceptor.java:182)
	at org.apache.maven.lifecycle.DefaultLifecycleExecutor.executeGoals(DefaultLifecycleExecutor.java:694)
	... 28 more
[INFO] ------------------------------------------------------------------------
[INFO] BUILD ERRORS
[INFO] ------------------------------------------------------------------------
[INFO] Total time: 5 minutes 15 seconds
[INFO] Finished at: Mon May 14 22:09:13 UTC 2012
[INFO] Final Memory: 78M/208M
[INFO] ------------------------------------------------------------------------
channel stopped

Mime
View raw message