maven-notifications mailing list archives

Site index · List index
Message view « Date » · « Thread »
Top « Date » · « Thread »
From Apache Jenkins Server <jenk...@builds.apache.org>
Subject Build failed in Jenkins: maven-plugin-tools-m2 #5
Date Sat, 12 May 2012 18:06:52 GMT
See <https://builds.apache.org/job/maven-plugin-tools-m2/5/changes>

Changes:

[hboutemy] enum introduction fix

[hboutemy] enum introduction fix

[hboutemy] first pass at IT fix since enums introduction

[hboutemy] added InstanciationStrategy enumeration

[hboutemy] added DependencyScope enumeration

------------------------------------------
[...truncated 573 lines...]
[INFO] META-INF/LICENSE already added, skipping
[INFO] META-INF/DEPENDENCIES already added, skipping
[INFO] META-INF/NOTICE already added, skipping
[INFO] [install:install {execution: default-install}]
[INFO] Installing <https://builds.apache.org/job/maven-plugin-tools-m2/ws/maven-plugin-tools-annotations/target/maven-plugin-tools-annotations-3.0-SNAPSHOT.jar>
to /home/hudson/hudson-slave/maven-repositories/1/org/apache/maven/plugin-tools/maven-plugin-tools-annotations/3.0-SNAPSHOT/maven-plugin-tools-annotations-3.0-SNAPSHOT.jar
[INFO] Installing <https://builds.apache.org/job/maven-plugin-tools-m2/ws/maven-plugin-tools-annotations/target/maven-plugin-tools-annotations-3.0-SNAPSHOT-tests.jar>
to /home/hudson/hudson-slave/maven-repositories/1/org/apache/maven/plugin-tools/maven-plugin-tools-annotations/3.0-SNAPSHOT/maven-plugin-tools-annotations-3.0-SNAPSHOT-tests.jar
[INFO] Installing <https://builds.apache.org/job/maven-plugin-tools-m2/ws/maven-plugin-tools-annotations/target/maven-plugin-tools-annotations-3.0-SNAPSHOT-test-sources.jar>
to /home/hudson/hudson-slave/maven-repositories/1/org/apache/maven/plugin-tools/maven-plugin-tools-annotations/3.0-SNAPSHOT/maven-plugin-tools-annotations-3.0-SNAPSHOT-test-sources.jar
[JENKINS] Archiving <https://builds.apache.org/job/maven-plugin-tools-m2/ws/maven-plugin-tools-annotations/pom.xml>
to /home/hudson/hudson/jobs/maven-plugin-tools-m2/modules/org.apache.maven.plugin-tools$maven-plugin-tools-annotations/builds/2012-05-12_18-02-19/archive/org.apache.maven.plugin-tools/maven-plugin-tools-annotations/3.0-SNAPSHOT/maven-plugin-tools-annotations-3.0-SNAPSHOT.pom
[JENKINS] Archiving <https://builds.apache.org/job/maven-plugin-tools-m2/ws/maven-plugin-tools-annotations/target/maven-plugin-tools-annotations-3.0-SNAPSHOT.jar>
to /home/hudson/hudson/jobs/maven-plugin-tools-m2/modules/org.apache.maven.plugin-tools$maven-plugin-tools-annotations/builds/2012-05-12_18-02-19/archive/org.apache.maven.plugin-tools/maven-plugin-tools-annotations/3.0-SNAPSHOT/maven-plugin-tools-annotations-3.0-SNAPSHOT.jar
[JENKINS] Archiving <https://builds.apache.org/job/maven-plugin-tools-m2/ws/maven-plugin-tools-annotations/target/maven-plugin-tools-annotations-3.0-SNAPSHOT-tests.jar>
to /home/hudson/hudson/jobs/maven-plugin-tools-m2/modules/org.apache.maven.plugin-tools$maven-plugin-tools-annotations/builds/2012-05-12_18-02-19/archive/org.apache.maven.plugin-tools/maven-plugin-tools-annotations/3.0-SNAPSHOT/maven-plugin-tools-annotations-3.0-SNAPSHOT-tests.jar
[JENKINS] Archiving <https://builds.apache.org/job/maven-plugin-tools-m2/ws/maven-plugin-tools-annotations/target/maven-plugin-tools-annotations-3.0-SNAPSHOT-test-sources.jar>
to /home/hudson/hudson/jobs/maven-plugin-tools-m2/modules/org.apache.maven.plugin-tools$maven-plugin-tools-annotations/builds/2012-05-12_18-02-19/archive/org.apache.maven.plugin-tools/maven-plugin-tools-annotations/3.0-SNAPSHOT/maven-plugin-tools-annotations-3.0-SNAPSHOT-test-sources.jar
[INFO] ------------------------------------------------------------------------
[INFO] Building Maven Plugin Plugin
[INFO]    task-segment: [clean, install]
[INFO] ------------------------------------------------------------------------
[INFO] snapshot org.apache.maven.plugins:maven-invoker-plugin:1.6-SNAPSHOT: checking for updates
from apache.snapshots
Downloading: http://repository.apache.org/snapshots/org/apache/maven/plugins/maven-invoker-plugin/1.6-SNAPSHOT/maven-invoker-plugin-1.6-20120511.172220-321.pom

[INFO] [clean:clean {execution: default-clean}]
[INFO] [enforcer:enforce {execution: ensure-no-container-api}]
[INFO] [plugin:helpmojo {execution: generated-helpmojo}]
[INFO] Using 'UTF-8' encoding to read mojo metadata.
[INFO] Applying mojo extractor for language: java
[INFO] Mojo extractor for language: java found 6 mojo descriptors.
[INFO] Applying mojo extractor for language: bsh
[INFO] Mojo extractor for language: bsh found 0 mojo descriptors.
[INFO] [modello:java {execution: default}]
[INFO] outputDirectory: <https://builds.apache.org/job/maven-plugin-tools-m2/ws/maven-plugin-plugin/target/generated-sources/modello>
[INFO] Working on model: src/main/mdo/pluginRequirements.mdo
[INFO] Generating current version: 1.0.0
[INFO] [plugin:descriptor {execution: default-descriptor}]
[INFO] Using 'UTF-8' encoding to read mojo metadata.
[INFO] Applying mojo extractor for language: java
[INFO] Mojo extractor for language: java found 7 mojo descriptors.
[INFO] Applying mojo extractor for language: bsh
[INFO] Mojo extractor for language: bsh found 0 mojo descriptors.
[INFO] [remote-resources:process {execution: default}]
[debug] execute contextualize
[INFO] [resources:resources {execution: default-resources}]
[INFO] Using 'UTF-8' encoding to copy filtered resources.
[INFO] Copying 5 resources
[INFO] Copying 3 resources
[INFO] [compiler:compile {execution: default-compile}]
[INFO] Compiling 9 source files to <https://builds.apache.org/job/maven-plugin-tools-m2/ws/maven-plugin-plugin/target/classes>
[debug] execute contextualize
[INFO] [resources:testResources {execution: default-testResources}]
[INFO] Using 'UTF-8' encoding to copy filtered resources.
[INFO] skip non existing resourceDirectory <https://builds.apache.org/job/maven-plugin-tools-m2/ws/maven-plugin-plugin/src/test/resources>
[INFO] Copying 3 resources
[INFO] [compiler:testCompile {execution: default-testCompile}]
[INFO] No sources to compile
[INFO] [surefire:test {execution: default-test}]
[INFO] Surefire report directory: <https://builds.apache.org/job/maven-plugin-tools-m2/ws/maven-plugin-plugin/target/surefire-reports>

-------------------------------------------------------
 T E S T S
-------------------------------------------------------

Results :

Tests run: 0, Failures: 0, Errors: 0, Skipped: 0

[JENKINS] Recording test results
[INFO] [jar:jar {execution: default-jar}]
[INFO] Building jar: <https://builds.apache.org/job/maven-plugin-tools-m2/ws/maven-plugin-plugin/target/maven-plugin-plugin-3.0-SNAPSHOT.jar>
[INFO] [plugin:addPluginArtifactMetadata {execution: default-addPluginArtifactMetadata}]
[INFO] [invoker:install {execution: integration-test}]
[INFO] Installing <https://builds.apache.org/job/maven-plugin-tools-m2/ws/maven-plugin-tools-api/pom.xml>
to <https://builds.apache.org/job/maven-plugin-tools-m2/ws/maven-plugin-plugin/target/local-repo/org/apache/maven/plugin-tools/maven-plugin-tools-api/3.0-SNAPSHOT/maven-plugin-tools-api-3.0-SNAPSHOT.pom>
[INFO] Installing <https://builds.apache.org/job/maven-plugin-tools-m2/ws/maven-plugin-tools-api/target/maven-plugin-tools-api-3.0-SNAPSHOT.jar>
to <https://builds.apache.org/job/maven-plugin-tools-m2/ws/maven-plugin-plugin/target/local-repo/org/apache/maven/plugin-tools/maven-plugin-tools-api/3.0-SNAPSHOT/maven-plugin-tools-api-3.0-SNAPSHOT.jar>
[INFO] Installing <https://builds.apache.org/job/maven-plugin-tools-m2/ws/pom.xml> to
<https://builds.apache.org/job/maven-plugin-tools-m2/ws/maven-plugin-plugin/target/local-repo/org/apache/maven/plugin-tools/maven-plugin-tools/3.0-SNAPSHOT/maven-plugin-tools-3.0-SNAPSHOT.pom>
[INFO] Installing <https://builds.apache.org/job/maven-plugin-tools-m2/ws/maven-plugin-tools-java/pom.xml>
to <https://builds.apache.org/job/maven-plugin-tools-m2/ws/maven-plugin-plugin/target/local-repo/org/apache/maven/plugin-tools/maven-plugin-tools-java/3.0-SNAPSHOT/maven-plugin-tools-java-3.0-SNAPSHOT.pom>
[INFO] Installing <https://builds.apache.org/job/maven-plugin-tools-m2/ws/maven-plugin-tools-java/target/maven-plugin-tools-java-3.0-SNAPSHOT.jar>
to <https://builds.apache.org/job/maven-plugin-tools-m2/ws/maven-plugin-plugin/target/local-repo/org/apache/maven/plugin-tools/maven-plugin-tools-java/3.0-SNAPSHOT/maven-plugin-tools-java-3.0-SNAPSHOT.jar>
[INFO] Installing <https://builds.apache.org/job/maven-plugin-tools-m2/ws/maven-plugin-tools-beanshell/pom.xml>
to <https://builds.apache.org/job/maven-plugin-tools-m2/ws/maven-plugin-plugin/target/local-repo/org/apache/maven/plugin-tools/maven-plugin-tools-beanshell/3.0-SNAPSHOT/maven-plugin-tools-beanshell-3.0-SNAPSHOT.pom>
[INFO] Installing <https://builds.apache.org/job/maven-plugin-tools-m2/ws/maven-plugin-tools-beanshell/target/maven-plugin-tools-beanshell-3.0-SNAPSHOT.jar>
to <https://builds.apache.org/job/maven-plugin-tools-m2/ws/maven-plugin-plugin/target/local-repo/org/apache/maven/plugin-tools/maven-plugin-tools-beanshell/3.0-SNAPSHOT/maven-plugin-tools-beanshell-3.0-SNAPSHOT.jar>
[INFO] Installing <https://builds.apache.org/job/maven-plugin-tools-m2/ws/maven-plugin-tools-annotations/pom.xml>
to <https://builds.apache.org/job/maven-plugin-tools-m2/ws/maven-plugin-plugin/target/local-repo/org/apache/maven/plugin-tools/maven-plugin-tools-annotations/3.0-SNAPSHOT/maven-plugin-tools-annotations-3.0-SNAPSHOT.pom>
[INFO] Installing <https://builds.apache.org/job/maven-plugin-tools-m2/ws/maven-plugin-tools-annotations/target/maven-plugin-tools-annotations-3.0-SNAPSHOT.jar>
to <https://builds.apache.org/job/maven-plugin-tools-m2/ws/maven-plugin-plugin/target/local-repo/org/apache/maven/plugin-tools/maven-plugin-tools-annotations/3.0-SNAPSHOT/maven-plugin-tools-annotations-3.0-SNAPSHOT.jar>
[INFO] Installing <https://builds.apache.org/job/maven-plugin-tools-m2/ws/maven-plugin-tools-annotations/target/maven-plugin-tools-annotations-3.0-SNAPSHOT-tests.jar>
to <https://builds.apache.org/job/maven-plugin-tools-m2/ws/maven-plugin-plugin/target/local-repo/org/apache/maven/plugin-tools/maven-plugin-tools-annotations/3.0-SNAPSHOT/maven-plugin-tools-annotations-3.0-SNAPSHOT-tests.jar>
[INFO] Installing <https://builds.apache.org/job/maven-plugin-tools-m2/ws/maven-plugin-tools-annotations/target/maven-plugin-tools-annotations-3.0-SNAPSHOT-test-sources.jar>
to <https://builds.apache.org/job/maven-plugin-tools-m2/ws/maven-plugin-plugin/target/local-repo/org/apache/maven/plugin-tools/maven-plugin-tools-annotations/3.0-SNAPSHOT/maven-plugin-tools-annotations-3.0-SNAPSHOT-test-sources.jar>
[INFO] Installing <https://builds.apache.org/job/maven-plugin-tools-m2/ws/maven-plugin-annotations/pom.xml>
to <https://builds.apache.org/job/maven-plugin-tools-m2/ws/maven-plugin-plugin/target/local-repo/org/apache/maven/plugin-tools/maven-plugin-annotations/3.0-SNAPSHOT/maven-plugin-annotations-3.0-SNAPSHOT.pom>
[INFO] Installing <https://builds.apache.org/job/maven-plugin-tools-m2/ws/maven-plugin-annotations/target/maven-plugin-annotations-3.0-SNAPSHOT.jar>
to <https://builds.apache.org/job/maven-plugin-tools-m2/ws/maven-plugin-plugin/target/local-repo/org/apache/maven/plugin-tools/maven-plugin-annotations/3.0-SNAPSHOT/maven-plugin-annotations-3.0-SNAPSHOT.jar>
[INFO] Installing <https://builds.apache.org/job/maven-plugin-tools-m2/ws/maven-plugin-plugin/pom.xml>
to <https://builds.apache.org/job/maven-plugin-tools-m2/ws/maven-plugin-plugin/target/local-repo/org/apache/maven/plugins/maven-plugin-plugin/3.0-SNAPSHOT/maven-plugin-plugin-3.0-SNAPSHOT.pom>
[INFO] Installing <https://builds.apache.org/job/maven-plugin-tools-m2/ws/maven-plugin-plugin/target/maven-plugin-plugin-3.0-SNAPSHOT.jar>
to <https://builds.apache.org/job/maven-plugin-tools-m2/ws/maven-plugin-plugin/target/local-repo/org/apache/maven/plugins/maven-plugin-plugin/3.0-SNAPSHOT/maven-plugin-plugin-3.0-SNAPSHOT.jar>
[INFO] [invoker:integration-test {execution: integration-test}]
[INFO] Building: skip/pom.xml
[INFO] run script <https://builds.apache.org/job/maven-plugin-tools-m2/ws/maven-plugin-plugin/target/it/skip/verify.groovy>
[INFO] ..SUCCESS (8.4 s)
[INFO] Building: plugin-report/pom.xml
[INFO] ..FAILED (36.4 s)
[INFO]   The build exited with code 1. See <https://builds.apache.org/job/maven-plugin-tools-m2/ws/maven-plugin-plugin/target/it/plugin-report/build.log>
for details.
[INFO] Building: java-basic/pom.xml
[INFO] run script <https://builds.apache.org/job/maven-plugin-tools-m2/ws/maven-plugin-plugin/target/it/java-basic/verify.groovy>
[INFO] ..SUCCESS (5.9 s)
[INFO] Building: plugin-info-jdk-default-version/pom.xml
[INFO] ..FAILED (17.0 s)
[INFO]   The build exited with code 1. See <https://builds.apache.org/job/maven-plugin-tools-m2/ws/maven-plugin-plugin/target/it/plugin-info-jdk-default-version/build.log>
for details.
[INFO] Building: annotation-with-inheritance-reactor/pom.xml
[INFO] run script <https://builds.apache.org/job/maven-plugin-tools-m2/ws/maven-plugin-plugin/target/it/annotation-with-inheritance-reactor/verify.groovy>
[INFO] ..SUCCESS (14.2 s)
[INFO] Building: help-package/pom.xml
[INFO] run script <https://builds.apache.org/job/maven-plugin-tools-m2/ws/maven-plugin-plugin/target/it/help-package/verify.bsh>
[INFO] ..SUCCESS (5.6 s)
[INFO] Building: mplugin-187/pom.xml
[INFO] ..SUCCESS (3.4 s)
[INFO] Building: source-encoding/pom.xml
[INFO] run script <https://builds.apache.org/job/maven-plugin-tools-m2/ws/maven-plugin-plugin/target/it/source-encoding/verify.groovy>
[INFO] ..SUCCESS (5.3 s)
[INFO] Building: help-basic/pom.xml
[INFO] ..SUCCESS (5.8 s)
[INFO] Building: ignore-plugin-class-realm/pom.xml
[INFO] ..SUCCESS (8.8 s)
[INFO] Building: java-basic-annotations/pom.xml
[INFO] run script <https://builds.apache.org/job/maven-plugin-tools-m2/ws/maven-plugin-plugin/target/it/java-basic-annotations/verify.groovy>
[INFO] ..SUCCESS (7.5 s)
[INFO] Building: annotation-with-inheritance-from-deps/pom.xml
[INFO] run script <https://builds.apache.org/job/maven-plugin-tools-m2/ws/maven-plugin-plugin/target/it/annotation-with-inheritance-from-deps/verify.groovy>
[INFO] ..SUCCESS (15.8 s)
[INFO] Building: annotation-with-inheritance/pom.xml
[INFO] run script <https://builds.apache.org/job/maven-plugin-tools-m2/ws/maven-plugin-plugin/target/it/annotation-with-inheritance/verify.groovy>
[INFO] ..SUCCESS (13.3 s)
[INFO] [invoker:verify {execution: integration-test}]
[INFO] -------------------------------------------------
[INFO] Build Summary:
[INFO]   Passed: 11, Failed: 2, Errors: 0, Skipped: 0
[INFO] -------------------------------------------------
[ERROR] The following builds failed:
[ERROR] *  plugin-report/pom.xml
[ERROR] *  plugin-info-jdk-default-version/pom.xml
[INFO] -------------------------------------------------
[JENKINS] Archiving <https://builds.apache.org/job/maven-plugin-tools-m2/ws/maven-plugin-plugin/pom.xml>
to /home/hudson/hudson/jobs/maven-plugin-tools-m2/modules/org.apache.maven.plugins$maven-plugin-plugin/builds/2012-05-12_18-02-19/archive/org.apache.maven.plugins/maven-plugin-plugin/3.0-SNAPSHOT/maven-plugin-plugin-3.0-SNAPSHOT.pom
[JENKINS] Archiving <https://builds.apache.org/job/maven-plugin-tools-m2/ws/maven-plugin-plugin/target/maven-plugin-plugin-3.0-SNAPSHOT.jar>
to /home/hudson/hudson/jobs/maven-plugin-tools-m2/modules/org.apache.maven.plugins$maven-plugin-plugin/builds/2012-05-12_18-02-19/archive/org.apache.maven.plugins/maven-plugin-plugin/3.0-SNAPSHOT/maven-plugin-plugin-3.0-SNAPSHOT.jar
[INFO] ------------------------------------------------------------------------
[INFO] Building Maven Plugin Tools Javadoc
[INFO]    task-segment: [clean, install]
[INFO] ------------------------------------------------------------------------
[INFO] [clean:clean {execution: default-clean}]
[INFO] [remote-resources:process {execution: default}]
[debug] execute contextualize
[INFO] [resources:resources {execution: default-resources}]
[INFO] Using 'UTF-8' encoding to copy filtered resources.
[INFO] skip non existing resourceDirectory <https://builds.apache.org/job/maven-plugin-tools-m2/ws/maven-plugin-tools-javadoc/src/main/resources>
[INFO] Copying 3 resources
[INFO] [compiler:compile {execution: default-compile}]
[INFO] Compiling 22 source files to <https://builds.apache.org/job/maven-plugin-tools-m2/ws/maven-plugin-tools-javadoc/target/classes>
[debug] execute contextualize
[INFO] [resources:testResources {execution: default-testResources}]
[INFO] Using 'UTF-8' encoding to copy filtered resources.
[INFO] skip non existing resourceDirectory <https://builds.apache.org/job/maven-plugin-tools-m2/ws/maven-plugin-tools-javadoc/src/test/resources>
[INFO] Copying 3 resources
[INFO] [compiler:testCompile {execution: default-testCompile}]
[INFO] No sources to compile
[INFO] [surefire:test {execution: default-test}]
[INFO] Surefire report directory: <https://builds.apache.org/job/maven-plugin-tools-m2/ws/maven-plugin-tools-javadoc/target/surefire-reports>

-------------------------------------------------------
 T E S T S
-------------------------------------------------------

Results :

Tests run: 0, Failures: 0, Errors: 0, Skipped: 0

[JENKINS] Recording test results
[INFO] [jar:jar {execution: default-jar}]
[INFO] Building jar: <https://builds.apache.org/job/maven-plugin-tools-m2/ws/maven-plugin-tools-javadoc/target/maven-plugin-tools-javadoc-3.0-SNAPSHOT.jar>
[INFO] [invoker:install {execution: integration-test}]
[INFO] Installing <https://builds.apache.org/job/maven-plugin-tools-m2/ws/maven-plugin-tools-java/pom.xml>
to <https://builds.apache.org/job/maven-plugin-tools-m2/ws/maven-plugin-tools-javadoc/target/local-repo/org/apache/maven/plugin-tools/maven-plugin-tools-java/3.0-SNAPSHOT/maven-plugin-tools-java-3.0-SNAPSHOT.pom>
[INFO] Installing <https://builds.apache.org/job/maven-plugin-tools-m2/ws/maven-plugin-tools-java/target/maven-plugin-tools-java-3.0-SNAPSHOT.jar>
to <https://builds.apache.org/job/maven-plugin-tools-m2/ws/maven-plugin-tools-javadoc/target/local-repo/org/apache/maven/plugin-tools/maven-plugin-tools-java/3.0-SNAPSHOT/maven-plugin-tools-java-3.0-SNAPSHOT.jar>
[INFO] Installing <https://builds.apache.org/job/maven-plugin-tools-m2/ws/pom.xml> to
<https://builds.apache.org/job/maven-plugin-tools-m2/ws/maven-plugin-tools-javadoc/target/local-repo/org/apache/maven/plugin-tools/maven-plugin-tools/3.0-SNAPSHOT/maven-plugin-tools-3.0-SNAPSHOT.pom>
[INFO] Installing <https://builds.apache.org/job/maven-plugin-tools-m2/ws/maven-plugin-tools-api/pom.xml>
to <https://builds.apache.org/job/maven-plugin-tools-m2/ws/maven-plugin-tools-javadoc/target/local-repo/org/apache/maven/plugin-tools/maven-plugin-tools-api/3.0-SNAPSHOT/maven-plugin-tools-api-3.0-SNAPSHOT.pom>
[INFO] Installing <https://builds.apache.org/job/maven-plugin-tools-m2/ws/maven-plugin-tools-api/target/maven-plugin-tools-api-3.0-SNAPSHOT.jar>
to <https://builds.apache.org/job/maven-plugin-tools-m2/ws/maven-plugin-tools-javadoc/target/local-repo/org/apache/maven/plugin-tools/maven-plugin-tools-api/3.0-SNAPSHOT/maven-plugin-tools-api-3.0-SNAPSHOT.jar>
[INFO] Installing <https://builds.apache.org/job/maven-plugin-tools-m2/ws/maven-plugin-tools-javadoc/pom.xml>
to <https://builds.apache.org/job/maven-plugin-tools-m2/ws/maven-plugin-tools-javadoc/target/local-repo/org/apache/maven/plugin-tools/maven-plugin-tools-javadoc/3.0-SNAPSHOT/maven-plugin-tools-javadoc-3.0-SNAPSHOT.pom>
[INFO] Installing <https://builds.apache.org/job/maven-plugin-tools-m2/ws/maven-plugin-tools-javadoc/target/maven-plugin-tools-javadoc-3.0-SNAPSHOT.jar>
to <https://builds.apache.org/job/maven-plugin-tools-m2/ws/maven-plugin-tools-javadoc/target/local-repo/org/apache/maven/plugin-tools/maven-plugin-tools-javadoc/3.0-SNAPSHOT/maven-plugin-tools-javadoc-3.0-SNAPSHOT.jar>
[INFO] [invoker:run {execution: integration-test}]
[INFO] Building: basic/pom.xml
[INFO] ..SUCCESS (6.5 s)
[INFO] -------------------------------------------------
[INFO] Build Summary:
[INFO]   Passed: 1, Failed: 0, Errors: 0, Skipped: 0
[INFO] -------------------------------------------------
[INFO] [install:install {execution: default-install}]
[INFO] Installing <https://builds.apache.org/job/maven-plugin-tools-m2/ws/maven-plugin-tools-javadoc/target/maven-plugin-tools-javadoc-3.0-SNAPSHOT.jar>
to /home/hudson/hudson-slave/maven-repositories/1/org/apache/maven/plugin-tools/maven-plugin-tools-javadoc/3.0-SNAPSHOT/maven-plugin-tools-javadoc-3.0-SNAPSHOT.jar
[JENKINS] Archiving <https://builds.apache.org/job/maven-plugin-tools-m2/ws/maven-plugin-tools-javadoc/pom.xml>
to /home/hudson/hudson/jobs/maven-plugin-tools-m2/modules/org.apache.maven.plugin-tools$maven-plugin-tools-javadoc/builds/2012-05-12_18-02-19/archive/org.apache.maven.plugin-tools/maven-plugin-tools-javadoc/3.0-SNAPSHOT/maven-plugin-tools-javadoc-3.0-SNAPSHOT.pom
[JENKINS] Archiving <https://builds.apache.org/job/maven-plugin-tools-m2/ws/maven-plugin-tools-javadoc/target/maven-plugin-tools-javadoc-3.0-SNAPSHOT.jar>
to /home/hudson/hudson/jobs/maven-plugin-tools-m2/modules/org.apache.maven.plugin-tools$maven-plugin-tools-javadoc/builds/2012-05-12_18-02-19/archive/org.apache.maven.plugin-tools/maven-plugin-tools-javadoc/3.0-SNAPSHOT/maven-plugin-tools-javadoc-3.0-SNAPSHOT.jar
[INFO] 
[INFO] 
[INFO] ------------------------------------------------------------------------
[INFO] Reactor Summary:
[INFO] ------------------------------------------------------------------------
[INFO] Maven Plugin Tools .................................... SUCCESS [12.570s]
[INFO] Maven Plugin Tools APIs ............................... SUCCESS [23.282s]
[INFO] Maven Plugin Metadata Model ........................... SUCCESS [4.083s]
[INFO] Maven Plugin Tool for Ant ............................. SUCCESS [3.217s]
[INFO] Maven Plugin Tool for Java with Javadoc Tags .......... SUCCESS [4.029s]
[INFO] Maven Plugin Tool for Beanshell ....................... SUCCESS [2.022s]
[INFO] Maven Plugin Java 5 Annotations ....................... SUCCESS [1.022s]
[INFO] Maven Plugin Tool for Annotations ..................... SUCCESS [3.980s]
[INFO] Maven Plugin Plugin ................................... FAILED [2:37.267s]
[INFO] Maven Plugin Tools Javadoc ............................ SUCCESS [11.532s]
[INFO] ------------------------------------------------------------------------
[INFO] Error for project: Maven Plugin Plugin (during install)
[INFO] ------------------------------------------------------------------------
[INFO] 2 builds failed. See console output above for details.
[INFO] ------------------------------------------------------------------------
[INFO] Trace
org.apache.maven.BuildFailureException: 2 builds failed. See console output above for details.
	at org.apache.maven.lifecycle.DefaultLifecycleExecutor.executeGoals(DefaultLifecycleExecutor.java:715)
	at org.apache.maven.lifecycle.DefaultLifecycleExecutor.executeGoalWithLifecycle(DefaultLifecycleExecutor.java:556)
	at org.apache.maven.lifecycle.DefaultLifecycleExecutor.executeGoal(DefaultLifecycleExecutor.java:535)
	at org.apache.maven.lifecycle.DefaultLifecycleExecutor.executeGoalAndHandleFailures(DefaultLifecycleExecutor.java:387)
	at org.apache.maven.lifecycle.DefaultLifecycleExecutor.executeTaskSegments(DefaultLifecycleExecutor.java:348)
	at org.apache.maven.lifecycle.DefaultLifecycleExecutor.execute(DefaultLifecycleExecutor.java:180)
	at org.apache.maven.lifecycle.LifecycleExecutorInterceptor.execute(LifecycleExecutorInterceptor.java:65)
	at org.apache.maven.DefaultMaven.doExecute(DefaultMaven.java:328)
	at org.apache.maven.DefaultMaven.execute(DefaultMaven.java:138)
	at org.apache.maven.cli.MavenCli.main(MavenCli.java:362)
	at sun.reflect.NativeMethodAccessorImpl.invoke0(Native Method)
	at sun.reflect.NativeMethodAccessorImpl.invoke(NativeMethodAccessorImpl.java:39)
	at sun.reflect.DelegatingMethodAccessorImpl.invoke(DelegatingMethodAccessorImpl.java:25)
	at java.lang.reflect.Method.invoke(Method.java:592)
	at org.codehaus.classworlds.Launcher.launchEnhanced(Launcher.java:315)
	at org.codehaus.classworlds.Launcher.launch(Launcher.java:255)
	at hudson.maven.agent.Main.launch(Main.java:185)
	at hudson.maven.MavenBuilder.call(MavenBuilder.java:151)
	at hudson.maven.Maven2Builder.call(Maven2Builder.java:77)
	at hudson.maven.Maven2Builder.call(Maven2Builder.java:53)
	at hudson.remoting.UserRequest.perform(UserRequest.java:118)
	at hudson.remoting.UserRequest.perform(UserRequest.java:48)
	at hudson.remoting.Request$2.run(Request.java:287)
	at hudson.remoting.InterceptingExecutorService$1.call(InterceptingExecutorService.java:72)
	at java.util.concurrent.FutureTask$Sync.innerRun(FutureTask.java:269)
	at java.util.concurrent.FutureTask.run(FutureTask.java:123)
	at java.util.concurrent.ThreadPoolExecutor$Worker.runTask(ThreadPoolExecutor.java:651)
	at java.util.concurrent.ThreadPoolExecutor$Worker.run(ThreadPoolExecutor.java:676)
	at java.lang.Thread.run(Thread.java:595)
Caused by: org.apache.maven.plugin.MojoFailureException: 2 builds failed. See console output
above for details.
	at org.apache.maven.plugin.invoker.InvokerSession.handleFailures(InvokerSession.java:258)
	at org.apache.maven.plugin.invoker.VerifyMojo.execute(VerifyMojo.java:125)
	at org.apache.maven.plugin.DefaultPluginManager.executeMojo(DefaultPluginManager.java:490)
	at hudson.maven.agent.PluginManagerInterceptor.executeMojo(PluginManagerInterceptor.java:182)
	at org.apache.maven.lifecycle.DefaultLifecycleExecutor.executeGoals(DefaultLifecycleExecutor.java:694)
	... 28 more
[INFO] ------------------------------------------------------------------------
[INFO] BUILD ERRORS
[INFO] ------------------------------------------------------------------------
[INFO] Total time: 4 minutes 
[INFO] Finished at: Sat May 12 18:06:50 UTC 2012
[INFO] Final Memory: 84M/199M
[INFO] ------------------------------------------------------------------------
channel stopped

Mime
View raw message