maven-notifications mailing list archives

Site index · List index
Message view « Date » · « Thread »
Top « Date » · « Thread »
From Apache Jenkins Server <jenk...@builds.apache.org>
Subject Build failed in Jenkins: maven-plugins-ITs-m3 #396
Date Thu, 05 Apr 2012 22:16:38 GMT
See <https://builds.apache.org/job/maven-plugins-ITs-m3/396/changes>

Changes:

[dennisl] [MSITE-636] Upgrade to doxia-1.3
[MSITE-637] Upgrade to doxia-sitetools-1.3

------------------------------------------
[...truncated 7090 lines...]
Running org.apache.maven.plugin.war.WarDependenciesAnalysisTest
Tests run: 4, Failures: 0, Errors: 0, Skipped: 0, Time elapsed: 0.327 sec
Running org.apache.maven.plugin.war.WarManifestMojoTest
Tests run: 6, Failures: 0, Errors: 0, Skipped: 0, Time elapsed: 0.228 sec
Running org.apache.maven.plugin.war.WarExplodedMojoTest
Tests run: 21, Failures: 0, Errors: 0, Skipped: 0, Time elapsed: 0.997 sec
Running org.apache.maven.plugin.war.WarInPlaceMojoTest
Tests run: 2, Failures: 0, Errors: 0, Skipped: 0, Time elapsed: 0.081 sec
Running org.apache.maven.plugin.war.WarOverlaysTest
Tests run: 11, Failures: 0, Errors: 0, Skipped: 0, Time elapsed: 6.039 sec
Running org.apache.maven.plugin.war.WarMojoTest
Tests run: 12, Failures: 0, Errors: 0, Skipped: 0, Time elapsed: 2.679 sec
Running org.apache.maven.plugin.war.overlay.OverlayManagerTest
Tests run: 5, Failures: 0, Errors: 0, Skipped: 0, Time elapsed: 0.193 sec
Downloading: http://repo.maven.apache.org/maven2/org/codehaus/modello/modello-maven-plugin/1.4/modello-maven-plugin-1.4.pom
Downloaded: http://repo.maven.apache.org/maven2/org/codehaus/modello/modello-maven-plugin/1.4/modello-maven-plugin-1.4.pom
(6 KB at 6.8 KB/sec)
Downloading: http://repo.maven.apache.org/maven2/org/codehaus/modello/modello/1.4/modello-1.4.pom
Downloaded: http://repo.maven.apache.org/maven2/org/codehaus/modello/modello/1.4/modello-1.4.pom
(24 KB at 23.9 KB/sec)
Downloading: http://repo.maven.apache.org/maven2/org/codehaus/modello/modello-maven-plugin/1.4/modello-maven-plugin-1.4.jar
Downloaded: http://repo.maven.apache.org/maven2/org/codehaus/modello/modello-maven-plugin/1.4/modello-maven-plugin-1.4.jar
(24 KB at 31.8 KB/sec)
Downloading: http://repo.maven.apache.org/maven2/org/apache/maven/shared/maven-script-interpreter/1.0/maven-script-interpreter-1.0.pom
Downloaded: http://repo.maven.apache.org/maven2/org/apache/maven/shared/maven-script-interpreter/1.0/maven-script-interpreter-1.0.pom
(4 KB at 7.8 KB/sec)
Downloading: http://repo.maven.apache.org/maven2/org/codehaus/groovy/groovy/1.8.3/groovy-1.8.3.pom
Downloaded: http://repo.maven.apache.org/maven2/org/codehaus/groovy/groovy/1.8.3/groovy-1.8.3.pom
(32 KB at 62.9 KB/sec)
Downloading: http://repo.maven.apache.org/maven2/org/apache/maven/doxia/doxia-sink-api/1.1.4/doxia-sink-api-1.1.4.pom
Downloaded: http://repo.maven.apache.org/maven2/org/apache/maven/doxia/doxia-sink-api/1.1.4/doxia-sink-api-1.1.4.pom
(2 KB at 3.1 KB/sec)
Downloading: http://repo.maven.apache.org/maven2/org/apache/maven/doxia/doxia/1.1.4/doxia-1.1.4.pom
Downloaded: http://repo.maven.apache.org/maven2/org/apache/maven/doxia/doxia/1.1.4/doxia-1.1.4.pom
(19 KB at 37.3 KB/sec)
Downloading: http://repo.maven.apache.org/maven2/org/apache/maven/doxia/doxia-logging-api/1.1.4/doxia-logging-api-1.1.4.pom
Downloaded: http://repo.maven.apache.org/maven2/org/apache/maven/doxia/doxia-logging-api/1.1.4/doxia-logging-api-1.1.4.pom
(2 KB at 3.1 KB/sec)
Downloading: http://repo.maven.apache.org/maven2/org/apache/maven/doxia/doxia-site-renderer/1.1.4/doxia-site-renderer-1.1.4.pom
Downloaded: http://repo.maven.apache.org/maven2/org/apache/maven/doxia/doxia-site-renderer/1.1.4/doxia-site-renderer-1.1.4.pom
(6 KB at 13.7 KB/sec)
Downloading: http://repo.maven.apache.org/maven2/org/apache/maven/doxia/doxia-sitetools/1.1.4/doxia-sitetools-1.1.4.pom
Downloaded: http://repo.maven.apache.org/maven2/org/apache/maven/doxia/doxia-sitetools/1.1.4/doxia-sitetools-1.1.4.pom
(16 KB at 29.2 KB/sec)
Downloading: http://repo.maven.apache.org/maven2/org/apache/maven/doxia/doxia-core/1.1.4/doxia-core-1.1.4.pom
Downloaded: http://repo.maven.apache.org/maven2/org/apache/maven/doxia/doxia-core/1.1.4/doxia-core-1.1.4.pom
(4 KB at 8.0 KB/sec)
Downloading: http://repo.maven.apache.org/maven2/org/apache/maven/doxia/doxia-decoration-model/1.1.4/doxia-decoration-model-1.1.4.pom
Downloaded: http://repo.maven.apache.org/maven2/org/apache/maven/doxia/doxia-decoration-model/1.1.4/doxia-decoration-model-1.1.4.pom
(3 KB at 5.9 KB/sec)
Downloading: http://repo.maven.apache.org/maven2/org/apache/maven/doxia/doxia-module-xhtml/1.1.4/doxia-module-xhtml-1.1.4.pom
Downloaded: http://repo.maven.apache.org/maven2/org/apache/maven/doxia/doxia-module-xhtml/1.1.4/doxia-module-xhtml-1.1.4.pom
(2 KB at 3.2 KB/sec)
Downloading: http://repo.maven.apache.org/maven2/org/apache/maven/doxia/doxia-modules/1.1.4/doxia-modules-1.1.4.pom
Downloaded: http://repo.maven.apache.org/maven2/org/apache/maven/doxia/doxia-modules/1.1.4/doxia-modules-1.1.4.pom
(3 KB at 4.8 KB/sec)
Downloading: http://repo.maven.apache.org/maven2/org/apache/maven/doxia/doxia-module-fml/1.1.4/doxia-module-fml-1.1.4.pom
Downloaded: http://repo.maven.apache.org/maven2/org/apache/maven/doxia/doxia-module-fml/1.1.4/doxia-module-fml-1.1.4.pom
(6 KB at 10.6 KB/sec)
Downloading: http://repo.maven.apache.org/maven2/org/codehaus/groovy/groovy/1.7.5/groovy-1.7.5.pom
Downloaded: http://repo.maven.apache.org/maven2/org/codehaus/groovy/groovy/1.7.5/groovy-1.7.5.pom
(29 KB at 59.5 KB/sec)
Downloading: http://repo.maven.apache.org/maven2/org/apache/maven/shared/maven-script-interpreter/1.0/maven-script-interpreter-1.0.jar
Downloading: http://repo.maven.apache.org/maven2/org/apache/maven/doxia/doxia-sink-api/1.1.4/doxia-sink-api-1.1.4.jar
Downloading: http://repo.maven.apache.org/maven2/org/apache/maven/doxia/doxia-logging-api/1.1.4/doxia-logging-api-1.1.4.jar
Downloading: http://repo.maven.apache.org/maven2/org/apache/maven/doxia/doxia-site-renderer/1.1.4/doxia-site-renderer-1.1.4.jar
Downloading: http://repo.maven.apache.org/maven2/org/apache/maven/doxia/doxia-decoration-model/1.1.4/doxia-decoration-model-1.1.4.jar
Downloaded: http://repo.maven.apache.org/maven2/org/apache/maven/shared/maven-script-interpreter/1.0/maven-script-interpreter-1.0.jar
(21 KB at 13.7 KB/sec)
Downloading: http://repo.maven.apache.org/maven2/org/apache/maven/doxia/doxia-module-xhtml/1.1.4/doxia-module-xhtml-1.1.4.jar
Downloaded: http://repo.maven.apache.org/maven2/org/apache/maven/doxia/doxia-sink-api/1.1.4/doxia-sink-api-1.1.4.jar
(13 KB at 7.2 KB/sec)
Downloading: http://repo.maven.apache.org/maven2/org/apache/maven/doxia/doxia-module-fml/1.1.4/doxia-module-fml-1.1.4.jar
Downloaded: http://repo.maven.apache.org/maven2/org/apache/maven/doxia/doxia-logging-api/1.1.4/doxia-logging-api-1.1.4.jar
(12 KB at 5.6 KB/sec)
Downloading: http://repo.maven.apache.org/maven2/org/codehaus/groovy/groovy/1.7.5/groovy-1.7.5.jar
Downloaded: http://repo.maven.apache.org/maven2/org/apache/maven/doxia/doxia-site-renderer/1.1.4/doxia-site-renderer-1.1.4.jar
(50 KB at 22.3 KB/sec)
Downloaded: http://repo.maven.apache.org/maven2/org/apache/maven/doxia/doxia-decoration-model/1.1.4/doxia-decoration-model-1.1.4.jar
(52 KB at 20.6 KB/sec)
Downloaded: http://repo.maven.apache.org/maven2/org/apache/maven/doxia/doxia-module-xhtml/1.1.4/doxia-module-xhtml-1.1.4.jar
(15 KB at 7.3 KB/sec)
Downloaded: http://repo.maven.apache.org/maven2/org/apache/maven/doxia/doxia-module-fml/1.1.4/doxia-module-fml-1.1.4.jar
(37 KB at 18.3 KB/sec)
Downloaded: http://repo.maven.apache.org/maven2/org/codehaus/groovy/groovy/1.7.5/groovy-1.7.5.jar
(4750 KB at 1856.7 KB/sec)
Downloading: http://repo.maven.apache.org/maven2/org/codehaus/modello/modello-core/1.4/modello-core-1.4.pom
Downloaded: http://repo.maven.apache.org/maven2/org/codehaus/modello/modello-core/1.4/modello-core-1.4.pom
(2 KB at 5.0 KB/sec)
Downloading: http://repo.maven.apache.org/maven2/org/codehaus/modello/modello-plugin-converters/1.4/modello-plugin-converters-1.4.pom
Downloaded: http://repo.maven.apache.org/maven2/org/codehaus/modello/modello-plugin-converters/1.4/modello-plugin-converters-1.4.pom
(2 KB at 3.2 KB/sec)
Downloading: http://repo.maven.apache.org/maven2/org/codehaus/modello/modello-plugins/1.4/modello-plugins-1.4.pom
Downloaded: http://repo.maven.apache.org/maven2/org/codehaus/modello/modello-plugins/1.4/modello-plugins-1.4.pom
(3 KB at 4.8 KB/sec)
Downloading: http://repo.maven.apache.org/maven2/org/codehaus/modello/modello-plugin-java/1.4/modello-plugin-java-1.4.pom
Downloaded: http://repo.maven.apache.org/maven2/org/codehaus/modello/modello-plugin-java/1.4/modello-plugin-java-1.4.pom
(3 KB at 4.8 KB/sec)
Downloading: http://repo.maven.apache.org/maven2/org/codehaus/modello/modello-plugin-dom4j/1.4/modello-plugin-dom4j-1.4.pom
Downloaded: http://repo.maven.apache.org/maven2/org/codehaus/modello/modello-plugin-dom4j/1.4/modello-plugin-dom4j-1.4.pom
(2 KB at 3.0 KB/sec)
Downloading: http://repo.maven.apache.org/maven2/org/codehaus/modello/modello-plugin-xml/1.4/modello-plugin-xml-1.4.pom
Downloaded: http://repo.maven.apache.org/maven2/org/codehaus/modello/modello-plugin-xml/1.4/modello-plugin-xml-1.4.pom
(2 KB at 2.2 KB/sec)
Downloading: http://repo.maven.apache.org/maven2/org/codehaus/modello/modello-plugin-jdom/1.4/modello-plugin-jdom-1.4.pom
Downloaded: http://repo.maven.apache.org/maven2/org/codehaus/modello/modello-plugin-jdom/1.4/modello-plugin-jdom-1.4.pom
(2 KB at 3.8 KB/sec)
Downloading: http://repo.maven.apache.org/maven2/org/codehaus/modello/modello-plugin-stax/1.4/modello-plugin-stax-1.4.pom
Downloaded: http://repo.maven.apache.org/maven2/org/codehaus/modello/modello-plugin-stax/1.4/modello-plugin-stax-1.4.pom
(3 KB at 4.8 KB/sec)
Downloading: http://repo.maven.apache.org/maven2/org/codehaus/modello/modello-plugin-xdoc/1.4/modello-plugin-xdoc-1.4.pom
Downloaded: http://repo.maven.apache.org/maven2/org/codehaus/modello/modello-plugin-xdoc/1.4/modello-plugin-xdoc-1.4.pom
(2 KB at 1.6 KB/sec)
Downloading: http://repo.maven.apache.org/maven2/org/codehaus/modello/modello-plugin-xsd/1.4/modello-plugin-xsd-1.4.pom
Downloaded: http://repo.maven.apache.org/maven2/org/codehaus/modello/modello-plugin-xsd/1.4/modello-plugin-xsd-1.4.pom
(2 KB at 1.3 KB/sec)
Downloading: http://repo.maven.apache.org/maven2/org/codehaus/modello/modello-plugin-xpp3/1.4/modello-plugin-xpp3-1.4.pom
Downloaded: http://repo.maven.apache.org/maven2/org/codehaus/modello/modello-plugin-xpp3/1.4/modello-plugin-xpp3-1.4.pom
(2 KB at 2.1 KB/sec)
Downloading: http://repo.maven.apache.org/maven2/org/codehaus/modello/modello-core/1.4/modello-core-1.4.jar
Downloading: http://repo.maven.apache.org/maven2/org/codehaus/modello/modello-plugin-converters/1.4/modello-plugin-converters-1.4.jar
Downloading: http://repo.maven.apache.org/maven2/org/codehaus/modello/modello-plugin-dom4j/1.4/modello-plugin-dom4j-1.4.jar
Downloading: http://repo.maven.apache.org/maven2/org/codehaus/modello/modello-plugin-xml/1.4/modello-plugin-xml-1.4.jar
Downloading: http://repo.maven.apache.org/maven2/org/codehaus/modello/modello-plugin-java/1.4/modello-plugin-java-1.4.jar
Downloaded: http://repo.maven.apache.org/maven2/org/codehaus/modello/modello-plugin-converters/1.4/modello-plugin-converters-1.4.jar
(10 KB at 6.2 KB/sec)
Downloading: http://repo.maven.apache.org/maven2/org/codehaus/modello/modello-plugin-jdom/1.4/modello-plugin-jdom-1.4.jar
Downloaded: http://repo.maven.apache.org/maven2/org/codehaus/modello/modello-plugin-xml/1.4/modello-plugin-xml-1.4.jar
(15 KB at 7.4 KB/sec)
Downloading: http://repo.maven.apache.org/maven2/org/codehaus/modello/modello-plugin-stax/1.4/modello-plugin-stax-1.4.jar
Downloaded: http://repo.maven.apache.org/maven2/org/codehaus/modello/modello-plugin-dom4j/1.4/modello-plugin-dom4j-1.4.jar
(18 KB at 7.2 KB/sec)
Downloading: http://repo.maven.apache.org/maven2/org/codehaus/modello/modello-plugin-xdoc/1.4/modello-plugin-xdoc-1.4.jar
Downloaded: http://repo.maven.apache.org/maven2/org/codehaus/modello/modello-plugin-java/1.4/modello-plugin-java-1.4.jar
(82 KB at 31.4 KB/sec)
Downloading: http://repo.maven.apache.org/maven2/org/codehaus/modello/modello-plugin-xpp3/1.4/modello-plugin-xpp3-1.4.jar
Downloaded: http://repo.maven.apache.org/maven2/org/codehaus/modello/modello-core/1.4/modello-core-1.4.jar
(57 KB at 20.6 KB/sec)
Downloading: http://repo.maven.apache.org/maven2/org/codehaus/modello/modello-plugin-xsd/1.4/modello-plugin-xsd-1.4.jar
Downloaded: http://repo.maven.apache.org/maven2/org/codehaus/modello/modello-plugin-jdom/1.4/modello-plugin-jdom-1.4.jar
(14 KB at 4.5 KB/sec)
Downloaded: http://repo.maven.apache.org/maven2/org/codehaus/modello/modello-plugin-xdoc/1.4/modello-plugin-xdoc-1.4.jar
(14 KB at 6.1 KB/sec)
Downloaded: http://repo.maven.apache.org/maven2/org/codehaus/modello/modello-plugin-xpp3/1.4/modello-plugin-xpp3-1.4.jar
(26 KB at 10.8 KB/sec)
Downloaded: http://repo.maven.apache.org/maven2/org/codehaus/modello/modello-plugin-stax/1.4/modello-plugin-stax-1.4.jar
(36 KB at 10.9 KB/sec)
Downloaded: http://repo.maven.apache.org/maven2/org/codehaus/modello/modello-plugin-xsd/1.4/modello-plugin-xsd-1.4.jar
(14 KB at 5.1 KB/sec)
Downloading: http://repo.maven.apache.org/maven2/org/apache/maven/plugins/maven-jarsigner-plugin/1.2/maven-jarsigner-plugin-1.2.pom
Downloaded: http://repo.maven.apache.org/maven2/org/apache/maven/plugins/maven-jarsigner-plugin/1.2/maven-jarsigner-plugin-1.2.pom
(6 KB at 16.4 KB/sec)
Downloading: http://repo.maven.apache.org/maven2/org/apache/maven/plugins/maven-jarsigner-plugin/1.2/maven-jarsigner-plugin-1.2.jar
Downloaded: http://repo.maven.apache.org/maven2/org/apache/maven/plugins/maven-jarsigner-plugin/1.2/maven-jarsigner-plugin-1.2.jar
(28 KB at 56.7 KB/sec)
Downloading: http://repo.maven.apache.org/maven2/org/codehaus/mojo/keytool-maven-plugin/1.0/keytool-maven-plugin-1.0.pom
Downloaded: http://repo.maven.apache.org/maven2/org/codehaus/mojo/keytool-maven-plugin/1.0/keytool-maven-plugin-1.0.pom
(3 KB at 5.1 KB/sec)
Downloading: http://repo.maven.apache.org/maven2/org/codehaus/mojo/mojo/16/mojo-16.pom
Downloaded: http://repo.maven.apache.org/maven2/org/codehaus/mojo/mojo/16/mojo-16.pom (9 KB
at 17.6 KB/sec)
Downloading: http://repo.maven.apache.org/maven2/org/codehaus/mojo/keytool-maven-plugin/1.0/keytool-maven-plugin-1.0.jar
Downloaded: http://repo.maven.apache.org/maven2/org/codehaus/mojo/keytool-maven-plugin/1.0/keytool-maven-plugin-1.0.jar
(11 KB at 21.0 KB/sec)
Downloading: http://repo.maven.apache.org/maven2/org/apache/maven/shared/maven-shared-jar/1.1/maven-shared-jar-1.1.pom
Downloaded: http://repo.maven.apache.org/maven2/org/apache/maven/shared/maven-shared-jar/1.1/maven-shared-jar-1.1.pom
(5 KB at 11.0 KB/sec)
Downloading: http://repo.maven.apache.org/maven2/org/apache/bcel/bcel/5.2/bcel-5.2.pom
Downloaded: http://repo.maven.apache.org/maven2/org/apache/bcel/bcel/5.2/bcel-5.2.pom (619
B at 0.6 KB/sec)
Downloading: http://repo.maven.apache.org/maven2/jakarta-regexp/jakarta-regexp/1.4/jakarta-regexp-1.4.pom
Downloaded: http://repo.maven.apache.org/maven2/jakarta-regexp/jakarta-regexp/1.4/jakarta-regexp-1.4.pom
(160 B at 0.2 KB/sec)
Downloading: http://repo.maven.apache.org/maven2/org/apache/maven/wagon/wagon-file/1.0/wagon-file-1.0.pom
Downloaded: http://repo.maven.apache.org/maven2/org/apache/maven/wagon/wagon-file/1.0/wagon-file-1.0.pom
(2 KB at 2.8 KB/sec)
Downloading: http://repo.maven.apache.org/maven2/org/apache/maven/wagon/wagon-http-lightweight/1.0/wagon-http-lightweight-1.0.pom
Downloaded: http://repo.maven.apache.org/maven2/org/apache/maven/wagon/wagon-http-lightweight/1.0/wagon-http-lightweight-1.0.pom
(2 KB at 3.9 KB/sec)
Downloading: http://repo.maven.apache.org/maven2/org/apache/maven/scm/maven-scm-provider-hg/1.4/maven-scm-provider-hg-1.4.pom
Downloaded: http://repo.maven.apache.org/maven2/org/apache/maven/scm/maven-scm-provider-hg/1.4/maven-scm-provider-hg-1.4.pom
(3 KB at 4.9 KB/sec)
Downloading: http://repo.maven.apache.org/maven2/org/apache/maven/scm/maven-scm-provider-perforce/1.4/maven-scm-provider-perforce-1.4.pom
Downloaded: http://repo.maven.apache.org/maven2/org/apache/maven/scm/maven-scm-provider-perforce/1.4/maven-scm-provider-perforce-1.4.pom
(3 KB at 5.2 KB/sec)
Downloading: http://repo.maven.apache.org/maven2/org/apache/maven/scm/maven-scm-provider-starteam/1.4/maven-scm-provider-starteam-1.4.pom
Downloaded: http://repo.maven.apache.org/maven2/org/apache/maven/scm/maven-scm-provider-starteam/1.4/maven-scm-provider-starteam-1.4.pom
(3 KB at 5.0 KB/sec)
Downloading: http://repo.maven.apache.org/maven2/org/apache/maven/scm/maven-scm-provider-gitexe/1.4/maven-scm-provider-gitexe-1.4.pom
Downloaded: http://repo.maven.apache.org/maven2/org/apache/maven/scm/maven-scm-provider-gitexe/1.4/maven-scm-provider-gitexe-1.4.pom
(3 KB at 5.2 KB/sec)
Downloading: http://repo.maven.apache.org/maven2/org/apache/maven/scm/maven-scm-providers-git/1.4/maven-scm-providers-git-1.4.pom
Downloaded: http://repo.maven.apache.org/maven2/org/apache/maven/scm/maven-scm-providers-git/1.4/maven-scm-providers-git-1.4.pom
(3 KB at 4.3 KB/sec)
Downloading: http://repo.maven.apache.org/maven2/org/apache/maven/scm/maven-scm-provider-git-commons/1.4/maven-scm-provider-git-commons-1.4.pom
Downloaded: http://repo.maven.apache.org/maven2/org/apache/maven/scm/maven-scm-provider-git-commons/1.4/maven-scm-provider-git-commons-1.4.pom
(3 KB at 4.5 KB/sec)
Downloading: http://repo.maven.apache.org/maven2/joda-time/joda-time/1.6.2/joda-time-1.6.2.pom
Downloaded: http://repo.maven.apache.org/maven2/joda-time/joda-time/1.6.2/joda-time-1.6.2.pom
(14 KB at 27.9 KB/sec)
Downloading: http://repo.maven.apache.org/maven2/httpunit/httpunit/1.6/httpunit-1.6.pom
Downloaded: http://repo.maven.apache.org/maven2/httpunit/httpunit/1.6/httpunit-1.6.pom (3
KB at 4.8 KB/sec)
Downloading: http://repo.maven.apache.org/maven2/xerces/xmlParserAPIs/2.2.1/xmlParserAPIs-2.2.1.pom
Downloaded: http://repo.maven.apache.org/maven2/xerces/xmlParserAPIs/2.2.1/xmlParserAPIs-2.2.1.pom
(153 B at 0.3 KB/sec)
Downloading: http://repo.maven.apache.org/maven2/nekohtml/nekohtml/0.9.1/nekohtml-0.9.1.pom
Downloaded: http://repo.maven.apache.org/maven2/nekohtml/nekohtml/0.9.1/nekohtml-0.9.1.pom
(346 B at 0.7 KB/sec)
Downloading: http://repo.maven.apache.org/maven2/xerces/xerces/2.4.0/xerces-2.4.0.pom
Downloaded: http://repo.maven.apache.org/maven2/xerces/xerces/2.4.0/xerces-2.4.0.pom (311
B at 0.6 KB/sec)
Downloading: http://repo.maven.apache.org/maven2/xerces/xercesImpl/2.4.0/xercesImpl-2.4.0.pom
Downloaded: http://repo.maven.apache.org/maven2/xerces/xercesImpl/2.4.0/xercesImpl-2.4.0.pom
(150 B at 0.3 KB/sec)
Downloading: http://repo.maven.apache.org/maven2/rhino/js/1.5R4.1/js-1.5R4.1.pom
Downloaded: http://repo.maven.apache.org/maven2/rhino/js/1.5R4.1/js-1.5R4.1.pom (143 B at
0.3 KB/sec)
Downloading: http://repo.maven.apache.org/maven2/org/mortbay/jetty/jetty/6.1.5/jetty-6.1.5.pom
Downloaded: http://repo.maven.apache.org/maven2/org/mortbay/jetty/jetty/6.1.5/jetty-6.1.5.pom
(5 KB at 8.2 KB/sec)
Downloading: http://repo.maven.apache.org/maven2/org/mortbay/jetty/project/6.1.5/project-6.1.5.pom
Downloaded: http://repo.maven.apache.org/maven2/org/mortbay/jetty/project/6.1.5/project-6.1.5.pom
(13 KB at 25.8 KB/sec)
Downloading: http://repo.maven.apache.org/maven2/org/mortbay/jetty/jetty-util/6.1.5/jetty-util-6.1.5.pom
Downloaded: http://repo.maven.apache.org/maven2/org/mortbay/jetty/jetty-util/6.1.5/jetty-util-6.1.5.pom
(4 KB at 7.5 KB/sec)
Downloading: http://repo.maven.apache.org/maven2/org/mortbay/jetty/servlet-api-2.5/6.1.5/servlet-api-2.5-6.1.5.pom
Downloaded: http://repo.maven.apache.org/maven2/org/mortbay/jetty/servlet-api-2.5/6.1.5/servlet-api-2.5-6.1.5.pom
(4 KB at 8.1 KB/sec)
Downloading: http://repo.maven.apache.org/maven2/org/apache/maven/shared/maven-shared-jar/1.1/maven-shared-jar-1.1.jar
Downloading: http://repo.maven.apache.org/maven2/org/apache/bcel/bcel/5.2/bcel-5.2.jar
Downloading: http://repo.maven.apache.org/maven2/jakarta-regexp/jakarta-regexp/1.4/jakarta-regexp-1.4.jar
Downloading: http://repo.maven.apache.org/maven2/org/apache/maven/wagon/wagon-file/1.0/wagon-file-1.0.jar
Downloading: http://repo.maven.apache.org/maven2/org/apache/maven/wagon/wagon-http-lightweight/1.0/wagon-http-lightweight-1.0.jar
Downloaded: http://repo.maven.apache.org/maven2/org/apache/maven/shared/maven-shared-jar/1.1/maven-shared-jar-1.1.jar
(37 KB at 25.2 KB/sec)
Downloading: http://repo.maven.apache.org/maven2/org/apache/maven/scm/maven-scm-provider-hg/1.4/maven-scm-provider-hg-1.4.jar
Downloaded: http://repo.maven.apache.org/maven2/jakarta-regexp/jakarta-regexp/1.4/jakarta-regexp-1.4.jar
(28 KB at 16.2 KB/sec)
Downloading: http://repo.maven.apache.org/maven2/org/apache/maven/scm/maven-scm-provider-perforce/1.4/maven-scm-provider-perforce-1.4.jar
Downloaded: http://repo.maven.apache.org/maven2/org/apache/maven/wagon/wagon-file/1.0/wagon-file-1.0.jar
(11 KB at 5.5 KB/sec)
Downloading: http://repo.maven.apache.org/maven2/org/apache/maven/scm/maven-scm-provider-starteam/1.4/maven-scm-provider-starteam-1.4.jar
Downloaded: http://repo.maven.apache.org/maven2/org/apache/bcel/bcel/5.2/bcel-5.2.jar (521
KB at 235.4 KB/sec)
Downloading: http://repo.maven.apache.org/maven2/org/apache/maven/scm/maven-scm-provider-gitexe/1.4/maven-scm-provider-gitexe-1.4.jar
Downloaded: http://repo.maven.apache.org/maven2/org/apache/maven/wagon/wagon-http-lightweight/1.0/wagon-http-lightweight-1.0.jar
(15 KB at 5.9 KB/sec)
Downloading: http://repo.maven.apache.org/maven2/org/apache/maven/scm/maven-scm-provider-git-commons/1.4/maven-scm-provider-git-commons-1.4.jar
Downloaded: http://repo.maven.apache.org/maven2/org/apache/maven/scm/maven-scm-provider-hg/1.4/maven-scm-provider-hg-1.4.jar
(54 KB at 19.5 KB/sec)
Downloading: http://repo.maven.apache.org/maven2/joda-time/joda-time/1.6.2/joda-time-1.6.2.jar
Downloaded: http://repo.maven.apache.org/maven2/org/apache/maven/scm/maven-scm-provider-perforce/1.4/maven-scm-provider-perforce-1.4.jar
(78 KB at 28.3 KB/sec)
Downloading: http://repo.maven.apache.org/maven2/httpunit/httpunit/1.6/httpunit-1.6.jar
Downloaded: http://repo.maven.apache.org/maven2/org/apache/maven/scm/maven-scm-provider-starteam/1.4/maven-scm-provider-starteam-1.4.jar
(72 KB at 25.9 KB/sec)
Downloading: http://repo.maven.apache.org/maven2/xerces/xmlParserAPIs/2.2.1/xmlParserAPIs-2.2.1.jar
Downloaded: http://repo.maven.apache.org/maven2/org/apache/maven/scm/maven-scm-provider-gitexe/1.4/maven-scm-provider-gitexe-1.4.jar
(52 KB at 18.6 KB/sec)
Downloading: http://repo.maven.apache.org/maven2/nekohtml/nekohtml/0.9.1/nekohtml-0.9.1.jar
Downloaded: http://repo.maven.apache.org/maven2/org/apache/maven/scm/maven-scm-provider-git-commons/1.4/maven-scm-provider-git-commons-1.4.jar
(38 KB at 13.6 KB/sec)
Downloading: http://repo.maven.apache.org/maven2/rhino/js/1.5R4.1/js-1.5R4.1.jar
Downloaded: http://repo.maven.apache.org/maven2/xerces/xmlParserAPIs/2.2.1/xmlParserAPIs-2.2.1.jar
(82 KB at 31.7 KB/sec)
Downloading: http://repo.maven.apache.org/maven2/javax/servlet/servlet-api/2.3/servlet-api-2.3.jar
Downloaded: http://repo.maven.apache.org/maven2/joda-time/joda-time/1.6.2/joda-time-1.6.2.jar
(531 KB at 163.0 KB/sec)
Downloading: http://repo.maven.apache.org/maven2/org/mortbay/jetty/jetty/6.1.5/jetty-6.1.5.jar
Downloaded: http://repo.maven.apache.org/maven2/httpunit/httpunit/1.6/httpunit-1.6.jar (402
KB at 123.2 KB/sec)
Downloading: http://repo.maven.apache.org/maven2/org/mortbay/jetty/jetty-util/6.1.5/jetty-util-6.1.5.jar
Downloaded: http://repo.maven.apache.org/maven2/nekohtml/nekohtml/0.9.1/nekohtml-0.9.1.jar
(66 KB at 21.7 KB/sec)
Downloading: http://repo.maven.apache.org/maven2/org/mortbay/jetty/servlet-api-2.5/6.1.5/servlet-api-2.5-6.1.5.jar
Downloaded: http://repo.maven.apache.org/maven2/rhino/js/1.5R4.1/js-1.5R4.1.jar (584 KB at
181.4 KB/sec)
Downloaded: http://repo.maven.apache.org/maven2/javax/servlet/servlet-api/2.3/servlet-api-2.3.jar
(77 KB at 28.4 KB/sec)
Downloaded: http://repo.maven.apache.org/maven2/org/mortbay/jetty/jetty-util/6.1.5/jetty-util-6.1.5.jar
(135 KB at 54.2 KB/sec)
Downloaded: http://repo.maven.apache.org/maven2/org/mortbay/jetty/jetty/6.1.5/jetty-6.1.5.jar
(475 KB at 158.3 KB/sec)
Downloaded: http://repo.maven.apache.org/maven2/org/mortbay/jetty/servlet-api-2.5/6.1.5/servlet-api-2.5-6.1.5.jar
(130 KB at 43.3 KB/sec)
Downloading: http://repo.maven.apache.org/maven2/org/codehaus/plexus/plexus-utils/1.4.9/plexus-utils-1.4.9.jar
Downloaded: http://repo.maven.apache.org/maven2/org/codehaus/plexus/plexus-utils/1.4.9/plexus-utils-1.4.9.jar
(200 KB at 118.4 KB/sec)
Running org.apache.maven.report.projectinfo.ProjectIndexPageReportTest
Tests run: 1, Failures: 0, Errors: 0, Skipped: 0, Time elapsed: 4.956 sec
Running org.apache.maven.report.projectinfo.DependenciesReportTest
Tests run: 1, Failures: 0, Errors: 0, Skipped: 0, Time elapsed: 5.459 sec
Running org.apache.maven.report.projectinfo.MailingListsReportTest
Tests run: 3, Failures: 0, Errors: 0, Skipped: 0, Time elapsed: 0.408 sec
Running org.apache.maven.report.projectinfo.DependencyManagementReportTest
Tests run: 1, Failures: 0, Errors: 0, Skipped: 0, Time elapsed: 3.042 sec
Running org.apache.maven.report.projectinfo.CimReportTest
Tests run: 1, Failures: 0, Errors: 0, Skipped: 0, Time elapsed: 0.187 sec
Running org.apache.maven.report.projectinfo.IssueTrackingReportTest
Tests run: 1, Failures: 0, Errors: 0, Skipped: 0, Time elapsed: 0.158 sec
Running org.apache.maven.report.projectinfo.TeamListReportTest
Tests run: 1, Failures: 0, Errors: 0, Skipped: 0, Time elapsed: 0.166 sec
Running org.apache.maven.report.projectinfo.PluginManagementReportTest
Tests run: 1, Failures: 0, Errors: 0, Skipped: 0, Time elapsed: 0.166 sec
Running org.apache.maven.report.projectinfo.ProjectInfoReportUtilsTest
Tests run: 1, Failures: 0, Errors: 0, Skipped: 0, Time elapsed: 1.205 sec
Running org.apache.maven.report.projectinfo.DependencyConvergenceReportTest
Tests run: 1, Failures: 0, Errors: 0, Skipped: 0, Time elapsed: 0.157 sec
Running org.apache.maven.report.projectinfo.ModulesReportTest
Tests run: 1, Failures: 0, Errors: 0, Skipped: 0, Time elapsed: 1.253 sec
Running org.apache.maven.report.projectinfo.ProjectSummaryReportTest
Tests run: 1, Failures: 0, Errors: 0, Skipped: 0, Time elapsed: 0.154 sec
Running org.apache.maven.report.projectinfo.ScmReportTest
Tests run: 2, Failures: 0, Errors: 0, Skipped: 0, Time elapsed: 0.375 sec
Running org.apache.maven.report.projectinfo.LicenseReportTest
Tests run: 2, Failures: 0, Errors: 0, Skipped: 0, Time elapsed: 0.896 sec
Downloading: http://repo.maven.apache.org/maven2/org/codehaus/plexus/plexus-utils/1.5.15/plexus-utils-1.5.15.jar
Downloaded: http://repo.maven.apache.org/maven2/org/codehaus/plexus/plexus-utils/1.5.15/plexus-utils-1.5.15.jar
(223 KB at 91.7 KB/sec)
Running org.apache.maven.plugin.resources.remote.RemoteResourcesMojoTest
Tests run: 10, Failures: 0, Errors: 0, Skipped: 0, Time elapsed: 1.407 sec
Running org.apache.maven.plugin.resources.remote.it.IT_GenerateFromBundle
Tests run: 1, Failures: 0, Errors: 1, Skipped: 0, Time elapsed: 8.826 sec <<< FAILURE!
Running org.apache.maven.plugin.resources.remote.it.IT_GenerateFromOverride
Tests run: 1, Failures: 0, Errors: 1, Skipped: 0, Time elapsed: 1.42 sec <<< FAILURE!
Running org.apache.maven.plugin.resources.remote.it.IT_CustomFilterDelimiter
Tests run: 1, Failures: 0, Errors: 1, Skipped: 0, Time elapsed: 1.475 sec <<< FAILURE!
Running org.apache.maven.plugin.resources.remote.it.IT_SupplementalArtifact
Tests run: 1, Failures: 0, Errors: 1, Skipped: 0, Time elapsed: 5.259 sec <<< FAILURE!
Running org.apache.maven.plugin.resources.remote.it.IT_GenerateFromBundleWithTypeAndClassifier
Tests run: 1, Failures: 0, Errors: 1, Skipped: 0, Time elapsed: 1.471 sec <<< FAILURE!
Running org.apache.maven.plugin.resources.remote.it.IT_FilterLocalOverride
Tests run: 1, Failures: 0, Errors: 1, Skipped: 0, Time elapsed: 1.569 sec <<< FAILURE!
Running org.apache.maven.plugin.resources.remote.it.IT_BadDependencyPoms
Tests run: 1, Failures: 0, Errors: 1, Skipped: 0, Time elapsed: 1.53 sec <<< FAILURE!
Running org.apache.maven.plugin.resources.remote.it.IT_RunOnlyAtExecutionRoot
Tests run: 1, Failures: 0, Errors: 1, Skipped: 0, Time elapsed: 4.973 sec <<< FAILURE!
Running org.apache.maven.plugin.resources.remote.it.IT_GetDependencyProjects
Tests run: 1, Failures: 0, Errors: 1, Skipped: 0, Time elapsed: 6.168 sec <<< FAILURE!
Build step 'Invoke top-level Maven targets' marked build as failure

Mime
View raw message