maven-notifications mailing list archives

Site index · List index
Message view « Date » · « Thread »
Top « Date » · « Thread »
From Apache Jenkins Server <jenk...@builds.apache.org>
Subject Build failed in Jenkins: maven-plugins-ITs-m3 #398
Date Fri, 06 Apr 2012 10:17:56 GMT
See <https://builds.apache.org/job/maven-plugins-ITs-m3/398/changes>

Changes:

[dennisl] Merge r1294312 from maven-site-plugin-2.x branch.

Remove org.codehaus.mojo:javancss-maven-plugin:2.0 from <reporting>/<plugins>
because it makes the IT for MSITE-507 fail under Maven 2, but as far as I can tell it does
not have anything to do with the issue itself.

------------------------------------------
[...truncated 8966 lines...]
[INFO] 1 archive(s) processed
[INFO] 
[INFO] --- maven-invoker-plugin:1.5:verify (integration-test) @ maven-project-info-reports-plugin
---
[INFO] -------------------------------------------------
[INFO] Build Summary:
[INFO]   Passed: 2, Failed: 0, Errors: 0, Skipped: 0
[INFO] -------------------------------------------------
[INFO] 
[INFO] --- maven-install-plugin:2.3.1:install (default-install) @ maven-project-info-reports-plugin
---
[INFO] Installing /x1/jenkins/jenkins-slave/workspace/maven-plugins-ITs-m3/maven-project-info-reports-plugin/target/maven-project-info-reports-plugin-2.4.1-SNAPSHOT.jar
to <https://builds.apache.org/job/maven-plugins-ITs-m3/ws/.repository/org/apache/maven/plugins/maven-project-info-reports-plugin/2.4.1-SNAPSHOT/maven-project-info-reports-plugin-2.4.1-SNAPSHOT.jar>
[INFO] Installing /x1/jenkins/jenkins-slave/workspace/maven-plugins-ITs-m3/maven-project-info-reports-plugin/pom.xml
to <https://builds.apache.org/job/maven-plugins-ITs-m3/ws/.repository/org/apache/maven/plugins/maven-project-info-reports-plugin/2.4.1-SNAPSHOT/maven-project-info-reports-plugin-2.4.1-SNAPSHOT.pom>
[INFO]                                                                         
[INFO] ------------------------------------------------------------------------
[INFO] Building Maven Remote Resources Plugin 1.3-SNAPSHOT
[INFO] ------------------------------------------------------------------------
[INFO] 
[INFO] --- maven-clean-plugin:2.4.1:clean (default-clean) @ maven-remote-resources-plugin
---
[INFO] Deleting /x1/jenkins/jenkins-slave/workspace/maven-plugins-ITs-m3/maven-remote-resources-plugin/target
[INFO] 
[INFO] --- maven-enforcer-plugin:1.0.1:enforce (ensure-no-container-api) @ maven-remote-resources-plugin
---
[INFO] 
[INFO] --- maven-plugin-plugin:2.8:helpmojo (generated-helpmojo) @ maven-remote-resources-plugin
---
[INFO] Using 'UTF-8' encoding to read mojo metadata.
[INFO] Applying mojo extractor for language: java
[INFO] Mojo extractor for language: java found 2 mojo descriptors.
[INFO] Applying mojo extractor for language: bsh
[INFO] Mojo extractor for language: bsh found 0 mojo descriptors.
[INFO] 
[INFO] --- modello-maven-plugin:1.4.1:xpp3-writer (remote-resources) @ maven-remote-resources-plugin
---
[INFO] outputDirectory: /x1/jenkins/jenkins-slave/workspace/maven-plugins-ITs-m3/maven-remote-resources-plugin/target/generated-sources/modello
[INFO] Working on model: src/main/mdo/remote-resources.mdo
[INFO] Generating current version: 1.1.0
[INFO] 
[INFO] --- modello-maven-plugin:1.4.1:java (remote-resources) @ maven-remote-resources-plugin
---
[INFO] outputDirectory: /x1/jenkins/jenkins-slave/workspace/maven-plugins-ITs-m3/maven-remote-resources-plugin/target/generated-sources/modello
[INFO] Working on model: src/main/mdo/remote-resources.mdo
[INFO] Generating current version: 1.1.0
[INFO] 
[INFO] --- modello-maven-plugin:1.4.1:xpp3-reader (remote-resources) @ maven-remote-resources-plugin
---
[INFO] outputDirectory: /x1/jenkins/jenkins-slave/workspace/maven-plugins-ITs-m3/maven-remote-resources-plugin/target/generated-sources/modello
[INFO] Working on model: src/main/mdo/remote-resources.mdo
[INFO] Generating current version: 1.1.0
[INFO] 
[INFO] --- modello-maven-plugin:1.4.1:xpp3-writer (supplemental-models) @ maven-remote-resources-plugin
---
[INFO] outputDirectory: /x1/jenkins/jenkins-slave/workspace/maven-plugins-ITs-m3/maven-remote-resources-plugin/target/generated-sources/modello
[INFO] Working on model: src/main/mdo/supplemental-model.mdo
[INFO] Generating current version: 1.0.0
[INFO] 
[INFO] --- modello-maven-plugin:1.4.1:java (supplemental-models) @ maven-remote-resources-plugin
---
[INFO] outputDirectory: /x1/jenkins/jenkins-slave/workspace/maven-plugins-ITs-m3/maven-remote-resources-plugin/target/generated-sources/modello
[INFO] Working on model: src/main/mdo/supplemental-model.mdo
[INFO] Generating current version: 1.0.0
[INFO] 
[INFO] --- modello-maven-plugin:1.4.1:xpp3-reader (supplemental-models) @ maven-remote-resources-plugin
---
[INFO] outputDirectory: /x1/jenkins/jenkins-slave/workspace/maven-plugins-ITs-m3/maven-remote-resources-plugin/target/generated-sources/modello
[INFO] Working on model: src/main/mdo/supplemental-model.mdo
[INFO] Generating current version: 1.0.0
[INFO] 
[INFO] --- maven-plugin-plugin:2.8:descriptor (default-descriptor) @ maven-remote-resources-plugin
---
[INFO] Using 'UTF-8' encoding to read mojo metadata.
[INFO] Applying mojo extractor for language: java
[INFO] Mojo extractor for language: java found 3 mojo descriptors.
[INFO] Applying mojo extractor for language: bsh
[INFO] Mojo extractor for language: bsh found 0 mojo descriptors.
[INFO] 
[INFO] --- maven-remote-resources-plugin:1.2.1:process (default) @ maven-remote-resources-plugin
---
[INFO] 
[INFO] --- maven-resources-plugin:2.5:resources (default-resources) @ maven-remote-resources-plugin
---
[debug] execute contextualize
[INFO] Using 'UTF-8' encoding to copy filtered resources.
[INFO] Copying 1 resource
[INFO] Copying 3 resources
[INFO] 
[INFO] --- maven-compiler-plugin:2.3.2:compile (default-compile) @ maven-remote-resources-plugin
---
[INFO] Compiling 11 source files to /x1/jenkins/jenkins-slave/workspace/maven-plugins-ITs-m3/maven-remote-resources-plugin/target/classes
[INFO] 
[INFO] --- maven-resources-plugin:2.5:testResources (default-testResources) @ maven-remote-resources-plugin
---
[debug] execute contextualize
[INFO] Using 'UTF-8' encoding to copy filtered resources.
[INFO] Copying 7 resources
[INFO] Copying 46 resources
[INFO] Copying 1 resource
[INFO] Copying 3 resources
[INFO] 
[INFO] --- maven-compiler-plugin:2.3.2:testCompile (default-testCompile) @ maven-remote-resources-plugin
---
[INFO] Compiling 18 source files to /x1/jenkins/jenkins-slave/workspace/maven-plugins-ITs-m3/maven-remote-resources-plugin/target/test-classes
[INFO] 
[INFO] --- maven-surefire-plugin:2.9:test (default-test) @ maven-remote-resources-plugin ---
[INFO] Surefire report directory: /x1/jenkins/jenkins-slave/workspace/maven-plugins-ITs-m3/maven-remote-resources-plugin/target/surefire-reports

-------------------------------------------------------
 T E S T S
-------------------------------------------------------
Running org.apache.maven.plugin.resources.remote.RemoteResourcesMojoTest
Tests run: 10, Failures: 0, Errors: 0, Skipped: 0, Time elapsed: 0.931 sec

Results :

Tests run: 10, Failures: 0, Errors: 0, Skipped: 0

[INFO] 
[INFO] --- maven-jar-plugin:2.3.1:jar (default-jar) @ maven-remote-resources-plugin ---
[INFO] Building jar: /x1/jenkins/jenkins-slave/workspace/maven-plugins-ITs-m3/maven-remote-resources-plugin/target/maven-remote-resources-plugin-1.3-SNAPSHOT.jar
[INFO] 
[INFO] --- maven-plugin-plugin:2.8:addPluginArtifactMetadata (default-addPluginArtifactMetadata)
@ maven-remote-resources-plugin ---
[INFO] 
[INFO] --- maven-invoker-plugin:1.5:install (integration-test) @ maven-remote-resources-plugin
---
[INFO] Installing /x1/jenkins/jenkins-slave/workspace/maven-plugins-ITs-m3/maven-remote-resources-plugin/pom.xml
to /x1/jenkins/jenkins-slave/workspace/maven-plugins-ITs-m3/maven-remote-resources-plugin/target/local-repo/org/apache/maven/plugins/maven-remote-resources-plugin/1.3-SNAPSHOT/maven-remote-resources-plugin-1.3-SNAPSHOT.pom
[INFO] Installing /x1/jenkins/jenkins-slave/workspace/maven-plugins-ITs-m3/maven-remote-resources-plugin/target/maven-remote-resources-plugin-1.3-SNAPSHOT.jar
to /x1/jenkins/jenkins-slave/workspace/maven-plugins-ITs-m3/maven-remote-resources-plugin/target/local-repo/org/apache/maven/plugins/maven-remote-resources-plugin/1.3-SNAPSHOT/maven-remote-resources-plugin-1.3-SNAPSHOT.jar
[INFO] 
[INFO] --- maven-invoker-plugin:1.5:install (install-descriptor) @ maven-remote-resources-plugin
---
[INFO] Installing /x1/jenkins/jenkins-slave/workspace/maven-plugins-ITs-m3/maven-remote-resources-plugin/pom.xml
to /x1/jenkins/jenkins-slave/workspace/maven-plugins-ITs-m3/maven-remote-resources-plugin/target/it-repo/org/apache/maven/plugins/maven-remote-resources-plugin/1.3-SNAPSHOT/maven-remote-resources-plugin-1.3-SNAPSHOT.pom
[INFO] Installing /x1/jenkins/jenkins-slave/workspace/maven-plugins-ITs-m3/maven-remote-resources-plugin/target/maven-remote-resources-plugin-1.3-SNAPSHOT.jar
to /x1/jenkins/jenkins-slave/workspace/maven-plugins-ITs-m3/maven-remote-resources-plugin/target/it-repo/org/apache/maven/plugins/maven-remote-resources-plugin/1.3-SNAPSHOT/maven-remote-resources-plugin-1.3-SNAPSHOT.jar
[INFO] 
[INFO] --- maven-failsafe-plugin:2.9:integration-test (integration-tests) @ maven-remote-resources-plugin
---
[INFO] Failsafe report directory: /x1/jenkins/jenkins-slave/workspace/maven-plugins-ITs-m3/maven-remote-resources-plugin/target/failsafe-reports

-------------------------------------------------------
 T E S T S
-------------------------------------------------------
Running org.apache.maven.plugin.resources.remote.it.IT_CustomFilterDelimiter
Tests run: 1, Failures: 0, Errors: 1, Skipped: 0, Time elapsed: 4.561 sec <<< FAILURE!
Running org.apache.maven.plugin.resources.remote.it.IT_FilterLocalOverride
Tests run: 1, Failures: 0, Errors: 1, Skipped: 0, Time elapsed: 1.191 sec <<< FAILURE!
Running org.apache.maven.plugin.resources.remote.it.IT_GenerateFromOverride
Tests run: 1, Failures: 0, Errors: 1, Skipped: 0, Time elapsed: 1.098 sec <<< FAILURE!
Running org.apache.maven.plugin.resources.remote.it.IT_GenerateFromBundleWithTypeAndClassifier
Tests run: 1, Failures: 0, Errors: 1, Skipped: 0, Time elapsed: 1.102 sec <<< FAILURE!
Running org.apache.maven.plugin.resources.remote.it.IT_SupplementalArtifact
Tests run: 1, Failures: 0, Errors: 1, Skipped: 0, Time elapsed: 3.951 sec <<< FAILURE!
Running org.apache.maven.plugin.resources.remote.it.IT_RunOnlyAtExecutionRoot
Tests run: 1, Failures: 0, Errors: 1, Skipped: 0, Time elapsed: 3.959 sec <<< FAILURE!
Running org.apache.maven.plugin.resources.remote.it.IT_GetDependencyProjects
Tests run: 1, Failures: 0, Errors: 1, Skipped: 0, Time elapsed: 3.859 sec <<< FAILURE!
Running org.apache.maven.plugin.resources.remote.it.IT_GenerateFromBundle
Tests run: 1, Failures: 0, Errors: 1, Skipped: 0, Time elapsed: 1.099 sec <<< FAILURE!
Running org.apache.maven.plugin.resources.remote.it.IT_BadDependencyPoms
Tests run: 1, Failures: 0, Errors: 1, Skipped: 0, Time elapsed: 1.17 sec <<< FAILURE!

Results :

Tests in error: 
  test(org.apache.maven.plugin.resources.remote.it.IT_CustomFilterDelimiter): Exit code was
non-zero: 1; command line and log = 
  test(org.apache.maven.plugin.resources.remote.it.IT_FilterLocalOverride): Exit code was
non-zero: 1; command line and log = 
  test(org.apache.maven.plugin.resources.remote.it.IT_GenerateFromOverride): Exit code was
non-zero: 1; command line and log = 
  test(org.apache.maven.plugin.resources.remote.it.IT_GenerateFromBundleWithTypeAndClassifier):
Exit code was non-zero: 1; command line and log = 
  test(org.apache.maven.plugin.resources.remote.it.IT_SupplementalArtifact): Exit code was
non-zero: 1; command line and log = 
  test(org.apache.maven.plugin.resources.remote.it.IT_RunOnlyAtExecutionRoot): Exit code was
non-zero: 1; command line and log = 
  test(org.apache.maven.plugin.resources.remote.it.IT_GetDependencyProjects): Exit code was
non-zero: 1; command line and log = 
  test(org.apache.maven.plugin.resources.remote.it.IT_GenerateFromBundle): Exit code was non-zero:
1; command line and log = 
  test(org.apache.maven.plugin.resources.remote.it.IT_BadDependencyPoms): Exit code was non-zero:
1; command line and log = 

Tests run: 9, Failures: 0, Errors: 9, Skipped: 0

[WARNING] File encoding has not been set, using platform encoding ANSI_X3.4-1968, i.e. build
is platform dependent!
[INFO] 
[INFO] --- maven-invoker-plugin:1.5:integration-test (integration-test) @ maven-remote-resources-plugin
---
[INFO] Building: maven-remote-resources-test/pom.xml
[INFO] ..SUCCESS (3.3 s)
[INFO] 
[INFO] --- maven-failsafe-plugin:2.9:verify (integration-tests) @ maven-remote-resources-plugin
---
[INFO] Failsafe report directory: /x1/jenkins/jenkins-slave/workspace/maven-plugins-ITs-m3/maven-remote-resources-plugin/target/failsafe-reports
[WARNING] File encoding has not been set, using platform encoding ANSI_X3.4-1968, i.e. build
is platform dependent!
[INFO]                                                                         
[INFO] ------------------------------------------------------------------------
[INFO] Building Maven Plugins Aggregator 1-SNAPSHOT
[INFO] ------------------------------------------------------------------------
[INFO] 
[INFO] --- maven-clean-plugin:2.4.1:clean (default-clean) @ maven-plugins-aggregator ---
[INFO] Deleting /x1/jenkins/jenkins-slave/workspace/maven-plugins-ITs-m3/target
[INFO] 
[INFO] --- maven-remote-resources-plugin:1.1:process (default) @ maven-plugins-aggregator
---
[INFO] 
[INFO] --- maven-install-plugin:2.3.1:install (default-install) @ maven-plugins-aggregator
---
[INFO] Installing /x1/jenkins/jenkins-slave/workspace/maven-plugins-ITs-m3/pom.xml to <https://builds.apache.org/job/maven-plugins-ITs-m3/ws/.repository/org/apache/maven/plugins/maven-plugins-aggregator/1-SNAPSHOT/maven-plugins-aggregator-1-SNAPSHOT.pom>
[INFO] ------------------------------------------------------------------------
[INFO] Reactor Summary:
[INFO] 
[INFO] Maven Plugins ..................................... SUCCESS [14.764s]
[INFO] Maven ACR Plugin .................................. SUCCESS [23.073s]
[INFO] Maven Ant Plugin .................................. SUCCESS [1:28.855s]
[INFO] Maven AntRun Plugin ............................... SUCCESS [50.680s]
[INFO] Maven Eclipse Plugin .............................. SUCCESS [15:08.139s]
[INFO] Maven Assembly Plugin ............................. SUCCESS [10:15.172s]
[INFO] Maven Changelog Plugin ............................ SUCCESS [49.470s]
[INFO] Maven Changes Report Plugin ....................... SUCCESS [51.691s]
[INFO] Maven Checkstyle Plugin ........................... SUCCESS [1:43.080s]
[INFO] Maven Clean Plugin ................................ SUCCESS [13.905s]
[INFO] Maven Compiler Plugin ............................. SUCCESS [19.365s]
[INFO] Maven Dependency Plugin ........................... SUCCESS [1:45.286s]
[INFO] Maven Deploy Plugin ............................... SUCCESS [1:19.431s]
[INFO] Maven DOAP Plugin ................................. SUCCESS [15.838s]
[INFO] Maven Documentation Checker Plugin ................ SUCCESS [7.768s]
[INFO] Maven EAR Plugin .................................. SUCCESS [3:22.715s]
[INFO] Maven EJB Plugin .................................. SUCCESS [22.103s]
[INFO] Maven GPG Plugin .................................. SUCCESS [1:00.658s]
[INFO] Maven Help Plugin ................................. SUCCESS [37.742s]
[INFO] Maven IDEA Plugin ................................. SUCCESS [5.562s]
[INFO] Maven Install Plugin .............................. SUCCESS [48.277s]
[INFO] Maven JAR Plugin .................................. SUCCESS [1:07.063s]
[INFO] Maven Jarsigner Plugin ............................ SUCCESS [37.262s]
[INFO] Maven Javadoc Plugin .............................. FAILURE [6:57.136s]
[INFO] Maven Linkcheck Plugin ............................ SUCCESS [1.430s]
[INFO] Maven One Plugin .................................. SUCCESS [1.835s]
[INFO] Maven Patch Plugin ................................ SUCCESS [9.991s]
[INFO] Maven PDF Plugin .................................. SUCCESS [33.017s]
[INFO] Maven PMD Plugin .................................. SUCCESS [37.138s]
[INFO] Maven RAR Plugin .................................. SUCCESS [5.723s]
[INFO] Maven Reactor Plugin .............................. SUCCESS [2.247s]
[INFO] Maven Repository Plugin ........................... FAILURE [14.215s]
[INFO] Maven Resources Plugin ............................ SUCCESS [46.860s]
[INFO] Maven Shade Plugin ................................ SUCCESS [2:50.824s]
[INFO] Maven Site Plugin 3 ............................... SUCCESS [9:21.421s]
[INFO] Maven Source Plugin ............................... SUCCESS [27.363s]
[INFO] Maven Stage Plugin ................................ SUCCESS [1.666s]
[INFO] Maven Toolchains Plugin ........................... SUCCESS [1.329s]
[INFO] Maven Verifier Plugin ............................. SUCCESS [8.100s]
[INFO] Maven WAR Plugin .................................. SUCCESS [1:04.731s]
[INFO] Maven Invoker Plugin .............................. SUCCESS [3:39.707s]
[INFO] Maven Project Info Reports Plugin ................. SUCCESS [1:30.430s]
[INFO] Maven Remote Resources Plugin ..................... FAILURE [31.182s]
[INFO] Maven Plugins Aggregator .......................... SUCCESS [0.052s]
[INFO] ------------------------------------------------------------------------
[INFO] BUILD FAILURE
[INFO] ------------------------------------------------------------------------
[INFO] Total time: 1:13:03.618s
[INFO] Finished at: Fri Apr 06 10:17:55 GMT 2012
[INFO] Final Memory: 66M/989M
[INFO] ------------------------------------------------------------------------
[WARNING] The requested profile "apache.snapshots" could not be activated because it does
not exist.
[ERROR] Failed to execute goal org.apache.maven.plugins:maven-invoker-plugin:1.5:verify (integration-test)
on project maven-javadoc-plugin: 1 build failed. -> [Help 1]
[ERROR] Failed to execute goal org.apache.maven.plugins:maven-surefire-plugin:2.9:test (integration-tests)
on project maven-repository-plugin: There are test failures.
[ERROR] 
[ERROR] Please refer to /x1/jenkins/jenkins-slave/workspace/maven-plugins-ITs-m3/maven-repository-plugin/target/surefire-reports
for the individual test results.
[ERROR] -> [Help 1]
[ERROR] Failed to execute goal org.apache.maven.plugins:maven-failsafe-plugin:2.9:verify (integration-tests)
on project maven-remote-resources-plugin: There are test failures.
[ERROR] 
[ERROR] Please refer to /x1/jenkins/jenkins-slave/workspace/maven-plugins-ITs-m3/maven-remote-resources-plugin/target/failsafe-reports
for the individual test results.
[ERROR] -> [Help 1]
[ERROR] 
[ERROR] To see the full stack trace of the errors, re-run Maven with the -e switch.
[ERROR] Re-run Maven using the -X switch to enable full debug logging.
[ERROR] 
[ERROR] For more information about the errors and possible solutions, please read the following
articles:
[ERROR] [Help 1] http://cwiki.apache.org/confluence/display/MAVEN/MojoFailureException
[ERROR] 
[ERROR] After correcting the problems, you can resume the build with the command
[ERROR]   mvn <goals> -rf :maven-javadoc-plugin
Build step 'Invoke top-level Maven targets' marked build as failure

Mime
View raw message