maven-notifications mailing list archives

Site index · List index
Message view « Date » · « Thread »
Top « Date » · « Thread »
From Apache Jenkins Server <jenk...@builds.apache.org>
Subject Build failed in Jenkins: maven-site-plugin-3.x-m2 » JDK 1.5 (latest),Ubuntu #111
Date Thu, 05 Apr 2012 22:00:07 GMT
See <https://builds.apache.org/job/maven-site-plugin-3.x-m2/./jdk=JDK%201.5%20(latest),label=Ubuntu/111/changes>

Changes:

[dennisl] [MSITE-636] Upgrade to doxia-1.3
[MSITE-637] Upgrade to doxia-sitetools-1.3

------------------------------------------
[...truncated 2331 lines...]
Proxy-Connection : Keep-Alive
Content-Length : 468
Host : toto.com
User-Agent : Jakarta Commons-HttpClient/3.1
Expires : 0
Accept-Encoding : gzip
Cache-store : no-store
Pragma : no-cache
Cache-Control : no-cache

1302 [main] INFO org.apache.maven.plugins.site.SiteDeployWebDavTest - MKCOL path /site/css/
Proxy-Authorization : Basic Zm9vOnRpdGk=
Proxy-Connection : Keep-Alive
Content-Length : 0
Host : toto.com
User-Agent : Jakarta Commons-HttpClient/3.1
Expires : 0
Accept-Encoding : gzip
Cache-store : no-store
Pragma : no-cache
Cache-Control : no-cache

1302 [main] INFO org.apache.maven.plugins.site.SiteDeployWebDavTest - PUT path /site//css/maven-base.css
Proxy-Authorization : Basic Zm9vOnRpdGk=
Proxy-Connection : Keep-Alive
Content-Length : 2310
Host : toto.com
User-Agent : Jakarta Commons-HttpClient/3.1
Expires : 0
Accept-Encoding : gzip
Cache-store : no-store
Pragma : no-cache
Cache-Control : no-cache

1302 [main] INFO org.mortbay.log - Stopped SocketConnector@0.0.0.0:57248
Tests run: 3, Failures: 0, Errors: 0, Skipped: 0, Time elapsed: 1.407 sec

Results :

Tests run: 5, Failures: 0, Errors: 0, Skipped: 0

[INFO] [jar:jar {execution: default-jar}]
[INFO] Building jar: /x1/jenkins/jenkins-slave/workspace/maven-site-plugin-3.x-m2/jdk/JDK
1.5 (latest)/label/Ubuntu/target/maven-site-plugin-3.1-SNAPSHOT.jar
[INFO] [plugin:addPluginArtifactMetadata {execution: default-addPluginArtifactMetadata}]
[INFO] [shade:shade {execution: default}]
[INFO] Including org.apache.maven.reporting:maven-reporting-api:jar:3.0 in the shaded jar.
[INFO] Excluding org.apache.maven.doxia:doxia-sink-api:jar:1.3-SNAPSHOT from the shaded jar.
[INFO] Excluding org.apache.maven.reporting:maven-reporting-exec:jar:1.0.2-SNAPSHOT from the
shaded jar.
[INFO] Including org.apache.maven:maven-artifact:jar:3.0 in the shaded jar.
[INFO] Excluding org.codehaus.plexus:plexus-utils:jar:1.5.10 from the shaded jar.
[INFO] Excluding org.apache.maven:maven-core:jar:3.0 from the shaded jar.
[INFO] Excluding org.apache.maven:maven-model:jar:3.0 from the shaded jar.
[INFO] Excluding org.apache.maven:maven-settings:jar:3.0 from the shaded jar.
[INFO] Excluding org.apache.maven:maven-settings-builder:jar:3.0 from the shaded jar.
[INFO] Excluding org.codehaus.plexus:plexus-interpolation:jar:1.14 from the shaded jar.
[INFO] Excluding org.codehaus.plexus:plexus-component-annotations:jar:1.5.5 from the shaded
jar.
[INFO] Excluding org.sonatype.plexus:plexus-sec-dispatcher:jar:1.3 from the shaded jar.
[INFO] Excluding org.sonatype.plexus:plexus-cipher:jar:1.4 from the shaded jar.
[INFO] Excluding org.apache.maven:maven-repository-metadata:jar:3.0 from the shaded jar.
[INFO] Excluding org.apache.maven:maven-plugin-api:jar:3.0 from the shaded jar.
[INFO] Excluding org.sonatype.sisu:sisu-inject-plexus:jar:1.4.2 from the shaded jar.
[INFO] Excluding org.codehaus.plexus:plexus-classworlds:jar:2.2.3 from the shaded jar.
[INFO] Excluding org.sonatype.sisu:sisu-inject-bean:jar:1.4.2 from the shaded jar.
[INFO] Excluding org.sonatype.sisu:sisu-guice:jar:noaop:2.1.7 from the shaded jar.
[INFO] Excluding org.apache.maven:maven-model-builder:jar:3.0 from the shaded jar.
[INFO] Excluding org.apache.maven:maven-aether-provider:jar:3.0 from the shaded jar.
[INFO] Excluding org.sonatype.aether:aether-api:jar:1.7 from the shaded jar.
[INFO] Excluding org.sonatype.aether:aether-util:jar:1.7 from the shaded jar.
[INFO] Excluding org.sonatype.aether:aether-impl:jar:1.7 from the shaded jar.
[INFO] Excluding org.sonatype.aether:aether-spi:jar:1.7 from the shaded jar.
[INFO] Excluding org.apache.velocity:velocity:jar:1.5 from the shaded jar.
[INFO] Excluding commons-collections:commons-collections:jar:3.2.1 from the shaded jar.
[INFO] Excluding commons-lang:commons-lang:jar:2.5 from the shaded jar.
[INFO] Excluding oro:oro:jar:2.0.8 from the shaded jar.
[INFO] Excluding velocity:velocity:jar:1.5 from the shaded jar.
[INFO] Excluding org.apache.maven.wagon:wagon-provider-api:jar:1.0 from the shaded jar.
[INFO] Excluding org.apache.maven:maven-archiver:jar:2.4.2 from the shaded jar.
[INFO] Excluding org.codehaus.plexus:plexus-archiver:jar:1.0 from the shaded jar.
[INFO] Excluding org.codehaus.plexus:plexus-container-default:jar:1.0-alpha-30 from the shaded
jar.
[INFO] Excluding org.codehaus.plexus:plexus-io:jar:1.0 from the shaded jar.
[INFO] Excluding org.apache.maven.doxia:doxia-logging-api:jar:1.3-SNAPSHOT from the shaded
jar.
[INFO] Excluding org.apache.maven.doxia:doxia-core:jar:1.3-SNAPSHOT from the shaded jar.
[INFO] Excluding xerces:xercesImpl:jar:2.9.1 from the shaded jar.
[INFO] Excluding xml-apis:xml-apis:jar:1.3.04 from the shaded jar.
[INFO] Excluding org.apache.httpcomponents:httpclient:jar:4.0.2 from the shaded jar.
[INFO] Excluding org.apache.httpcomponents:httpcore:jar:4.0.1 from the shaded jar.
[INFO] Excluding commons-logging:commons-logging:jar:1.1.1 from the shaded jar.
[INFO] Excluding commons-codec:commons-codec:jar:1.3 from the shaded jar.
[INFO] Excluding org.apache.maven.doxia:doxia-module-xhtml:jar:1.3-SNAPSHOT from the shaded
jar.
[INFO] Excluding org.apache.maven.doxia:doxia-module-apt:jar:1.3-SNAPSHOT from the shaded
jar.
[INFO] Excluding org.apache.maven.doxia:doxia-module-xdoc:jar:1.3-SNAPSHOT from the shaded
jar.
[INFO] Excluding org.apache.maven.doxia:doxia-module-fml:jar:1.3-SNAPSHOT from the shaded
jar.
[INFO] Excluding javax.servlet:servlet-api:jar:2.5 from the shaded jar.
[INFO] Excluding org.apache.maven.doxia:doxia-decoration-model:jar:1.3-SNAPSHOT from the shaded
jar.
[INFO] Excluding org.apache.maven.doxia:doxia-site-renderer:jar:1.3-SNAPSHOT from the shaded
jar.
[INFO] Excluding org.codehaus.plexus:plexus-i18n:jar:1.0-beta-7 from the shaded jar.
[INFO] Excluding org.codehaus.plexus:plexus-velocity:jar:1.1.8 from the shaded jar.
[INFO] Excluding org.apache.velocity:velocity-tools:jar:2.0 from the shaded jar.
[INFO] Excluding commons-beanutils:commons-beanutils:jar:1.7.0 from the shaded jar.
[INFO] Excluding commons-digester:commons-digester:jar:1.8 from the shaded jar.
[INFO] Excluding commons-chain:commons-chain:jar:1.1 from the shaded jar.
[INFO] Excluding commons-validator:commons-validator:jar:1.3.1 from the shaded jar.
[INFO] Excluding dom4j:dom4j:jar:1.1 from the shaded jar.
[INFO] Excluding sslext:sslext:jar:1.2-0 from the shaded jar.
[INFO] Excluding org.apache.struts:struts-core:jar:1.3.8 from the shaded jar.
[INFO] Excluding antlr:antlr:jar:2.7.2 from the shaded jar.
[INFO] Excluding org.apache.struts:struts-taglib:jar:1.3.8 from the shaded jar.
[INFO] Excluding org.apache.struts:struts-tiles:jar:1.3.8 from the shaded jar.
[INFO] Excluding org.apache.maven.shared:maven-doxia-tools:jar:1.4 from the shaded jar.
[INFO] Excluding commons-io:commons-io:jar:1.4 from the shaded jar.
[INFO] Excluding org.mortbay.jetty:jetty:jar:6.1.25 from the shaded jar.
[INFO] Excluding org.mortbay.jetty:jetty-util:jar:6.1.25 from the shaded jar.
[INFO] Excluding org.mortbay.jetty:servlet-api:jar:2.5-20081211 from the shaded jar.
[INFO] Replacing original artifact with shaded artifact.
[INFO] Replacing /x1/jenkins/jenkins-slave/workspace/maven-site-plugin-3.x-m2/jdk/JDK 1.5
(latest)/label/Ubuntu/target/maven-site-plugin-3.1-SNAPSHOT.jar with /x1/jenkins/jenkins-slave/workspace/maven-site-plugin-3.x-m2/jdk/JDK
1.5 (latest)/label/Ubuntu/target/maven-site-plugin-3.1-SNAPSHOT-shaded.jar
[INFO] [invoker:install {execution: integration-test}]
[INFO] Installing /x1/jenkins/jenkins-slave/workspace/maven-site-plugin-3.x-m2/jdk/JDK 1.5
(latest)/label/Ubuntu/dependency-reduced-pom.xml to /x1/jenkins/jenkins-slave/workspace/maven-site-plugin-3.x-m2/jdk/JDK
1.5 (latest)/label/Ubuntu/target/local-repo/org/apache/maven/plugins/maven-site-plugin/3.1-SNAPSHOT/maven-site-plugin-3.1-SNAPSHOT.pom
[INFO] Installing /x1/jenkins/jenkins-slave/workspace/maven-site-plugin-3.x-m2/jdk/JDK 1.5
(latest)/label/Ubuntu/target/maven-site-plugin-3.1-SNAPSHOT.jar to /x1/jenkins/jenkins-slave/workspace/maven-site-plugin-3.x-m2/jdk/JDK
1.5 (latest)/label/Ubuntu/target/local-repo/org/apache/maven/plugins/maven-site-plugin/3.1-SNAPSHOT/maven-site-plugin-3.1-SNAPSHOT.jar
[INFO] [invoker:integration-test {execution: integration-test}]
[INFO] Building: site-attach-descriptor/pom.xml
[INFO] ..SUCCESS (6.1 s)
[INFO] Building: emma-plugin-it/pom.xml
[INFO] ..SUCCESS (7.9 s)
[INFO] Building: MSITE-354/pom.xml
[INFO] ..SUCCESS (8.5 s)
[INFO] Building: MSITE-566/pom.xml
[INFO] ..SUCCESS (6.5 s)
[INFO] Building: it-plugin-test/pom.xml
[INFO] ..SUCCESS (5.4 s)
[INFO] Building: MSITE-484/pom.xml
[INFO] ..SKIPPED 
[INFO] Building: MSITE-265/pom.xml
[INFO] ..SUCCESS (9.1 s)
[INFO] Building: interpolation/pom.xml
[INFO] ..SUCCESS (6.9 s)
[INFO] Building: inheritedReports/pom.xml
[INFO] ..SUCCESS (5.8 s)
[INFO] Building: surefire-report/pom.xml
[INFO] ..SUCCESS (6.6 s)
[INFO] Building: MSITE-537/pom.xml
[INFO] ..SUCCESS (6.6 s)
[INFO] Building: new-configuration/pom.xml
[INFO] ..SKIPPED 
[INFO] Building: MSITE-497/pom.xml
[INFO] ..SUCCESS (27.1 s)
[INFO] Building: MSITE-304/pom.xml
[INFO] ..SUCCESS (6.0 s)
[INFO] Building: MSITE-548/pom.xml
[INFO] ..SUCCESS (7.4 s)
[INFO] Building: report-changes-generation/pom.xml
[INFO] ..SUCCESS (12.0 s)
[INFO] Building: MSITE-609/pom.xml
[INFO] ..SUCCESS (5.8 s)
[INFO] Building: site-skip/pom.xml
[INFO] ..SUCCESS (5.2 s)
[INFO] Building: empty-report-set/pom.xml
[INFO] ..SUCCESS (3.1 s)
[INFO] Building: site-stage-deploy/pom.xml
[INFO] ..SUCCESS (9.7 s)
[INFO] Building: full-reporting/pom.xml
[INFO] ..SKIPPED 
[INFO] Building: MSITE-506/pom.xml
[INFO] ..SUCCESS (15.6 s)
[INFO] Building: MSITE-458/pom.xml
[INFO] ..SUCCESS (10.5 s)
[INFO] Building: no-version/pom.xml
[INFO] ..SUCCESS (7.1 s)
[INFO] Building: MSITE-627/pom.xml
[INFO] ..SKIPPED 
[INFO] Building: MSITE-322/pom.xml
[INFO] ..SUCCESS (7.2 s)
[INFO] Building: validate/pom.xml
[INFO] ..SUCCESS (6.8 s)
[INFO] Building: MSITE-312/pom.xml
[INFO] ..SUCCESS (5.8 s)
[INFO] Building: site-deploy/pom.xml
[INFO] ..SUCCESS (5.1 s)
[INFO] Building: top-parent-different-site/pom.xml
[INFO] ..SUCCESS (5.3 s)
[INFO] Building: MSITE-550/pom.xml
[INFO] ..SUCCESS (4.6 s)
[INFO] Building: MSITE-507/pom.xml
[INFO] ..FAILED (51.9 s)
[INFO]   The build exited with code 1. See /x1/jenkins/jenkins-slave/workspace/maven-site-plugin-3.x-m2/jdk/JDK
1.5 (latest)/label/Ubuntu/target/it/MSITE-507/build.log for details.
[INFO] Building: MSITE-159/pom.xml
[INFO] ..SUCCESS (5.4 s)
[INFO] Building: site-jar/pom.xml
[INFO] ..SUCCESS (5.1 s)
[INFO] Building: inheritedMenus/pom.xml
[INFO] ..SUCCESS (7.8 s)
[INFO] Building: MSITE-456/pom.xml
[INFO] ..SUCCESS (5.9 s)
[INFO] Building: site-inheritance/pom.xml
[INFO] ..SUCCESS (8.1 s)
[INFO] Building: MSITE-504/pom.xml
[INFO] ..SUCCESS (20.4 s)
[INFO] Building: MSITE-512/pom.xml
[INFO] ..SUCCESS (31.8 s)
[INFO] Building: top-parent-no-site/pom.xml
[INFO] ..SUCCESS (6.9 s)
[INFO] [invoker:verify {execution: integration-test}]
[INFO] -------------------------------------------------
[INFO] Build Summary:
[INFO]   Passed: 35, Failed: 1, Errors: 0, Skipped: 4
[INFO] -------------------------------------------------
[ERROR] The following builds failed:
[ERROR] *  MSITE-507/pom.xml
[INFO] -------------------------------------------------
[INFO] Error for project: Maven Site Plugin 3 (during verify)
[INFO] ------------------------------------------------------------------------
[INFO] : org.apache.maven.plugin.invoker.InvokerSession@1feea62
1 build failed.
[INFO] ------------------------------------------------------------------------
[INFO] Trace
org.apache.maven.BuildFailureException: 1 build failed.
	at org.apache.maven.lifecycle.DefaultLifecycleExecutor.executeGoals(DefaultLifecycleExecutor.java:715)
	at org.apache.maven.lifecycle.DefaultLifecycleExecutor.executeGoalWithLifecycle(DefaultLifecycleExecutor.java:556)
	at org.apache.maven.lifecycle.DefaultLifecycleExecutor.executeGoal(DefaultLifecycleExecutor.java:535)
	at org.apache.maven.lifecycle.DefaultLifecycleExecutor.executeGoalAndHandleFailures(DefaultLifecycleExecutor.java:387)
	at org.apache.maven.lifecycle.DefaultLifecycleExecutor.executeTaskSegments(DefaultLifecycleExecutor.java:348)
	at org.apache.maven.lifecycle.DefaultLifecycleExecutor.execute(DefaultLifecycleExecutor.java:180)
	at org.apache.maven.DefaultMaven.doExecute(DefaultMaven.java:328)
	at org.apache.maven.DefaultMaven.execute(DefaultMaven.java:138)
	at org.apache.maven.cli.MavenCli.main(MavenCli.java:362)
	at org.apache.maven.cli.compat.CompatibleMain.main(CompatibleMain.java:60)
	at sun.reflect.NativeMethodAccessorImpl.invoke0(Native Method)
	at sun.reflect.NativeMethodAccessorImpl.invoke(NativeMethodAccessorImpl.java:39)
	at sun.reflect.DelegatingMethodAccessorImpl.invoke(DelegatingMethodAccessorImpl.java:25)
	at java.lang.reflect.Method.invoke(Method.java:592)
	at org.codehaus.classworlds.Launcher.launchEnhanced(Launcher.java:315)
	at org.codehaus.classworlds.Launcher.launch(Launcher.java:255)
	at org.codehaus.classworlds.Launcher.mainWithExitCode(Launcher.java:430)
	at org.codehaus.classworlds.Launcher.main(Launcher.java:375)
Caused by: org.apache.maven.plugin.MojoFailureException: 1 build failed.
	at org.apache.maven.plugin.invoker.InvokerSession.handleFailures(InvokerSession.java:263)
	at org.apache.maven.plugin.invoker.VerifyMojo.execute(VerifyMojo.java:124)
	at org.apache.maven.plugin.DefaultPluginManager.executeMojo(DefaultPluginManager.java:490)
	at org.apache.maven.lifecycle.DefaultLifecycleExecutor.executeGoals(DefaultLifecycleExecutor.java:694)
	... 17 more
[INFO] ------------------------------------------------------------------------
[INFO] BUILD ERRORS
[INFO] ------------------------------------------------------------------------
[INFO] Total time: 6 minutes 13 seconds
[INFO] Finished at: Thu Apr 05 22:00:06 GMT 2012
[INFO] Final Memory: 52M/424M
[INFO] ------------------------------------------------------------------------
Build step 'Invoke top-level Maven targets' marked build as failure
[locks-and-latches] Releasing all the locks
[locks-and-latches] All the locks released

Mime
View raw message