maven-notifications mailing list archives

Site index · List index
Message view « Date » · « Thread »
Top « Date » · « Thread »
From Apache Jenkins Server <jenk...@builds.apache.org>
Subject Build failed in Jenkins: maven-plugins-ITs-m3 #397
Date Thu, 05 Apr 2012 23:47:31 GMT
See <https://builds.apache.org/job/maven-plugins-ITs-m3/397/changes>

Changes:

[dennisl] [MSITE-638] site.xml <custom> parameter and template variables not documented

------------------------------------------
[...truncated 9458 lines...]
[INFO] Building jar: <https://builds.apache.org/job/maven-plugins-ITs-m3/ws/maven-remote-resources-plugin/target/maven-remote-resources-plugin-1.3-SNAPSHOT.jar>
[INFO] 
[INFO] --- maven-plugin-plugin:2.8:addPluginArtifactMetadata (default-addPluginArtifactMetadata)
@ maven-remote-resources-plugin ---
[INFO] 
[INFO] --- maven-invoker-plugin:1.5:install (integration-test) @ maven-remote-resources-plugin
---
[INFO] Installing <https://builds.apache.org/job/maven-plugins-ITs-m3/ws/maven-remote-resources-plugin/pom.xml>
to <https://builds.apache.org/job/maven-plugins-ITs-m3/ws/maven-remote-resources-plugin/target/local-repo/org/apache/maven/plugins/maven-remote-resources-plugin/1.3-SNAPSHOT/maven-remote-resources-plugin-1.3-SNAPSHOT.pom>
[INFO] Installing <https://builds.apache.org/job/maven-plugins-ITs-m3/ws/maven-remote-resources-plugin/target/maven-remote-resources-plugin-1.3-SNAPSHOT.jar>
to <https://builds.apache.org/job/maven-plugins-ITs-m3/ws/maven-remote-resources-plugin/target/local-repo/org/apache/maven/plugins/maven-remote-resources-plugin/1.3-SNAPSHOT/maven-remote-resources-plugin-1.3-SNAPSHOT.jar>
[INFO] 
[INFO] --- maven-invoker-plugin:1.5:install (install-descriptor) @ maven-remote-resources-plugin
---
[INFO] Installing <https://builds.apache.org/job/maven-plugins-ITs-m3/ws/maven-remote-resources-plugin/pom.xml>
to <https://builds.apache.org/job/maven-plugins-ITs-m3/ws/maven-remote-resources-plugin/target/it-repo/org/apache/maven/plugins/maven-remote-resources-plugin/1.3-SNAPSHOT/maven-remote-resources-plugin-1.3-SNAPSHOT.pom>
[INFO] Installing <https://builds.apache.org/job/maven-plugins-ITs-m3/ws/maven-remote-resources-plugin/target/maven-remote-resources-plugin-1.3-SNAPSHOT.jar>
to <https://builds.apache.org/job/maven-plugins-ITs-m3/ws/maven-remote-resources-plugin/target/it-repo/org/apache/maven/plugins/maven-remote-resources-plugin/1.3-SNAPSHOT/maven-remote-resources-plugin-1.3-SNAPSHOT.jar>
[INFO] 
[INFO] --- maven-failsafe-plugin:2.9:integration-test (integration-tests) @ maven-remote-resources-plugin
---
[INFO] Failsafe report directory: <https://builds.apache.org/job/maven-plugins-ITs-m3/ws/maven-remote-resources-plugin/target/failsafe-reports>

-------------------------------------------------------
 T E S T S
-------------------------------------------------------
Running org.apache.maven.plugin.resources.remote.it.IT_GenerateFromOverride
[INFO] ..SUCCESS (7.2 s)
[INFO] Building: project-setup/pom.xml
Tests run: 1, Failures: 0, Errors: 1, Skipped: 0, Time elapsed: 6.532 sec <<< FAILURE!
Running org.apache.maven.plugin.resources.remote.it.IT_CustomFilterDelimiter
Tests run: 1, Failures: 0, Errors: 1, Skipped: 0, Time elapsed: 1.524 sec <<< FAILURE!
Running org.apache.maven.plugin.resources.remote.it.IT_RunOnlyAtExecutionRoot
[INFO] ..SUCCESS (10.1 s)
[INFO] Building: pom-filtering-reactor/pom.xml
Tests run: 1, Failures: 0, Errors: 1, Skipped: 0, Time elapsed: 5.686 sec <<< FAILURE!
Running org.apache.maven.plugin.resources.remote.it.IT_SupplementalArtifact
[INFO] ..SUCCESS (4.4 s)
[INFO] Building: skip-run/pom.xml
Tests run: 1, Failures: 0, Errors: 1, Skipped: 0, Time elapsed: 5.705 sec <<< FAILURE!
Running org.apache.maven.plugin.resources.remote.it.IT_GetDependencyProjects
[INFO] ..SUCCESS (2.7 s)
[INFO] Building: script-class-loading/pom.xml
Tests run: 1, Failures: 0, Errors: 1, Skipped: 0, Time elapsed: 5.218 sec <<< FAILURE!
Running org.apache.maven.plugin.resources.remote.it.IT_GenerateFromBundleWithTypeAndClassifier
Tests run: 1, Failures: 0, Errors: 1, Skipped: 0, Time elapsed: 1.49 sec <<< FAILURE!
Running org.apache.maven.plugin.resources.remote.it.IT_BadDependencyPoms
Tests run: 1, Failures: 0, Errors: 1, Skipped: 0, Time elapsed: 1.484 sec <<< FAILURE!
Running org.apache.maven.plugin.resources.remote.it.IT_GenerateFromBundle
[INFO] ..SUCCESS (7.4 s)
[INFO] Building: pom-less-invocation/pom.xml
Tests run: 1, Failures: 0, Errors: 1, Skipped: 0, Time elapsed: 1.52 sec <<< FAILURE!
Running org.apache.maven.plugin.resources.remote.it.IT_FilterLocalOverride
Tests run: 1, Failures: 0, Errors: 1, Skipped: 0, Time elapsed: 1.569 sec <<< FAILURE!

Results :

Tests in error: 
  test(org.apache.maven.plugin.resources.remote.it.IT_GenerateFromOverride): Exit code was
non-zero: 1; command line and log = 
  test(org.apache.maven.plugin.resources.remote.it.IT_CustomFilterDelimiter): Exit code was
non-zero: 1; command line and log = 
  test(org.apache.maven.plugin.resources.remote.it.IT_RunOnlyAtExecutionRoot): Exit code was
non-zero: 1; command line and log = 
  test(org.apache.maven.plugin.resources.remote.it.IT_SupplementalArtifact): Exit code was
non-zero: 1; command line and log = 
  test(org.apache.maven.plugin.resources.remote.it.IT_GetDependencyProjects): Exit code was
non-zero: 1; command line and log = 
  test(org.apache.maven.plugin.resources.remote.it.IT_GenerateFromBundleWithTypeAndClassifier):
Exit code was non-zero: 1; command line and log = 
  test(org.apache.maven.plugin.resources.remote.it.IT_BadDependencyPoms): Exit code was non-zero:
1; command line and log = 
  test(org.apache.maven.plugin.resources.remote.it.IT_GenerateFromBundle): Exit code was non-zero:
1; command line and log = 
  test(org.apache.maven.plugin.resources.remote.it.IT_FilterLocalOverride): Exit code was
non-zero: 1; command line and log = 

Tests run: 9, Failures: 0, Errors: 9, Skipped: 0

[WARNING] File encoding has not been set, using platform encoding ANSI_X3.4-1968, i.e. build
is platform dependent!
[INFO] 
[INFO] --- maven-invoker-plugin:1.5:integration-test (integration-test) @ maven-remote-resources-plugin
---
[INFO] Building: maven-remote-resources-test/pom.xml
[INFO] ..SUCCESS (3.0 s)
[INFO] Building: pom-filtering/pom.xml
[INFO] ..SUCCESS (4.6 s)
[INFO] 
[INFO] --- maven-failsafe-plugin:2.9:verify (integration-tests) @ maven-remote-resources-plugin
---
[INFO] Failsafe report directory: <https://builds.apache.org/job/maven-plugins-ITs-m3/ws/maven-remote-resources-plugin/target/failsafe-reports>
[WARNING] File encoding has not been set, using platform encoding ANSI_X3.4-1968, i.e. build
is platform dependent!
[INFO]                                                                         
[INFO] ------------------------------------------------------------------------
[INFO] Building Maven Plugins Aggregator 1-SNAPSHOT
[INFO] ------------------------------------------------------------------------
[WARNING] *****************************************************************
[WARNING] * Your build is requesting parallel execution, but project      *
[WARNING] * contains the following plugin(s) that are not marked as       *
[WARNING] * @threadSafe to support parallel building.                     *
[WARNING] * While this /may/ work fine, please look for plugin updates    *
[WARNING] * and/or request plugins be made thread-safe.                   *
[WARNING] * If reporting an issue, report it against the plugin in        *
[WARNING] * question, not against maven-core                              *
[WARNING] *****************************************************************
[WARNING] The following plugins are not marked @threadSafe in Maven Plugins Aggregator:
[WARNING] org.apache.maven.plugins:maven-remote-resources-plugin:1.1
[WARNING] *****************************************************************
[INFO] 
[INFO] --- maven-clean-plugin:2.4.1:clean (default-clean) @ maven-plugins-aggregator ---
[INFO] Deleting <https://builds.apache.org/job/maven-plugins-ITs-m3/ws/target>
[INFO] 
[INFO] --- maven-remote-resources-plugin:1.1:process (default) @ maven-plugins-aggregator
---
[INFO] 
[INFO] --- maven-install-plugin:2.3.1:install (default-install) @ maven-plugins-aggregator
---
[INFO] Installing <https://builds.apache.org/job/maven-plugins-ITs-m3/ws/pom.xml> to
<https://builds.apache.org/job/maven-plugins-ITs-m3/ws/.repository/org/apache/maven/plugins/maven-plugins-aggregator/1-SNAPSHOT/maven-plugins-aggregator-1-SNAPSHOT.pom>
[INFO] ..SUCCESS (11.6 s)
[INFO] Building: invocation-project/pom.xml
[INFO] ..SUCCESS (6.2 s)
[INFO] Building: script-classpath-duplicates/pom.xml
[INFO] ..SUCCESS (6.6 s)
[INFO] Building: staging-dependencies/pom.xml
[INFO] ..SUCCESS (5.0 s)
[INFO] Building: fail-ignore-with-verify/pom.xml
[INFO] ..SUCCESS (69.5 s)
[INFO] Building: new-configuration/pom.xml
[INFO] ..SUCCESS (4.1 s)
[INFO] Building: staging-reactor/pom.xml
[INFO] ..SUCCESS (5.5 s)
[INFO] Building: fail-build/pom.xml
[INFO] ..SUCCESS (4.1 s)
[INFO] Building: local-repo-default/pom.xml
[INFO] ..SUCCESS (12.2 s)
[INFO] Building: top-parent-different-site/pom.xml
[INFO] ..SUCCESS (5.7 s)
[INFO] Building: staging-pom/pom.xml
[INFO] ..SUCCESS (5.5 s)
[INFO] Building: MSITE-265/pom.xml
[INFO] ..SUCCESS (2.9 s)
[INFO] Building: settings-auto-exclude/pom.xml
[INFO] ..SUCCESS (4.2 s)
[INFO] Building: local-repo-isolated/pom.xml
[INFO] ..SUCCESS (4.9 s)
[INFO] Building: script-global-vars/pom.xml
[INFO] ..SUCCESS (11.1 s)
[INFO] Building: validate/pom.xml
[INFO] ..SUCCESS (5.0 s)
[INFO] Building: site-skip/pom.xml
[INFO] ..SUCCESS (6.5 s)
[INFO] Building: invoker-report/pom.xml
[INFO] ..SUCCESS (5.4 s)
[INFO] Building: site-inheritance/pom.xml
[INFO] ..SUCCESS (9.7 s)
[INFO] Building: MSITE-322/pom.xml
[INFO] ..SUCCESS (19.0 s)
[INFO] Building: pom-filtering-encoding/pom.xml
[INFO] ..SUCCESS (8.6 s)
[INFO] Building: surefire-report/pom.xml
[INFO] ..SUCCESS (6.0 s)
[INFO] -------------------------------------------------
[INFO] Build Summary:
[INFO]   Passed: 40, Failed: 0, Errors: 0, Skipped: 0
[INFO] -------------------------------------------------
[INFO] 
[INFO] --- maven-install-plugin:2.3.1:install (default-install) @ maven-invoker-plugin ---
[INFO] Installing <https://builds.apache.org/job/maven-plugins-ITs-m3/ws/maven-invoker-plugin/target/maven-invoker-plugin-1.6-SNAPSHOT.jar>
to <https://builds.apache.org/job/maven-plugins-ITs-m3/ws/.repository/org/apache/maven/plugins/maven-invoker-plugin/1.6-SNAPSHOT/maven-invoker-plugin-1.6-SNAPSHOT.jar>
[INFO] Installing <https://builds.apache.org/job/maven-plugins-ITs-m3/ws/maven-invoker-plugin/pom.xml>
to <https://builds.apache.org/job/maven-plugins-ITs-m3/ws/.repository/org/apache/maven/plugins/maven-invoker-plugin/1.6-SNAPSHOT/maven-invoker-plugin-1.6-SNAPSHOT.pom>
[INFO] ..SUCCESS (7.5 s)
[INFO] Building: MSITE-566/pom.xml
[INFO] ..SUCCESS (4.0 s)
[INFO] Building: MSITE-456/pom.xml
[INFO] ..SUCCESS (5.3 s)
[INFO] Building: MSITE-304/pom.xml
[INFO] ..SUCCESS (7.2 s)
[INFO] Building: MSITE-627/pom.xml
[INFO] ..SUCCESS (14.6 s)
[INFO] Building: MSITE-609/pom.xml
[INFO] ..SUCCESS (5.9 s)
[INFO] Building: MSITE-512/pom.xml
[INFO] ..SUCCESS (9.4 s)
[INFO] Building: MSITE-458/pom.xml
[INFO] ..SUCCESS (11.9 s)
[INFO] Building: MSITE-550/pom.xml
[INFO] ..SUCCESS (3.8 s)
[INFO] 
[INFO] --- maven-invoker-plugin:1.5:verify (integration-test) @ maven-site-plugin ---
[INFO] -------------------------------------------------
[INFO] Build Summary:
[INFO]   Passed: 39, Failed: 0, Errors: 0, Skipped: 1
[INFO] -------------------------------------------------
[INFO] 
[INFO] --- maven-install-plugin:2.3.1:install (default-install) @ maven-site-plugin ---
[INFO] Installing <https://builds.apache.org/job/maven-plugins-ITs-m3/ws/maven-site-plugin/target/maven-site-plugin-3.1-SNAPSHOT.jar>
to <https://builds.apache.org/job/maven-plugins-ITs-m3/ws/.repository/org/apache/maven/plugins/maven-site-plugin/3.1-SNAPSHOT/maven-site-plugin-3.1-SNAPSHOT.jar>
[INFO] Installing <https://builds.apache.org/job/maven-plugins-ITs-m3/ws/maven-site-plugin/dependency-reduced-pom.xml>
to <https://builds.apache.org/job/maven-plugins-ITs-m3/ws/.repository/org/apache/maven/plugins/maven-site-plugin/3.1-SNAPSHOT/maven-site-plugin-3.1-SNAPSHOT.pom>
[INFO] ------------------------------------------------------------------------
[INFO] Reactor Summary:
[INFO] 
[INFO] Maven Plugins ..................................... SUCCESS [6.268s]
[INFO] Maven ACR Plugin .................................. SUCCESS [1:09.429s]
[INFO] Maven Ant Plugin .................................. SUCCESS [2:42.708s]
[INFO] Maven AntRun Plugin ............................... SUCCESS [1:53.316s]
[INFO] Maven Eclipse Plugin .............................. SUCCESS [13:09.132s]
[INFO] Maven Assembly Plugin ............................. SUCCESS [14:43.660s]
[INFO] Maven Changelog Plugin ............................ SUCCESS [1:33.727s]
[INFO] Maven Changes Report Plugin ....................... SUCCESS [1:18.689s]
[INFO] Maven Checkstyle Plugin ........................... SUCCESS [2:05.608s]
[INFO] Maven Clean Plugin ................................ SUCCESS [29.827s]
[INFO] Maven Compiler Plugin ............................. SUCCESS [26.145s]
[INFO] Maven Dependency Plugin ........................... SUCCESS [2:33.904s]
[INFO] Maven Deploy Plugin ............................... SUCCESS [1:50.145s]
[INFO] Maven DOAP Plugin ................................. SUCCESS [25.487s]
[INFO] Maven Documentation Checker Plugin ................ SUCCESS [8.568s]
[INFO] Maven EAR Plugin .................................. SUCCESS [4:15.184s]
[INFO] Maven EJB Plugin .................................. SUCCESS [31.396s]
[INFO] Maven GPG Plugin .................................. SUCCESS [1:01.823s]
[INFO] Maven Help Plugin ................................. SUCCESS [47.821s]
[INFO] Maven IDEA Plugin ................................. SUCCESS [8.201s]
[INFO] Maven Install Plugin .............................. SUCCESS [1:03.908s]
[INFO] Maven JAR Plugin .................................. SUCCESS [1:28.304s]
[INFO] Maven Jarsigner Plugin ............................ SUCCESS [46.574s]
[INFO] Maven Javadoc Plugin .............................. FAILURE [10:05.344s]
[INFO] Maven Linkcheck Plugin ............................ SUCCESS [2.017s]
[INFO] Maven One Plugin .................................. SUCCESS [3.208s]
[INFO] Maven Patch Plugin ................................ SUCCESS [13.598s]
[INFO] Maven PDF Plugin .................................. SUCCESS [52.115s]
[INFO] Maven PMD Plugin .................................. SUCCESS [1:13.046s]
[INFO] Maven RAR Plugin .................................. SUCCESS [8.307s]
[INFO] Maven Reactor Plugin .............................. SUCCESS [2.476s]
[INFO] Maven Repository Plugin ........................... FAILURE [24.508s]
[INFO] Maven Resources Plugin ............................ SUCCESS [1:20.010s]
[INFO] Maven Shade Plugin ................................ SUCCESS [4:24.126s]
[INFO] Maven Site Plugin 3 ............................... SUCCESS [12:23.884s]
[INFO] Maven Source Plugin ............................... SUCCESS [35.495s]
[INFO] Maven Stage Plugin ................................ SUCCESS [1.942s]
[INFO] Maven Toolchains Plugin ........................... SUCCESS [1.393s]
[INFO] Maven Verifier Plugin ............................. SUCCESS [11.891s]
[INFO] Maven WAR Plugin .................................. SUCCESS [1:30.503s]
[INFO] Maven Invoker Plugin .............................. SUCCESS [5:38.261s]
[INFO] Maven Project Info Reports Plugin ................. SUCCESS [2:17.068s]
[INFO] Maven Remote Resources Plugin ..................... FAILURE [44.396s]
[INFO] Maven Plugins Aggregator .......................... SUCCESS [0.107s]
[INFO] ------------------------------------------------------------------------
[INFO] BUILD FAILURE
[INFO] ------------------------------------------------------------------------
[INFO] Total time: 33:35.135s (Wall Clock)
[INFO] Finished at: Thu Apr 05 23:47:30 UTC 2012
[INFO] Final Memory: 65M/979M
[INFO] ------------------------------------------------------------------------
[WARNING] The requested profile "apache.snapshots" could not be activated because it does
not exist.
[ERROR] Failed to execute goal org.apache.maven.plugins:maven-surefire-plugin:2.9:test (integration-tests)
on project maven-repository-plugin: There are test failures.
[ERROR] 
[ERROR] Please refer to <https://builds.apache.org/job/maven-plugins-ITs-m3/ws/maven-repository-plugin/target/surefire-reports>
for the individual test results.
[ERROR] -> [Help 1]
[ERROR] Failed to execute goal org.apache.maven.plugins:maven-invoker-plugin:1.5:verify (integration-test)
on project maven-javadoc-plugin: 1 build failed. -> [Help 1]
[ERROR] Failed to execute goal org.apache.maven.plugins:maven-failsafe-plugin:2.9:verify (integration-tests)
on project maven-remote-resources-plugin: There are test failures.
[ERROR] 
[ERROR] Please refer to <https://builds.apache.org/job/maven-plugins-ITs-m3/ws/maven-remote-resources-plugin/target/failsafe-reports>
for the individual test results.
[ERROR] -> [Help 1]
[ERROR] 
[ERROR] To see the full stack trace of the errors, re-run Maven with the -e switch.
[ERROR] Re-run Maven using the -X switch to enable full debug logging.
[ERROR] 
[ERROR] For more information about the errors and possible solutions, please read the following
articles:
[ERROR] [Help 1] http://cwiki.apache.org/confluence/display/MAVEN/MojoFailureException
[ERROR] 
[ERROR] After correcting the problems, you can resume the build with the command
[ERROR]   mvn <goals> -rf :maven-repository-plugin
Build step 'Invoke top-level Maven targets' marked build as failure

Mime
View raw message