maven-notifications mailing list archives

Site index · List index
Message view « Date » · « Thread »
Top « Date » · « Thread »
From Apache Jenkins Server <jenk...@builds.apache.org>
Subject Build failed in Jenkins: doxia-sitetools » JDK 1.5 (latest),Windows #115
Date Sat, 07 Apr 2012 23:39:19 GMT
See <https://builds.apache.org/job/doxia-sitetools/./jdk=JDK%201.5%20(latest),label=Windows/115/changes>

Changes:

[dennisl] Improve the documentation of the properties that are available in the Velocity context.

------------------------------------------
[...truncated 100 lines...]
Tests run: 5, Failures: 0, Errors: 0, Skipped: 0, Time elapsed: 0.003 sec

Results :

Tests run: 61, Failures: 0, Errors: 0, Skipped: 0

[INFO] [jar:jar {execution: default-jar}]
[INFO] Building jar: F:\hudson\hudson-slave\workspace\doxia-sitetools\jdk\JDK 1.5 (latest)\label\Windows\doxia-decoration-model\target\doxia-decoration-model-1.3-SNAPSHOT.jar
[INFO] Preparing clirr:check
[WARNING] Removing: check from forked lifecycle, to prevent recursive invocation.
[INFO] [modello:xpp3-writer {execution: descriptor}]
[INFO] outputDirectory: F:\hudson\hudson-slave\workspace\doxia-sitetools\jdk\JDK 1.5 (latest)\label\Windows\doxia-decoration-model\target\generated-sources\modello
[INFO] Working on model: src/main/mdo/decoration.mdo
[INFO] Generating current version: 1.3.0
[INFO] [modello:java {execution: descriptor}]
[INFO] outputDirectory: F:\hudson\hudson-slave\workspace\doxia-sitetools\jdk\JDK 1.5 (latest)\label\Windows\doxia-decoration-model\target\generated-sources\modello
[INFO] Working on model: src/main/mdo/decoration.mdo
[INFO] Generating current version: 1.3.0
[INFO] [modello:xpp3-reader {execution: descriptor}]
[INFO] outputDirectory: F:\hudson\hudson-slave\workspace\doxia-sitetools\jdk\JDK 1.5 (latest)\label\Windows\doxia-decoration-model\target\generated-sources\modello
[INFO] Working on model: src/main/mdo/decoration.mdo
[INFO] Generating current version: 1.3.0
[INFO] [modello:xsd {execution: descriptor}]
[INFO] outputDirectory: F:\hudson\hudson-slave\workspace\doxia-sitetools\jdk\JDK 1.5 (latest)\label\Windows\doxia-decoration-model\target\generated-site\xsd
[INFO] Working on model: src/main/mdo/decoration.mdo
[INFO] Generating current version: 1.3.0
[INFO] [remote-resources:process {execution: default}]
[debug] execute contextualize
[INFO] [resources:resources {execution: default-resources}]
[INFO] Using 'UTF-8' encoding to copy filtered resources.
[INFO] skip non existing resourceDirectory F:\hudson\hudson-slave\workspace\doxia-sitetools\jdk\JDK
1.5 (latest)\label\Windows\doxia-decoration-model\src\main\resources
[INFO] Copying 1 resource
[INFO] Copying 3 resources
[INFO] Copying 3 resources
[INFO] [compiler:compile {execution: default-compile}]
[INFO] Compiling 12 source files to F:\hudson\hudson-slave\workspace\doxia-sitetools\jdk\JDK
1.5 (latest)\label\Windows\doxia-decoration-model\target\classes
[INFO] [clirr:check {execution: default}]
[INFO] Comparing to version: 1.1
[INFO] Succeeded with 0 errors; 0 warnings; and 0 other changes.
[INFO] [install:install {execution: default-install}]
[INFO] Installing F:\hudson\hudson-slave\workspace\doxia-sitetools\jdk\JDK 1.5 (latest)\label\Windows\doxia-decoration-model\target\doxia-decoration-model-1.3-SNAPSHOT.jar
to C:\Users\hudson\.m2\repository\org\apache\maven\doxia\doxia-decoration-model\1.3-SNAPSHOT\doxia-decoration-model-1.3-SNAPSHOT.jar
[INFO] [deploy:deploy {execution: default-deploy}]
[INFO] Retrieving previous build number from apache.snapshots.https
Uploading: https://repository.apache.org/content/repositories/snapshots/org/apache/maven/doxia/doxia-decoration-model/1.3-SNAPSHOT/doxia-decoration-model-1.3-20120407.233835-13.jar
59K uploaded  (doxia-decoration-model-1.3-20120407.233835-13.jar)
[INFO] Retrieving previous metadata from apache.snapshots.https
[INFO] Uploading repository metadata for: 'snapshot org.apache.maven.doxia:doxia-decoration-model:1.3-SNAPSHOT'
[INFO] Retrieving previous metadata from apache.snapshots.https
[INFO] Uploading repository metadata for: 'artifact org.apache.maven.doxia:doxia-decoration-model'
[INFO] Uploading project information for doxia-decoration-model 1.3-20120407.233835-13
[INFO] ------------------------------------------------------------------------
[INFO] Building Document Renderer
[INFO]    task-segment: [clean, deploy]
[INFO] ------------------------------------------------------------------------
[INFO] [clean:clean {execution: default-clean}]
[INFO] Deleting F:\hudson\hudson-slave\workspace\doxia-sitetools\jdk\JDK 1.5 (latest)\label\Windows\doxia-doc-renderer\target
[INFO] [remote-resources:process {execution: default}]
[INFO] snapshot org.apache.maven.doxia:doxia-core:1.3-SNAPSHOT: checking for updates from
apache.snapshots
[INFO] snapshot org.apache.maven.doxia:doxia:1.3-SNAPSHOT: checking for updates from apache.snapshots
[INFO] snapshot org.apache.maven.doxia:doxia-sink-api:1.3-SNAPSHOT: checking for updates from
apache.snapshots
[INFO] snapshot org.apache.maven.doxia:doxia-logging-api:1.3-SNAPSHOT: checking for updates
from apache.snapshots
[INFO] snapshot org.apache.maven.doxia:doxia-module-itext:1.3-SNAPSHOT: checking for updates
from apache.snapshots
[INFO] snapshot org.apache.maven.doxia:doxia-modules:1.3-SNAPSHOT: checking for updates from
apache.snapshots
[INFO] snapshot org.apache.maven.doxia:doxia-module-fo:1.3-SNAPSHOT: checking for updates
from apache.snapshots
[INFO] snapshot org.apache.maven.doxia:doxia-module-apt:1.3-SNAPSHOT: checking for updates
from apache.snapshots
[INFO] snapshot org.apache.maven.doxia:doxia-module-fml:1.3-SNAPSHOT: checking for updates
from apache.snapshots
[INFO] snapshot org.apache.maven.doxia:doxia-module-xdoc:1.3-SNAPSHOT: checking for updates
from apache.snapshots
[INFO] snapshot org.apache.maven.doxia:doxia-module-xhtml:1.3-SNAPSHOT: checking for updates
from apache.snapshots
[debug] execute contextualize
[INFO] [resources:resources {execution: default-resources}]
[INFO] Using 'UTF-8' encoding to copy filtered resources.
[INFO] Copying 1 resource
[INFO] skip non existing resourceDirectory F:\hudson\hudson-slave\workspace\doxia-sitetools\jdk\JDK
1.5 (latest)\label\Windows\doxia-doc-renderer\target\generated-site\xsd
[INFO] Copying 3 resources
[INFO] [compiler:compile {execution: default-compile}]
[INFO] Compiling 14 source files to F:\hudson\hudson-slave\workspace\doxia-sitetools\jdk\JDK
1.5 (latest)\label\Windows\doxia-doc-renderer\target\classes
[INFO] [plexus:descriptor {execution: default}]
[INFO] Discovered 4 component descriptors(s)
[debug] execute contextualize
[INFO] [resources:testResources {execution: default-testResources}]
[INFO] Using 'UTF-8' encoding to copy filtered resources.
[INFO] Copying 13 resources
[INFO] Copying 3 resources
[INFO] [compiler:testCompile {execution: default-testCompile}]
[INFO] Compiling 1 source file to F:\hudson\hudson-slave\workspace\doxia-sitetools\jdk\JDK
1.5 (latest)\label\Windows\doxia-doc-renderer\target\test-classes
[WARNING] DEPRECATED [systemProperties]: Use systemPropertyVariables instead.
[INFO] [surefire:test {execution: default-test}]
[INFO] Surefire report directory: F:\hudson\hudson-slave\workspace\doxia-sitetools\jdk\JDK
1.5 (latest)\label\Windows\doxia-doc-renderer\target\surefire-reports

-------------------------------------------------------
 T E S T S
-------------------------------------------------------
Running org.apache.maven.doxia.docrenderer.DocumentRendererTest
[WARNING] [iText Sink] Modified invalid link: 'Frequently Asked Questions_How_to_export_in_PDF'
to 'Frequently_Asked_Questions_How_to_export_in_PDF'
[WARNING] [iText Sink] Modified invalid link: 'Frequently Asked Questions_How_to_handle_style_in_the_APT_markup_language'
to 'Frequently_Asked_Questions_How_to_handle_style_in_the_APT_markup_language'
[WARNING] [iText Sink] Modified invalid link: 'Frequently Asked Questions_Is_it_possible_to_create_a_book'
to 'Frequently_Asked_Questions_Is_it_possible_to_create_a_book'
[WARNING] [iText Sink] Modified invalid link: 'Frequently Asked Questions_top' to 'Frequently_Asked_Questions_top'
[WARNING] [iText Sink] Modified invalid link: 'Frequently Asked Questions_How_to_export_in_PDF'
to 'Frequently_Asked_Questions_How_to_export_in_PDF'
[WARNING] [iText Sink] Modified invalid link: 'Frequently Asked Questions_How_to_handle_style_in_the_APT_markup_language'
to 'Frequently_Asked_Questions_How_to_handle_style_in_the_APT_markup_language'
[WARNING] [iText Sink] Modified invalid link: 'Frequently Asked Questions_Is_it_possible_to_create_a_book'
to 'Frequently_Asked_Questions_Is_it_possible_to_create_a_book'
[WARNING] [iText Sink] Modified invalid link: 'Frequently Asked Questions_top' to 'Frequently_Asked_Questions_top'
Tests run: 4, Failures: 0, Errors: 0, Skipped: 0, Time elapsed: 7.589 sec

Results :

Tests run: 4, Failures: 0, Errors: 0, Skipped: 0

[INFO] [jar:jar {execution: default-jar}]
[INFO] Building jar: F:\hudson\hudson-slave\workspace\doxia-sitetools\jdk\JDK 1.5 (latest)\label\Windows\doxia-doc-renderer\target\doxia-doc-renderer-1.3-SNAPSHOT.jar
[INFO] Preparing clirr:check
[WARNING] Removing: check from forked lifecycle, to prevent recursive invocation.
[INFO] [remote-resources:process {execution: default}]
[debug] execute contextualize
[INFO] [resources:resources {execution: default-resources}]
[INFO] Using 'UTF-8' encoding to copy filtered resources.
[INFO] Copying 1 resource
[INFO] skip non existing resourceDirectory F:\hudson\hudson-slave\workspace\doxia-sitetools\jdk\JDK
1.5 (latest)\label\Windows\doxia-doc-renderer\target\generated-site\xsd
[INFO] Copying 3 resources
[INFO] Copying 3 resources
[INFO] [compiler:compile {execution: default-compile}]
[INFO] Nothing to compile - all classes are up to date
[INFO] [clirr:check {execution: default}]
[INFO] Comparing to version: 1.1
[INFO] Succeeded with 0 errors; 0 warnings; and 0 other changes.
[INFO] [install:install {execution: default-install}]
[INFO] Installing F:\hudson\hudson-slave\workspace\doxia-sitetools\jdk\JDK 1.5 (latest)\label\Windows\doxia-doc-renderer\target\doxia-doc-renderer-1.3-SNAPSHOT.jar
to C:\Users\hudson\.m2\repository\org\apache\maven\doxia\doxia-doc-renderer\1.3-SNAPSHOT\doxia-doc-renderer-1.3-SNAPSHOT.jar
[INFO] [deploy:deploy {execution: default-deploy}]
[INFO] Retrieving previous build number from apache.snapshots.https
Uploading: https://repository.apache.org/content/repositories/snapshots/org/apache/maven/doxia/doxia-doc-renderer/1.3-SNAPSHOT/doxia-doc-renderer-1.3-20120407.233835-12.jar
45K uploaded  (doxia-doc-renderer-1.3-20120407.233835-12.jar)
[INFO] Retrieving previous metadata from apache.snapshots.https
[INFO] Uploading repository metadata for: 'artifact org.apache.maven.doxia:doxia-doc-renderer'
[INFO] Uploading project information for doxia-doc-renderer 1.3-20120407.233835-12
[INFO] Retrieving previous metadata from apache.snapshots.https
[INFO] Uploading repository metadata for: 'snapshot org.apache.maven.doxia:doxia-doc-renderer:1.3-SNAPSHOT'
[INFO] ------------------------------------------------------------------------
[INFO] Building Site Renderer
[INFO]    task-segment: [clean, deploy]
[INFO] ------------------------------------------------------------------------
[INFO] [clean:clean {execution: default-clean}]
[INFO] Deleting F:\hudson\hudson-slave\workspace\doxia-sitetools\jdk\JDK 1.5 (latest)\label\Windows\doxia-site-renderer\target
[INFO] [remote-resources:process {execution: default}]
[INFO] snapshot org.apache.maven.doxia:doxia-module-confluence:1.3-SNAPSHOT: checking for
updates from apache.snapshots
[INFO] snapshot org.apache.maven.doxia:doxia-module-docbook-simple:1.3-SNAPSHOT: checking
for updates from apache.snapshots
[debug] execute contextualize
[INFO] [resources:resources {execution: default-resources}]
[INFO] Using 'UTF-8' encoding to copy filtered resources.
[INFO] Copying 22 resources
[INFO] skip non existing resourceDirectory F:\hudson\hudson-slave\workspace\doxia-sitetools\jdk\JDK
1.5 (latest)\label\Windows\doxia-site-renderer\target\generated-site\xsd
[INFO] Copying 3 resources
[INFO] [compiler:compile {execution: default-compile}]
[INFO] Compiling 8 source files to F:\hudson\hudson-slave\workspace\doxia-sitetools\jdk\JDK
1.5 (latest)\label\Windows\doxia-site-renderer\target\classes
[debug] execute contextualize
[INFO] [resources:testResources {execution: default-testResources}]
[INFO] Using 'UTF-8' encoding to copy filtered resources.
[INFO] Copying 46 resources
[INFO] Copying 3 resources
[INFO] [compiler:testCompile {execution: default-testCompile}]
[INFO] Compiling 12 source files to F:\hudson\hudson-slave\workspace\doxia-sitetools\jdk\JDK
1.5 (latest)\label\Windows\doxia-site-renderer\target\test-classes
[INFO] [surefire:test {execution: default-test}]
[INFO] Surefire report directory: F:\hudson\hudson-slave\workspace\doxia-sitetools\jdk\JDK
1.5 (latest)\label\Windows\doxia-site-renderer\target\surefire-reports

-------------------------------------------------------
 T E S T S
-------------------------------------------------------
Running org.apache.maven.doxia.siterenderer.DefaultSiteRendererTest
[WARNING] [XHTML Sink] No HTML tag found for unknown event: 'note', ignoring!
[WARNING] [XHTML Sink] No HTML tag found for unknown event: 'sidebar', ignoring!
[WARNING] [APT Parser] Ambiguous link: 'cdc.html'. If this is a local link, prepend "./"!
Apr 8, 2012 12:39:14 AM com.gargoylesoftware.htmlunit.javascript.host.Stylesheet loadStylesheet
SEVERE: F:\hudson\hudson-slave\workspace\doxia-sitetools\jdk\JDK 1.5 (latest)\label\Windows\doxia-site-renderer\target\output\css\maven-theme.css
(The system cannot find the file specified)
Apr 8, 2012 12:39:14 AM com.gargoylesoftware.htmlunit.javascript.host.Stylesheet loadStylesheet
SEVERE: F:\hudson\hudson-slave\workspace\doxia-sitetools\jdk\JDK 1.5 (latest)\label\Windows\doxia-site-renderer\target\output\css\maven-theme.css
(The system cannot find the file specified)
Apr 8, 2012 12:39:14 AM com.gargoylesoftware.htmlunit.javascript.host.Stylesheet loadStylesheet
SEVERE: F:\hudson\hudson-slave\workspace\doxia-sitetools\jdk\JDK 1.5 (latest)\label\Windows\doxia-site-renderer\target\output\css\maven-theme.css
(The system cannot find the file specified)
Apr 8, 2012 12:39:15 AM com.gargoylesoftware.htmlunit.javascript.host.Stylesheet loadStylesheet
SEVERE: F:\hudson\hudson-slave\workspace\doxia-sitetools\jdk\JDK 1.5 (latest)\label\Windows\doxia-site-renderer\target\output\css\maven-theme.css
(The system cannot find the file specified)
Apr 8, 2012 12:39:15 AM com.gargoylesoftware.htmlunit.javascript.host.Stylesheet loadStylesheet
SEVERE: F:\hudson\hudson-slave\workspace\doxia-sitetools\jdk\JDK 1.5 (latest)\label\Windows\doxia-site-renderer\target\output\css\maven-theme.css
(The system cannot find the file specified)
Apr 8, 2012 12:39:15 AM com.gargoylesoftware.htmlunit.javascript.host.Stylesheet loadStylesheet
SEVERE: F:\hudson\hudson-slave\workspace\doxia-sitetools\jdk\JDK 1.5 (latest)\label\Windows\doxia-site-renderer\target\output\css\maven-theme.css
(The system cannot find the file specified)
Apr 8, 2012 12:39:15 AM com.gargoylesoftware.htmlunit.javascript.host.Stylesheet loadStylesheet
SEVERE: F:\hudson\hudson-slave\workspace\doxia-sitetools\jdk\JDK 1.5 (latest)\label\Windows\doxia-site-renderer\target\output\css\maven-theme.css
(The system cannot find the file specified)
Tests run: 4, Failures: 0, Errors: 1, Skipped: 0, Time elapsed: 9.139 sec <<< FAILURE!

Results :

Tests in error: 
  testVelocityToolManager(org.apache.maven.doxia.siterenderer.DefaultSiteRendererTest): File
F:\hudson\hudson-slave\workspace\doxia-sitetools\jdk\JDK 1.5 (latest)\label\Windows\doxia-site-renderer\target\output\apt.html
unable to be deleted.

Tests run: 4, Failures: 0, Errors: 1, Skipped: 0

[INFO] 
[INFO] 
[INFO] ------------------------------------------------------------------------
[INFO] Reactor Summary:
[INFO] ------------------------------------------------------------------------
[INFO] Doxia Sitetools ....................................... SUCCESS [10.469s]
[INFO] Decoration Model ...................................... SUCCESS [9.987s]
[INFO] Document Renderer ..................................... SUCCESS [16.246s]
[INFO] Site Renderer ......................................... FAILED [14.026s]
[INFO] ------------------------------------------------------------------------
[INFO] Error for project: Site Renderer (during deploy)
[INFO] ------------------------------------------------------------------------
[INFO] There are test failures.

Please refer to F:\hudson\hudson-slave\workspace\doxia-sitetools\jdk\JDK 1.5 (latest)\label\Windows\doxia-site-renderer\target\surefire-reports
for the individual test results.
[INFO] ------------------------------------------------------------------------
[INFO] Trace
org.apache.maven.BuildFailureException: There are test failures.

Please refer to F:\hudson\hudson-slave\workspace\doxia-sitetools\jdk\JDK 1.5 (latest)\label\Windows\doxia-site-renderer\target\surefire-reports
for the individual test results.
	at org.apache.maven.lifecycle.DefaultLifecycleExecutor.executeGoals(DefaultLifecycleExecutor.java:715)
	at org.apache.maven.lifecycle.DefaultLifecycleExecutor.executeGoalWithLifecycle(DefaultLifecycleExecutor.java:556)
	at org.apache.maven.lifecycle.DefaultLifecycleExecutor.executeGoal(DefaultLifecycleExecutor.java:535)
	at org.apache.maven.lifecycle.DefaultLifecycleExecutor.executeGoalAndHandleFailures(DefaultLifecycleExecutor.java:387)
	at org.apache.maven.lifecycle.DefaultLifecycleExecutor.executeTaskSegments(DefaultLifecycleExecutor.java:348)
	at org.apache.maven.lifecycle.DefaultLifecycleExecutor.execute(DefaultLifecycleExecutor.java:180)
	at org.apache.maven.DefaultMaven.doExecute(DefaultMaven.java:328)
	at org.apache.maven.DefaultMaven.execute(DefaultMaven.java:138)
	at org.apache.maven.cli.MavenCli.main(MavenCli.java:362)
	at org.apache.maven.cli.compat.CompatibleMain.main(CompatibleMain.java:60)
	at sun.reflect.NativeMethodAccessorImpl.invoke0(Native Method)
	at sun.reflect.NativeMethodAccessorImpl.invoke(NativeMethodAccessorImpl.java:39)
	at sun.reflect.DelegatingMethodAccessorImpl.invoke(DelegatingMethodAccessorImpl.java:25)
	at java.lang.reflect.Method.invoke(Method.java:592)
	at org.codehaus.classworlds.Launcher.launchEnhanced(Launcher.java:315)
	at org.codehaus.classworlds.Launcher.launch(Launcher.java:255)
	at org.codehaus.classworlds.Launcher.mainWithExitCode(Launcher.java:430)
	at org.codehaus.classworlds.Launcher.main(Launcher.java:375)
Caused by: org.apache.maven.plugin.MojoFailureException: There are test failures.

Please refer to F:\hudson\hudson-slave\workspace\doxia-sitetools\jdk\JDK 1.5 (latest)\label\Windows\doxia-site-renderer\target\surefire-reports
for the individual test results.
	at org.apache.maven.plugin.surefire.SurefireHelper.reportExecution(SurefireHelper.java:87)
	at org.apache.maven.plugin.surefire.SurefirePlugin.writeSummary(SurefirePlugin.java:631)
	at org.apache.maven.plugin.surefire.SurefirePlugin.handleSummary(SurefirePlugin.java:605)
	at org.apache.maven.plugin.surefire.AbstractSurefireMojo.executeAfterPreconditionsChecked(AbstractSurefireMojo.java:136)
	at org.apache.maven.plugin.surefire.AbstractSurefireMojo.execute(AbstractSurefireMojo.java:97)
	at org.apache.maven.plugin.DefaultPluginManager.executeMojo(DefaultPluginManager.java:490)
	at org.apache.maven.lifecycle.DefaultLifecycleExecutor.executeGoals(DefaultLifecycleExecutor.java:694)
	... 17 more
[INFO] ------------------------------------------------------------------------
[INFO] BUILD ERRORS
[INFO] ------------------------------------------------------------------------
[INFO] Total time: 51 seconds
[INFO] Finished at: Sun Apr 08 00:39:17 BST 2012
[INFO] Final Memory: 102M/308M
[INFO] ------------------------------------------------------------------------
Build step 'Invoke top-level Maven targets' marked build as failure

Mime
View raw message