maven-notifications mailing list archives

Site index · List index
Message view « Date » · « Thread »
Top « Date » · « Thread »
From Apache Jenkins Server <jenk...@builds.apache.org>
Subject Build failed in Jenkins: maven-plugins #615
Date Thu, 09 Feb 2012 00:05:59 GMT
See <https://builds.apache.org/job/maven-plugins/615/changes>

Changes:

[dennisl] [MCHANGELOG-114] add standard skip configuration option

[dennisl] [MCHANGELOG-110] use ${project.reporting.outputEncoding} as default value for "outputEncoding"
parameter and default to UTF-8

[dennisl] Add checks to the ITs for the encoding attribute in the generated changelog-xml
files.

------------------------------------------
[...truncated 6339 lines...]
[WARNING] Javadoc Warnings
[WARNING] javadoc: warning - Multiple sources of package comments found for package "resources.test"
[WARNING] JDK 6.0 or more is required to run javadoc for 'org.apache.maven.plugin.javadoc.JavadocReportTest#testJdk6()'.
[WARNING] Attempting to build MavenProject instance for Artifact (commons-logging:commons-logging:1.1.1)
of type: jar; constructing POM artifact instead.
2012-02-09 00:04:20.717::INFO:  Logging to STDERR via org.mortbay.log.StdErrLog
2012-02-09 00:04:20.742::INFO:  jetty-6.1.19
2012-02-09 00:04:20.791::INFO:  Started SocketConnector@vesta.apache.org:47595
2012-02-09 00:04:21.711::INFO:  jetty-6.1.19
2012-02-09 00:04:21.712::INFO:  Started SocketConnector@vesta.apache.org:47158
[WARNING] Source files encoding has not been set, using platform encoding ANSI_X3.4-1968,
i.e. build is platform dependent!
[WARNING] Source files encoding has not been set, using platform encoding ANSI_X3.4-1968,
i.e. build is platform dependent!
[WARNING] Unsupported option <locale/> with variant 'fr_CA_wrong', trying to use <locale/>
without variant, i.e. 'fr_CA'
[WARNING] Source files encoding has not been set, using platform encoding ANSI_X3.4-1968,
i.e. build is platform dependent!
[INFO] snapshot org.apache.maven.plugins.maven-javadoc-plugin.unit:stylesheetfile-test:1.0-SNAPSHOT:
checking for updates from central
[INFO] snapshot org.apache.maven.plugins.maven-javadoc-plugin.unit:helpfile-test:1.0-SNAPSHOT:
checking for updates from central
Tests run: 23, Failures: 0, Errors: 0, Skipped: 0, Time elapsed: 105.908 sec
Running org.apache.maven.plugin.javadoc.JavadocUtilTest
2012-02-09 00:05:44.728::INFO:  jetty-6.1.19
2012-02-09 00:05:44.729::INFO:  Started SocketConnector@vesta.apache.org:51391
2012-02-09 00:05:44.979::INFO:  jetty-6.1.19
2012-02-09 00:05:44.980::INFO:  Started SocketConnector@vesta.apache.org:58115
[ INFO] basic authentication scheme selected
[ INFO] No credentials available for BASIC 'Jetty Proxy Authorization'@vesta.apache.org:58115
2012-02-09 00:05:45.146::INFO:  jetty-6.1.19
2012-02-09 00:05:45.147::INFO:  Started SocketConnector@vesta.apache.org:34544
[ INFO] basic authentication scheme selected
[ INFO] basic authentication scheme selected
2012-02-09 00:05:45.399::INFO:  jetty-6.1.19
2012-02-09 00:05:45.400::INFO:  Started SocketConnector@vesta.apache.org:50631
[ INFO] basic authentication scheme selected
2012-02-09 00:05:48.464::WARN:  EXCEPTION on HttpExchange@13443427=GET//maven.apache.org:80/plugins/maven-javadoc-plugin/apidocs/package-list#6
org.mortbay.jetty.EofException
	at org.mortbay.jetty.HttpGenerator.flush(HttpGenerator.java:787)
	at org.mortbay.jetty.AbstractGenerator$Output.flush(AbstractGenerator.java:568)
	at org.mortbay.jetty.HttpConnection$Output.flush(HttpConnection.java:946)
	at org.mortbay.jetty.AbstractGenerator$Output.write(AbstractGenerator.java:652)
	at org.mortbay.jetty.AbstractGenerator$Output.write(AbstractGenerator.java:579)
	at org.mortbay.proxy.AsyncProxyServlet$1.onResponseContent(AsyncProxyServlet.java:183)
	at org.mortbay.jetty.client.HttpExchange$Listener.onResponseContent(HttpExchange.java:590)
	at org.mortbay.jetty.client.HttpConnection$Handler.content(HttpConnection.java:535)
	at org.mortbay.jetty.HttpParser.parseNext(HttpParser.java:747)
	at org.mortbay.jetty.HttpParser.parseAvailable(HttpParser.java:218)
	at org.mortbay.jetty.client.HttpConnection.handle(HttpConnection.java:269)
	at org.mortbay.io.nio.SelectChannelEndPoint.run(SelectChannelEndPoint.java:409)
	at org.mortbay.thread.QueuedThreadPool$PoolThread.run(QueuedThreadPool.java:520)
Caused by: java.net.SocketException: Broken pipe
	at java.net.SocketOutputStream.socketWrite0(Native Method)
	at java.net.SocketOutputStream.socketWrite(SocketOutputStream.java:92)
	at java.net.SocketOutputStream.write(SocketOutputStream.java:136)
	at org.mortbay.io.ByteArrayBuffer.writeTo(ByteArrayBuffer.java:368)
	at org.mortbay.io.bio.StreamEndPoint.flush(StreamEndPoint.java:122)
	at org.mortbay.io.bio.StreamEndPoint.flush(StreamEndPoint.java:154)
	at org.mortbay.jetty.HttpGenerator.flush(HttpGenerator.java:710)
	... 12 more
2012-02-09 00:05:49.468::WARN:  EXCEPTION on HttpExchange@29268333=GET//maven.apache.org:80/plugins/maven-javadoc-plugin/apidocs/package-list#6
org.mortbay.jetty.EofException
	at org.mortbay.jetty.AbstractGenerator$Output.write(AbstractGenerator.java:631)
	at org.mortbay.jetty.AbstractGenerator$Output.write(AbstractGenerator.java:579)
	at org.mortbay.proxy.AsyncProxyServlet$1.onResponseContent(AsyncProxyServlet.java:183)
	at org.mortbay.jetty.client.HttpExchange$Listener.onResponseContent(HttpExchange.java:590)
	at org.mortbay.jetty.client.HttpConnection$Handler.content(HttpConnection.java:535)
	at org.mortbay.jetty.HttpParser.parseNext(HttpParser.java:747)
	at org.mortbay.jetty.HttpParser.parseAvailable(HttpParser.java:218)
	at org.mortbay.jetty.client.HttpConnection.handle(HttpConnection.java:269)
	at org.mortbay.io.nio.SelectChannelEndPoint.run(SelectChannelEndPoint.java:409)
	at org.mortbay.thread.QueuedThreadPool$PoolThread.run(QueuedThreadPool.java:520)
2012-02-09 00:05:50.008::INFO:  jetty-6.1.19
2012-02-09 00:05:50.009::INFO:  Started SocketConnector@vesta.apache.org:58716
Tests run: 8, Failures: 0, Errors: 0, Skipped: 0, Time elapsed: 7.26 sec
Running org.apache.maven.plugin.javadoc.TestJavadocReportTest
Tests run: 1, Failures: 0, Errors: 0, Skipped: 0, Time elapsed: 1.099 sec

Results :

Tests run: 53, Failures: 0, Errors: 0, Skipped: 0

[JENKINS] Recording test results
[INFO] 
[INFO] --- maven-jar-plugin:2.3.1:jar (default-jar) @ maven-javadoc-plugin ---
[INFO] Building jar: <https://builds.apache.org/job/maven-plugins/ws/maven-javadoc-plugin/target/maven-javadoc-plugin-2.8.2-SNAPSHOT.jar>
[INFO] 
[INFO] --- maven-plugin-plugin:2.8:addPluginArtifactMetadata (default-addPluginArtifactMetadata)
@ maven-javadoc-plugin ---
[INFO] 
[INFO] --- maven-shade-plugin:1.2.1:shade (default) @ maven-javadoc-plugin ---
[INFO] Excluding org.apache.maven:maven-core:jar:2.0.9 from the shaded jar.
[INFO] Excluding org.apache.maven.wagon:wagon-file:jar:1.0-beta-2 from the shaded jar.
[INFO] Excluding org.apache.maven:maven-plugin-parameter-documenter:jar:2.0.9 from the shaded
jar.
[INFO] Excluding org.apache.maven.wagon:wagon-webdav:jar:1.0-beta-2 from the shaded jar.
[INFO] Excluding slide:slide-webdavlib:jar:2.1 from the shaded jar.
[INFO] Excluding jdom:jdom:jar:1.0 from the shaded jar.
[INFO] Excluding de.zeigermann.xml:xml-im-exporter:jar:1.1 from the shaded jar.
[INFO] Excluding org.apache.maven.wagon:wagon-http-lightweight:jar:1.0-beta-2 from the shaded
jar.
[INFO] Excluding org.apache.maven.wagon:wagon-http-shared:jar:1.0-beta-2 from the shaded jar.
[INFO] Excluding jtidy:jtidy:jar:4aug2000r7-dev from the shaded jar.
[INFO] Excluding xml-apis:xml-apis:jar:1.0.b2 from the shaded jar.
[INFO] Excluding org.apache.maven:maven-profile:jar:2.0.9 from the shaded jar.
[INFO] Excluding org.apache.maven:maven-repository-metadata:jar:2.0.9 from the shaded jar.
[INFO] Excluding org.apache.maven:maven-error-diagnostics:jar:2.0.9 from the shaded jar.
[INFO] Excluding commons-cli:commons-cli:jar:1.0 from the shaded jar.
[INFO] Excluding org.apache.maven.wagon:wagon-ssh-external:jar:1.0-beta-2 from the shaded
jar.
[INFO] Excluding org.apache.maven.wagon:wagon-ssh-common:jar:1.0-beta-2 from the shaded jar.
[INFO] Excluding org.apache.maven:maven-plugin-descriptor:jar:2.0.9 from the shaded jar.
[INFO] Excluding org.codehaus.plexus:plexus-interactivity-api:jar:1.0-alpha-4 from the shaded
jar.
[INFO] Excluding org.apache.maven:maven-monitor:jar:2.0.9 from the shaded jar.
[INFO] Excluding org.apache.maven.wagon:wagon-ssh:jar:1.0-beta-2 from the shaded jar.
[INFO] Excluding com.jcraft:jsch:jar:0.1.27 from the shaded jar.
[INFO] Excluding classworlds:classworlds:jar:1.1 from the shaded jar.
[INFO] Excluding org.apache.maven:maven-project:jar:2.0.9 from the shaded jar.
[INFO] Excluding org.apache.maven:maven-plugin-registry:jar:2.0.9 from the shaded jar.
[INFO] Excluding org.apache.maven:maven-model:jar:2.0.9 from the shaded jar.
[INFO] Excluding org.apache.maven:maven-settings:jar:2.0.9 from the shaded jar.
[INFO] Excluding org.apache.maven:maven-plugin-api:jar:2.0.9 from the shaded jar.
[INFO] Excluding org.apache.maven:maven-artifact:jar:2.0.9 from the shaded jar.
[INFO] Excluding org.apache.maven:maven-artifact-manager:jar:2.0.9 from the shaded jar.
[INFO] Excluding org.apache.maven.reporting:maven-reporting-api:jar:3.0 from the shaded jar.
[INFO] Excluding org.apache.maven:maven-archiver:jar:2.3 from the shaded jar.
[INFO] Excluding org.apache.maven.shared:maven-invoker:jar:2.0.9 from the shaded jar.
[INFO] Excluding org.apache.maven.shared:maven-common-artifact-filters:jar:1.3 from the shaded
jar.
[INFO] Excluding org.apache.maven.doxia:doxia-sink-api:jar:1.0 from the shaded jar.
[INFO] Excluding org.apache.maven.doxia:doxia-site-renderer:jar:1.0 from the shaded jar.
[INFO] Excluding org.apache.maven.doxia:doxia-core:jar:1.0 from the shaded jar.
[INFO] Excluding org.codehaus.plexus:plexus-i18n:jar:1.0-beta-7 from the shaded jar.
[INFO] Excluding org.codehaus.plexus:plexus-velocity:jar:1.1.7 from the shaded jar.
[INFO] Excluding org.apache.velocity:velocity:jar:1.5 from the shaded jar.
[INFO] Excluding oro:oro:jar:2.0.8 from the shaded jar.
[INFO] Excluding org.apache.maven.doxia:doxia-decoration-model:jar:1.0 from the shaded jar.
[INFO] Excluding commons-collections:commons-collections:jar:3.2 from the shaded jar.
[INFO] Excluding org.apache.maven.doxia:doxia-module-apt:jar:1.0 from the shaded jar.
[INFO] Excluding org.apache.maven.doxia:doxia-module-fml:jar:1.0 from the shaded jar.
[INFO] Excluding org.apache.maven.doxia:doxia-module-xdoc:jar:1.0 from the shaded jar.
[INFO] Excluding org.apache.maven.doxia:doxia-module-xhtml:jar:1.0 from the shaded jar.
[INFO] Including org.apache.maven.wagon:wagon-provider-api:jar:1.0-beta-6 in the shaded jar.
[INFO] Excluding commons-lang:commons-lang:jar:2.4 from the shaded jar.
[INFO] Excluding commons-httpclient:commons-httpclient:jar:3.1 from the shaded jar.
[INFO] Excluding commons-codec:commons-codec:jar:1.2 from the shaded jar.
[INFO] Excluding commons-logging:commons-logging:jar:1.1.1 from the shaded jar.
[INFO] Excluding log4j:log4j:jar:1.2.14 from the shaded jar.
[INFO] Excluding com.thoughtworks.qdox:qdox:jar:1.12 from the shaded jar.
[INFO] Excluding org.codehaus.plexus:plexus-container-default:jar:1.0-alpha-9 from the shaded
jar.
[INFO] Excluding org.codehaus.plexus:plexus-archiver:jar:1.0-alpha-9 from the shaded jar.
[INFO] Excluding org.codehaus.plexus:plexus-io:jar:1.0-alpha-1 from the shaded jar.
[INFO] Excluding org.apache.maven:maven-toolchain:jar:1.0 from the shaded jar.
[INFO] Excluding org.codehaus.plexus:plexus-utils:jar:1.5.8 from the shaded jar.
[INFO] Excluding org.mockito:mockito-core:jar:1.8.5 from the shaded jar.
[INFO] Excluding org.hamcrest:hamcrest-core:jar:1.1 from the shaded jar.
[INFO] Excluding org.objenesis:objenesis:jar:1.0 from the shaded jar.
[INFO] Replacing original artifact with shaded artifact.
[INFO] Replacing <https://builds.apache.org/job/maven-plugins/ws/maven-javadoc-plugin/target/maven-javadoc-plugin-2.8.2-SNAPSHOT.jar>
with <https://builds.apache.org/job/maven-plugins/ws/maven-javadoc-plugin/target/maven-javadoc-plugin-2.8.2-SNAPSHOT-shaded.jar>
[INFO] [INFO] Installing <https://builds.apache.org/job/maven-plugins/ws/maven-javadoc-plugin/target/maven-javadoc-plugin-2.8.2-SNAPSHOT.jar>
to /home/hudson/.m2/repository/org/apache/maven/plugins/maven-javadoc-plugin/2.8.2-SNAPSHOT/maven-javadoc-plugin-2.8.2-SNAPSHOT.jar
[INFO] Installing <https://builds.apache.org/job/maven-plugins/ws/maven-javadoc-plugin/pom.xml>
to /home/hudson/.m2/repository/org/apache/maven/plugins/maven-javadoc-plugin/2.8.2-SNAPSHOT/maven-javadoc-plugin-2.8.2-SNAPSHOT.pom

[INFO] --- maven-install-plugin:2.3.1:install (default-install) @ maven-javadoc-plugin ---
[JENKINS] Archiving <https://builds.apache.org/job/maven-plugins/ws/maven-javadoc-plugin/pom.xml>
to /home/hudson/hudson/jobs/maven-plugins/modules/org.apache.maven.plugins$maven-javadoc-plugin/builds/2012-02-08_23-59-12/archive/org.apache.maven.plugins/maven-javadoc-plugin/2.8.2-SNAPSHOT/maven-javadoc-plugin-2.8.2-SNAPSHOT.pom
[JENKINS] Archiving <https://builds.apache.org/job/maven-plugins/ws/maven-javadoc-plugin/target/maven-javadoc-plugin-2.8.2-SNAPSHOT.jar>
to /home/hudson/hudson/jobs/maven-plugins/modules/org.apache.maven.plugins$maven-javadoc-plugin/builds/2012-02-08_23-59-12/archive/org.apache.maven.plugins/maven-javadoc-plugin/2.8.2-SNAPSHOT/maven-javadoc-plugin-2.8.2-SNAPSHOT.jar
[INFO] ------------------------------------------------------------------------
[INFO] Reactor Summary:
[INFO] 
[INFO] Maven Plugins ..................................... SUCCESS [32.277s]
[INFO] Maven ACR Plugin .................................. SUCCESS [37.034s]
[INFO] Maven Ant Plugin .................................. SUCCESS [48.330s]
[INFO] Maven AntRun Plugin ............................... SUCCESS [4.398s]
[INFO] Maven Eclipse Plugin .............................. SUCCESS [33.596s]
[INFO] Maven Assembly Plugin ............................. SUCCESS [26.571s]
[INFO] Maven Changelog Plugin ............................ SUCCESS [9.763s]
[INFO] Maven Changes Report Plugin ....................... SUCCESS [18.862s]
[INFO] Maven Checkstyle Plugin ........................... FAILURE [0.598s]
[INFO] Maven Clean Plugin ................................ SUCCESS [5.844s]
[INFO] Maven Compiler Plugin ............................. SUCCESS [13.474s]
[INFO] Maven Dependency Plugin ........................... SUCCESS [1:09.949s]
[INFO] Maven Deploy Plugin ............................... SUCCESS [6.163s]
[INFO] Maven DOAP Plugin ................................. SUCCESS [11.722s]
[INFO] Maven Documentation Checker Plugin ................ SUCCESS [3.316s]
[INFO] Maven EAR Plugin .................................. SUCCESS [15.182s]
[INFO] Maven EJB Plugin .................................. SUCCESS [12.648s]
[INFO] Maven GPG Plugin .................................. SUCCESS [3.130s]
[INFO] Maven Help Plugin ................................. SUCCESS [6.334s]
[INFO] Maven IDEA Plugin ................................. SUCCESS [10.556s]
[INFO] Maven Install Plugin .............................. SUCCESS [4.706s]
[INFO] Maven JAR Plugin .................................. SUCCESS [4.216s]
[INFO] Maven Jarsigner Plugin ............................ SUCCESS [3.037s]
[INFO] Maven Javadoc Plugin .............................. SUCCESS [4:01.532s]
[INFO] Maven Linkcheck Plugin ............................ SUCCESS [3.008s]
[INFO] Maven One Plugin .................................. SUCCESS [5.327s]
[INFO] Maven Patch Plugin ................................ SUCCESS [2.782s]
[INFO] Maven PDF Plugin .................................. SUCCESS [13.963s]
[INFO] Maven PMD Plugin .................................. SUCCESS [11.600s]
[INFO] Maven RAR Plugin .................................. SUCCESS [4.718s]
[INFO] Maven Reactor Plugin .............................. SUCCESS [4.500s]
[INFO] Maven Repository Plugin ........................... SUCCESS [5.894s]
[INFO] Maven Resources Plugin ............................ SUCCESS [6.640s]
[INFO] Maven Shade Plugin ................................ SUCCESS [10.586s]
[INFO] Maven Site Plugin 3 ............................... SUCCESS [15.898s]
[INFO] Maven Source Plugin ............................... SUCCESS [5.578s]
[INFO] Maven Stage Plugin ................................ SUCCESS [4.094s]
[INFO] Maven Toolchains Plugin ........................... SUCCESS [3.300s]
[INFO] Maven Verifier Plugin ............................. SUCCESS [3.726s]
[INFO] Maven WAR Plugin .................................. SUCCESS [25.222s]
[INFO] Maven Invoker Plugin .............................. SUCCESS [6.715s]
[INFO] Maven Project Info Reports Plugin ................. SUCCESS [30.040s]
[INFO] Maven Remote Resources Plugin ..................... SUCCESS [6.792s]
[INFO] Maven Plugins Aggregator .......................... SUCCESS [0.354s]
[INFO] ------------------------------------------------------------------------
[INFO] BUILD FAILURE
[INFO] ------------------------------------------------------------------------
[INFO] Total time: 6:18.957s (Wall Clock)
[INFO] Finished at: Thu Feb 09 00:05:56 UTC 2012
[INFO] Final Memory: 78M/963M
[INFO] ------------------------------------------------------------------------
Waiting for Jenkins to finish collecting data
mavenExecutionResult exceptions not empty
message : Failed to execute goal on project maven-checkstyle-plugin: Could not resolve dependencies
for project org.apache.maven.plugins:maven-checkstyle-plugin:maven-plugin:2.10-SNAPSHOT: Could
not find artifact org.apache.maven.reporting:maven-reporting-impl:jar:2.2 in central (http://repo.maven.apache.org/maven2)
cause : Could not resolve dependencies for project org.apache.maven.plugins:maven-checkstyle-plugin:maven-plugin:2.10-SNAPSHOT:
Could not find artifact org.apache.maven.reporting:maven-reporting-impl:jar:2.2 in central
(http://repo.maven.apache.org/maven2)
Stack trace : 
org.apache.maven.lifecycle.LifecycleExecutionException: Failed to execute goal on project
maven-checkstyle-plugin: Could not resolve dependencies for project org.apache.maven.plugins:maven-checkstyle-plugin:maven-plugin:2.10-SNAPSHOT:
Could not find artifact org.apache.maven.reporting:maven-reporting-impl:jar:2.2 in central
(http://repo.maven.apache.org/maven2)
	at org.apache.maven.lifecycle.internal.LifecycleDependencyResolver.getDependencies(LifecycleDependencyResolver.java:210)
	at org.apache.maven.lifecycle.internal.LifecycleDependencyResolver.resolveProjectDependencies(LifecycleDependencyResolver.java:117)
	at org.apache.maven.lifecycle.internal.MojoExecutor.ensureDependenciesAreResolved(MojoExecutor.java:258)
	at org.apache.maven.lifecycle.internal.MojoExecutor.execute(MojoExecutor.java:201)
	at org.apache.maven.lifecycle.internal.MojoExecutor.execute(MojoExecutor.java:153)
	at org.apache.maven.lifecycle.internal.MojoExecutor.execute(MojoExecutor.java:145)
	at org.apache.maven.lifecycle.internal.LifecycleModuleBuilder.buildProject(LifecycleModuleBuilder.java:84)
	at org.apache.maven.lifecycle.internal.LifecycleThreadedBuilder$1.call(LifecycleThreadedBuilder.java:167)
	at org.apache.maven.lifecycle.internal.LifecycleThreadedBuilder$1.call(LifecycleThreadedBuilder.java:163)
	at java.util.concurrent.FutureTask$Sync.innerRun(FutureTask.java:269)
	at java.util.concurrent.FutureTask.run(FutureTask.java:123)
	at java.util.concurrent.ThreadPoolExecutor$Worker.runTask(ThreadPoolExecutor.java:651)
	at java.util.concurrent.ThreadPoolExecutor$Worker.run(ThreadPoolExecutor.java:676)
	at java.lang.Thread.run(Thread.java:595)
Caused by: org.apache.maven.project.DependencyResolutionException: Could not resolve dependencies
for project org.apache.maven.plugins:maven-checkstyle-plugin:maven-plugin:2.10-SNAPSHOT: Could
not find artifact org.apache.maven.reporting:maven-reporting-impl:jar:2.2 in central (http://repo.maven.apache.org/maven2)
	at org.apache.maven.project.DefaultProjectDependenciesResolver.resolve(DefaultProjectDependenciesResolver.java:189)
	at org.apache.maven.lifecycle.internal.LifecycleDependencyResolver.getDependencies(LifecycleDependencyResolver.java:185)
	... 13 more
Caused by: org.sonatype.aether.resolution.DependencyResolutionException: Could not find artifact
org.apache.maven.reporting:maven-reporting-impl:jar:2.2 in central (http://repo.maven.apache.org/maven2)
	at org.sonatype.aether.impl.internal.DefaultRepositorySystem.resolveDependencies(DefaultRepositorySystem.java:375)
	at org.apache.maven.project.DefaultProjectDependenciesResolver.resolve(DefaultProjectDependenciesResolver.java:183)
	... 14 more
Caused by: org.sonatype.aether.resolution.ArtifactResolutionException: Could not find artifact
org.apache.maven.reporting:maven-reporting-impl:jar:2.2 in central (http://repo.maven.apache.org/maven2)
	at org.sonatype.aether.impl.internal.DefaultArtifactResolver.resolve(DefaultArtifactResolver.java:538)
	at org.sonatype.aether.impl.internal.DefaultArtifactResolver.resolveArtifacts(DefaultArtifactResolver.java:216)
	at org.sonatype.aether.impl.internal.DefaultRepositorySystem.resolveDependencies(DefaultRepositorySystem.java:358)
	... 15 more
Caused by: org.sonatype.aether.transfer.ArtifactNotFoundException: Could not find artifact
org.apache.maven.reporting:maven-reporting-impl:jar:2.2 in central (http://repo.maven.apache.org/maven2)
	at org.sonatype.aether.connector.wagon.WagonRepositoryConnector$4.wrap(WagonRepositoryConnector.java:947)
	at org.sonatype.aether.connector.wagon.WagonRepositoryConnector$4.wrap(WagonRepositoryConnector.java:941)
	at org.sonatype.aether.connector.wagon.WagonRepositoryConnector$GetTask.run(WagonRepositoryConnector.java:669)
	at org.sonatype.aether.util.concurrency.RunnableErrorForwarder$1.run(RunnableErrorForwarder.java:60)
	... 3 more
Sending e-mails to: notifications@maven.apache.org
channel stopped


Mime
View raw message