maven-notifications mailing list archives

Site index · List index
Message view « Date » · « Thread »
Top « Date » · « Thread »
From Apache Jenkins Server <jenk...@builds.apache.org>
Subject Build failed in Jenkins: maven-plugins-ITs-m2 #457
Date Wed, 25 Jan 2012 08:44:35 GMT
See <https://builds.apache.org/job/maven-plugins-ITs-m2/457/changes>

Changes:

[snicoll] MEAR-145: Add Maven version used to Created-By entry in manifest (Submitted by Anders
Hammar).

[snicoll] MEAR-141: support of env-entries in generated application.xml, based on a patch
from Jim Brownfield.

------------------------------------------
[...truncated 5552 lines...]
[INFO] Using 'UTF-8' encoding to copy filtered resources.
[INFO] skip non existing resourceDirectory <https://builds.apache.org/job/maven-plugins-ITs-m2/ws/maven-verifier-plugin/src/main/resources>
[INFO] Copying 3 resources
[INFO] [compiler:compile {execution: default-compile}]
[INFO] Compiling 9 source files to <https://builds.apache.org/job/maven-plugins-ITs-m2/ws/maven-verifier-plugin/target/classes>
[INFO] [resources:testResources {execution: default-testResources}]
[INFO] Using 'UTF-8' encoding to copy filtered resources.
[INFO] Copying 6 resources
[INFO] Copying 3 resources
[INFO] [compiler:testCompile {execution: default-testCompile}]
[INFO] Compiling 1 source file to <https://builds.apache.org/job/maven-plugins-ITs-m2/ws/maven-verifier-plugin/target/test-classes>
[INFO] [surefire:test {execution: default-test}]
[INFO] Surefire report directory: <https://builds.apache.org/job/maven-plugins-ITs-m2/ws/maven-verifier-plugin/target/surefire-reports>

-------------------------------------------------------
 T E S T S
-------------------------------------------------------
Running org.apache.maven.plugin.verifier.VerifierMojoTest
[debug] Verifying existence of c:/some/path/src/test/resources/Dummy.xml
[debug] Verifying existence of <https://builds.apache.org/job/maven-plugins-ITs-m2/ws/maven-verifier-plugin/target/test-classes/File>
Exists.xml
[debug] Verifying absence of c:/some/path/src/test/resources/Dummy.xml
[debug] Verifying absence of <https://builds.apache.org/job/maven-plugins-ITs-m2/ws/maven-verifier-plugin/target/test-classes/InexistentFileThatExists.xml>
[debug] Verifying existence of <https://builds.apache.org/job/maven-plugins-ITs-m2/ws/maven-verifier-plugin/target/test-classes/FileExistsValidContent.xml>
[debug] Verifying contents of <https://builds.apache.org/job/maven-plugins-ITs-m2/ws/maven-verifier-plugin/target/test-classes/FileExistsValidContent.xml>
[debug] Verifying existence of <https://builds.apache.org/job/maven-plugins-ITs-m2/ws/maven-verifier-plugin/target/test-classes/FileExistsValidContent.xml>
[debug] Verifying contents of <https://builds.apache.org/job/maven-plugins-ITs-m2/ws/maven-verifier-plugin/target/test-classes/FileExistsValidContent.xml>
Tests run: 8, Failures: 0, Errors: 0, Skipped: 0, Time elapsed: 0.054 sec

Results :

Tests run: 8, Failures: 0, Errors: 0, Skipped: 0

[INFO] [jar:jar {execution: default-jar}]
[INFO] Building jar: <https://builds.apache.org/job/maven-plugins-ITs-m2/ws/maven-verifier-plugin/target/maven-verifier-plugin-1.1-SNAPSHOT.jar>
[INFO] [plugin:addPluginArtifactMetadata {execution: default-addPluginArtifactMetadata}]
[INFO] [invoker:install {execution: integration-test}]
[INFO] Installing <https://builds.apache.org/job/maven-plugins-ITs-m2/ws/maven-verifier-plugin/pom.xml>
to <https://builds.apache.org/job/maven-plugins-ITs-m2/ws/maven-verifier-plugin/target/local-repo/org/apache/maven/plugins/maven-verifier-plugin/1.1-SNAPSHOT/maven-verifier-plugin-1.1-SNAPSHOT.pom>
[INFO] Installing <https://builds.apache.org/job/maven-plugins-ITs-m2/ws/maven-verifier-plugin/target/maven-verifier-plugin-1.1-SNAPSHOT.jar>
to <https://builds.apache.org/job/maven-plugins-ITs-m2/ws/maven-verifier-plugin/target/local-repo/org/apache/maven/plugins/maven-verifier-plugin/1.1-SNAPSHOT/maven-verifier-plugin-1.1-SNAPSHOT.jar>
[INFO] [invoker:run {execution: integration-test}]
[INFO] Building: default/pom.xml
[INFO] ..SUCCESS (2.8 s)
[INFO] Building: simple/pom.xml
[INFO] ..SUCCESS (2.4 s)
[INFO] ---------------------------------------
[INFO] Execution Summary:
[INFO]   Builds Passing: 2
[INFO]   Builds Failing: 0
[INFO]   Builds Skipped: 0
[INFO] ---------------------------------------
[INFO] [install:install {execution: default-install}]
[INFO] Installing <https://builds.apache.org/job/maven-plugins-ITs-m2/ws/maven-verifier-plugin/target/maven-verifier-plugin-1.1-SNAPSHOT.jar>
to /home/hudson/.m2/repository/org/apache/maven/plugins/maven-verifier-plugin/1.1-SNAPSHOT/maven-verifier-plugin-1.1-SNAPSHOT.jar
[INFO] ------------------------------------------------------------------------
[INFO] Building Maven WAR Plugin
[INFO]    task-segment: [clean, install]
[INFO] ------------------------------------------------------------------------
[INFO] [clean:clean {execution: default-clean}]
Downloading: http://repo1.maven.org/maven2/org/apache/maven/maven-archiver/2.5/maven-archiver-2.5.pom
[INFO] Unable to find resource 'org.apache.maven:maven-archiver:pom:2.5' in repository central
(http://repo1.maven.org/maven2)
Downloading: http://repo1.maven.org/maven2/org/apache/maven/maven-archiver/2.5/maven-archiver-2.5.jar
[INFO] Unable to find resource 'org.apache.maven:maven-archiver:jar:2.5' in repository central
(http://repo1.maven.org/maven2)
[INFO] ------------------------------------------------------------------------
[INFO] Building Maven Plugins Aggregator
[INFO]    task-segment: [clean, install]
[INFO] ------------------------------------------------------------------------
[INFO] [clean:clean {execution: default-clean}]
[INFO] Deleting <https://builds.apache.org/job/maven-plugins-ITs-m2/ws/target>
[INFO] [remote-resources:process {execution: default}]
[INFO] [site:attach-descriptor {execution: default-attach-descriptor}]
[INFO] [install:install {execution: default-install}]
[INFO] Installing <https://builds.apache.org/job/maven-plugins-ITs-m2/ws/pom.xml> to
/home/hudson/.m2/repository/org/apache/maven/plugins/maven-plugins-aggregator/1-SNAPSHOT/maven-plugins-aggregator-1-SNAPSHOT.pom
[INFO] 
[INFO] 
[INFO] ------------------------------------------------------------------------
[INFO] Reactor Summary:
[INFO] ------------------------------------------------------------------------
[INFO] Maven Plugins ......................................... SUCCESS [8.507s]
[INFO] Maven ACR Plugin ...................................... SUCCESS [38.473s]
[INFO] Maven Ant Plugin ...................................... SUCCESS [1:18.572s]
[INFO] Maven AntRun Plugin ................................... SUCCESS [55.873s]
[INFO] Maven Eclipse Plugin .................................. SUCCESS [11:00.934s]
[INFO] Maven Assembly Plugin ................................. FAILED [1.408s]
[INFO] Maven Changelog Plugin ................................ SUCCESS [38.758s]
[INFO] Maven Compiler Plugin ................................. SUCCESS [24.581s]
[INFO] Maven Changes Report Plugin ........................... SUCCESS [54.569s]
[INFO] Maven Checkstyle Plugin ............................... SUCCESS [1:31.611s]
[INFO] Maven Clean Plugin .................................... SUCCESS [15.104s]
[INFO] Maven Dependency Plugin ............................... SUCCESS [2:31.746s]
[INFO] Maven Deploy Plugin ................................... SUCCESS [1:51.460s]
[INFO] Maven DOAP Plugin ..................................... FAILED [1:59.526s]
[INFO] Maven Documentation Checker Plugin .................... SUCCESS [8.701s]
[INFO] Maven EAR Plugin ...................................... FAILED [5.981s]
[INFO] Maven EJB Plugin ...................................... SUCCESS [24.840s]
[INFO] Maven GPG Plugin ...................................... SUCCESS [31.517s]
[INFO] Maven Help Plugin ..................................... SUCCESS [29.798s]
[INFO] Maven IDEA Plugin ..................................... SUCCESS [7.503s]
[INFO] Maven Install Plugin .................................. SUCCESS [38.436s]
[INFO] Maven JAR Plugin ...................................... FAILED [5.775s]
[INFO] Maven Jarsigner Plugin ................................ SUCCESS [27.381s]
[INFO] Maven Shade Plugin .................................... SUCCESS [1:47.375s]
[INFO] Maven Javadoc Plugin .................................. SUCCESS [8:14.883s]
[INFO] Maven Linkcheck Plugin ................................ SUCCESS [2.093s]
[INFO] Maven One Plugin ...................................... SUCCESS [2.512s]
[INFO] Maven Patch Plugin .................................... SUCCESS [12.462s]
[INFO] Maven PDF Plugin ...................................... FAILED [4:02.545s]
[INFO] Maven PMD Plugin ...................................... FAILED [30.603s]
[INFO] Maven RAR Plugin ...................................... SUCCESS [10.415s]
[INFO] Maven Reactor Plugin .................................. SUCCESS [2.355s]
[INFO] Maven Repository Plugin ............................... SUCCESS [2:02.455s]
[INFO] Maven Resources Plugin ................................ SKIPPED (dependency build failed
or was skipped)
[INFO] Maven Site Plugin 3 ................................... SUCCESS [6:50.478s]
[INFO] Maven Source Plugin ................................... SUCCESS [31.326s]
[INFO] Maven Stage Plugin .................................... SUCCESS [2.215s]
[INFO] Maven Toolchains Plugin ............................... SUCCESS [2.051s]
[INFO] Maven Verifier Plugin ................................. SUCCESS [8.004s]
[INFO] Maven WAR Plugin ...................................... FAILED [0.427s]
[INFO] Maven Plugins Aggregator .............................. SUCCESS [1.293s]
[INFO] ------------------------------------------------------------------------
[INFO] Error for project: Maven Assembly Plugin (during install)
[INFO] ------------------------------------------------------------------------
[INFO] Failed to resolve artifact.

Missing:
----------
1) org.apache.maven:maven-archiver:jar:2.5

  Try downloading the file manually from the project website.

  Then, install it using the command: 
      mvn install:install-file -DgroupId=org.apache.maven -DartifactId=maven-archiver -Dversion=2.5
-Dpackaging=jar -Dfile=/path/to/file

  Alternatively, if you host your own repository you can deploy the file there: 
      mvn deploy:deploy-file -DgroupId=org.apache.maven -DartifactId=maven-archiver -Dversion=2.5
-Dpackaging=jar -Dfile=/path/to/file -Durl=[url] -DrepositoryId=[id]

  Path to dependency: 
  	1) org.apache.maven.plugins:maven-assembly-plugin:maven-plugin:2.4-SNAPSHOT
  	2) org.apache.maven:maven-archiver:jar:2.5

----------
1 required artifact is missing.

for artifact: 
  org.apache.maven.plugins:maven-assembly-plugin:maven-plugin:2.4-SNAPSHOT

from the specified remote repositories:
  central (http://repo1.maven.org/maven2),
  Nexus (http://repository.apache.org/snapshots),
  codehaus.org (http://snapshots.repository.codehaus.org)



[INFO] ------------------------------------------------------------------------
[INFO] Error for project: Maven DOAP Plugin (during install)
[INFO] ------------------------------------------------------------------------
[INFO] : org.apache.maven.plugin.invoker.InvokerSession@10bb517
1 build failed.
[INFO] ------------------------------------------------------------------------
[INFO] Error for project: Maven EAR Plugin (during install)
[INFO] ------------------------------------------------------------------------
[INFO] Compilation failure
<https://builds.apache.org/job/maven-plugins-ITs-m2/ws/maven-ear-plugin/src/main/java/org/apache/maven/plugin/ear/EnvEntry.java>:[136,34]
cannot find symbol
symbol  : method isEmpty()
location: class java.lang.String

[INFO] ------------------------------------------------------------------------
[INFO] Error for project: Maven JAR Plugin (during install)
[INFO] ------------------------------------------------------------------------
[INFO] Failed to resolve artifact.

Missing:
----------
1) org.apache.maven:maven-archiver:jar:2.5

  Try downloading the file manually from the project website.

  Then, install it using the command: 
      mvn install:install-file -DgroupId=org.apache.maven -DartifactId=maven-archiver -Dversion=2.5
-Dpackaging=jar -Dfile=/path/to/file

  Alternatively, if you host your own repository you can deploy the file there: 
      mvn deploy:deploy-file -DgroupId=org.apache.maven -DartifactId=maven-archiver -Dversion=2.5
-Dpackaging=jar -Dfile=/path/to/file -Durl=[url] -DrepositoryId=[id]

  Path to dependency: 
  	1) org.apache.maven.plugins:maven-jar-plugin:maven-plugin:2.5-SNAPSHOT
  	2) org.apache.maven:maven-archiver:jar:2.5

----------
1 required artifact is missing.

for artifact: 
  org.apache.maven.plugins:maven-jar-plugin:maven-plugin:2.5-SNAPSHOT

from the specified remote repositories:
  central (http://repo1.maven.org/maven2),
  Nexus (http://repository.apache.org/snapshots)



[INFO] ------------------------------------------------------------------------
[INFO] Error for project: Maven PDF Plugin (during install)
[INFO] ------------------------------------------------------------------------
[INFO] : org.apache.maven.plugin.invoker.InvokerSession@1742726
1 build failed.
[INFO] ------------------------------------------------------------------------
[INFO] Error for project: Maven PMD Plugin (during install)
[INFO] ------------------------------------------------------------------------
[INFO] : org.apache.maven.plugin.invoker.InvokerSession@123d043
1 build failed.
[INFO] ------------------------------------------------------------------------
[INFO] Error for project: Maven WAR Plugin (during install)
[INFO] ------------------------------------------------------------------------
[INFO] Failed to resolve artifact.

Missing:
----------
1) org.apache.maven:maven-archiver:jar:2.5

  Try downloading the file manually from the project website.

  Then, install it using the command: 
      mvn install:install-file -DgroupId=org.apache.maven -DartifactId=maven-archiver -Dversion=2.5
-Dpackaging=jar -Dfile=/path/to/file

  Alternatively, if you host your own repository you can deploy the file there: 
      mvn deploy:deploy-file -DgroupId=org.apache.maven -DartifactId=maven-archiver -Dversion=2.5
-Dpackaging=jar -Dfile=/path/to/file -Durl=[url] -DrepositoryId=[id]

  Path to dependency: 
  	1) org.apache.maven.plugins:maven-war-plugin:maven-plugin:2.3-SNAPSHOT
  	2) org.apache.maven:maven-archiver:jar:2.5

----------
1 required artifact is missing.

for artifact: 
  org.apache.maven.plugins:maven-war-plugin:maven-plugin:2.3-SNAPSHOT

from the specified remote repositories:
  central (http://repo1.maven.org/maven2),
  Nexus (http://repository.apache.org/snapshots)



[INFO] ------------------------------------------------------------------------
[INFO] For more information, run Maven with the -e switch
[INFO] ------------------------------------------------------------------------
[INFO] BUILD ERRORS
[INFO] ------------------------------------------------------------------------
[INFO] Total time: 51 minutes 57 seconds
[INFO] Finished at: Wed Jan 25 08:44:31 UTC 2012
[INFO] Final Memory: 103M/350M
[INFO] ------------------------------------------------------------------------
Build step 'Invoke top-level Maven targets' marked build as failure


Mime
View raw message