maven-notifications mailing list archives

Site index · List index
Message view « Date » · « Thread »
Top « Date » · « Thread »
From Apache Jenkins Server <jenk...@builds.apache.org>
Subject Build failed in Jenkins: maven-surefire #160
Date Fri, 30 Dec 2011 16:54:51 GMT
See <https://builds.apache.org/job/maven-surefire/160/changes>

Changes:

[hboutemy] more generics

[hboutemy] code formatting

------------------------------------------
[...truncated 1450 lines...]
  testForkModeAlways(org.apache.maven.surefire.its.ForkModeTestNGIT): Exit code was non-zero:
1; command line and log = 
  testForkModePerTest(org.apache.maven.surefire.its.ForkModeTestNGIT): Exit code was non-zero:
1; command line and log = 
  testForkModeOnce(org.apache.maven.surefire.its.ForkModeTestNGIT): Exit code was non-zero:
1; command line and log = 
  testPaallelBuildResultCount(org.apache.maven.surefire.its.Surefire141PluggableProvidersIT):
Exit code was non-zero: 1; command line and log = 
  testTestNgJdk14(org.apache.maven.surefire.its.CheckTestNgJdk14IT): Exit code was non-zero:
1; command line and log = 
  testTestNgAndJUnitTogether(org.apache.maven.surefire.its.Surefire377TestNgAndJUnitTogetherIT):
Exit code was non-zero: 1; command line and log = 
  testSingleMethod(org.apache.maven.surefire.its.JUnit48TestSingleMethodIT): Exit code was
non-zero: 1; command line and log = 
  testUseSystemClassLoader(org.apache.maven.surefire.its.UseIsolatedClassLoaderIT): Exit code
was non-zero: 1; command line and log = 
  testJUnit4RunListener(org.apache.maven.surefire.its.JUnit4RunListenerIT): Exit code was
non-zero: 1; command line and log = 
  testRunlistenerJunitCoreProvider(org.apache.maven.surefire.its.JUnit4RunListenerIT): Exit
code was non-zero: 1; command line and log = 
  testSingleMethod(org.apache.maven.surefire.its.TestNgTestSingleMethod5149IT): Exit code
was non-zero: 1; command line and log = 
  testAbstractTestCase(org.apache.maven.surefire.its.AbstractTestCaseIT): Exit code was non-zero:
1; command line and log = 
  testForkModeAlways(org.apache.maven.surefire.its.ForkModeIT): Exit code was non-zero: 1;
command line and log = 
  testForkModePerTest(org.apache.maven.surefire.its.ForkModeIT): Exit code was non-zero: 1;
command line and log = 
  testForkModeOnce(org.apache.maven.surefire.its.ForkModeIT): Exit code was non-zero: 1; command
line and log = 
  testInnerClass(org.apache.maven.surefire.its.Surefire42NotExtendingTestCaseIT): Exit code
was non-zero: 1; command line and log = 
  testJunit4Ignore(org.apache.maven.surefire.its.JUnit4ForkAlwaysStaticInitPollutionIT): Exit
code was non-zero: 1; command line and log = 
  testEnvironmentVariable(org.apache.maven.surefire.its.EnvironmentVariableIT): Exit code
was non-zero: 1; command line and log = 
  testWithIdenticalNames(org.apache.maven.surefire.its.Surefire260TestWithIdenticalNamesIT):
Exit code was non-zero: 1; command line and log = 
  testDontFailIfNoTestsForkModeAlways(org.apache.maven.surefire.its.CheckTestFailIfNoTestsForkModeIT):
Exit code was non-zero: 1; command line and log = 
  testDontFailIfNoTestsForkModeOnce(org.apache.maven.surefire.its.CheckTestFailIfNoTestsForkModeIT):
Exit code was non-zero: 1; command line and log = 
  testSingleTest(org.apache.maven.surefire.its.CheckSingleTestIT): Exit code was non-zero:
1; command line and log = 
  testSingleTestDotJava(org.apache.maven.surefire.its.CheckSingleTestIT): Exit code was non-zero:
1; command line and log = 
  testSingleTestNonExistentOverride(org.apache.maven.surefire.its.CheckSingleTestIT): Exit
code was non-zero: 1; command line and log = 
  testForkModeAlways(org.apache.maven.surefire.its.XmlReporterRunTimeIT): Exit code was non-zero:
1; command line and log = 
  testProperNewlines(org.apache.maven.surefire.its.ConsoleOutputIT): Exit code was non-zero:
1; command line and log = 
  testAdditionalClasspath(org.apache.maven.surefire.its.AdditionalClasspathIT): Exit code
was non-zero: 1; command line and log = 
  testPaallelBuildResultCount(org.apache.maven.surefire.its.Surefire613TestCountInParallelIT):
Text not found in log: testAllok to stdout
  testit(org.apache.maven.surefire.its.PojoSimpleIT): Exit code was non-zero: 1; command line
and log = 
  testDefaultConfiguration(org.apache.maven.surefire.its.DefaultConfigurationIT): Exit code
was non-zero: 1; command line and log = 
  testForkAlways(org.apache.maven.surefire.its.Surefire510TestClassPathForkModesIT): Exit
code was non-zero: 1; command line and log = 
  testForkOnce(org.apache.maven.surefire.its.Surefire510TestClassPathForkModesIT): Exit code
was non-zero: 1; command line and log = 
  testTestNgTestWithSpaces(org.apache.maven.surefire.its.CheckTestNgPathWithSpacesIT): Exit
code was non-zero: 1; command line and log = 
  testJunit3ParallelBuildResultCount(org.apache.maven.surefire.its.Surefire634UnsettableSystemPropertiesWarningIT):
Exit code was non-zero: 1; command line and log = 
  testPrintSummaryTrueWithRedirect(org.apache.maven.surefire.its.ForkConsoleOutputIT): Exit
code was non-zero: 1; command line and log = 
  testPrintSummaryTrueWithoutRedirect(org.apache.maven.surefire.its.ForkConsoleOutputIT):
Exit code was non-zero: 1; command line and log = 
  testPrintSummaryFalseWithRedirect(org.apache.maven.surefire.its.ForkConsoleOutputIT): Exit
code was non-zero: 1; command line and log = 
  testPrintSummaryFalseWithoutRedirect(org.apache.maven.surefire.its.ForkConsoleOutputIT):
Exit code was non-zero: 1; command line and log = 
  testTestNgReport(org.apache.maven.surefire.its.CheckTestNgReportTestIT): Exit code was non-zero:
1; command line and log = 
  testExecuteError(org.apache.maven.surefire.its.CheckTestNgExecuteErrorIT): Text not found
in log: at org.apache.maven.surefire.testng.TestNGExecutor.run
  testTwoTestCases(org.apache.maven.surefire.its.TwoTestCasesIT): Exit code was non-zero:
1; command line and log = 
  testTwoTestCaseSuite(org.apache.maven.surefire.its.TwoTestCasesIT): Exit code was non-zero:
1; command line and log = 
  testJunit4Suite(org.apache.maven.surefire.its.TwoTestCasesIT): Exit code was non-zero: 1;
command line and log = 
  testTestNGSuite(org.apache.maven.surefire.its.TwoTestCasesIT): Exit code was non-zero: 1;
command line and log = 
  testPrintSummaryTrueWithRedirect(org.apache.maven.surefire.its.JUnit47RedirectOutputIT):
Exit code was non-zero: 1; command line and log = 
  testClassesParallel(org.apache.maven.surefire.its.JUnit47RedirectOutputIT): Exit code was
non-zero: 1; command line and log = 
  testJunit3ParallelBuildResultCount(org.apache.maven.surefire.its.NoRunnableTestsInClassIT):
Text not found in log: No tests found in junit.norunnabletests.BasicTest
  testAlphabetical(org.apache.maven.surefire.its.RunOrderParallelForksIT): Exit code was non-zero:
1; command line and log = 
  testReverseAlphabetical(org.apache.maven.surefire.its.RunOrderParallelForksIT): Exit code
was non-zero: 1; command line and log = 
  testHourly(org.apache.maven.surefire.its.RunOrderParallelForksIT): Exit code was non-zero:
1; command line and log = 
  testSystemProperties(org.apache.maven.surefire.its.SystemPropertiesTestIT): Exit code was
non-zero: 1; command line and log = 
  testMethodPattern(org.apache.maven.surefire.its.JUnit48TestMethodPatternIT): Exit code was
non-zero: 1; command line and log = 
  testReportWithAggregate(org.apache.maven.surefire.its.Surefire570MultipleReportDirectoriesIT):
Exit code was non-zero: 1; command line and log = 
  testReportWithoutAggregate(org.apache.maven.surefire.its.Surefire570MultipleReportDirectoriesIT):
Exit code was non-zero: 1; command line and log = 
  test40(org.apache.maven.surefire.its.Junit4VersionsIT): Exit code was non-zero: 1; command
line and log = 
  test41(org.apache.maven.surefire.its.Junit4VersionsIT): Exit code was non-zero: 1; command
line and log = 
  test42(org.apache.maven.surefire.its.Junit4VersionsIT): Exit code was non-zero: 1; command
line and log = 
  test43(org.apache.maven.surefire.its.Junit4VersionsIT): Exit code was non-zero: 1; command
line and log = 
  test431(org.apache.maven.surefire.its.Junit4VersionsIT): Exit code was non-zero: 1; command
line and log = 
  test44(org.apache.maven.surefire.its.Junit4VersionsIT): Exit code was non-zero: 1; command
line and log = 
  test45(org.apache.maven.surefire.its.Junit4VersionsIT): Exit code was non-zero: 1; command
line and log = 
  test46(org.apache.maven.surefire.its.Junit4VersionsIT): Exit code was non-zero: 1; command
line and log = 
  test47(org.apache.maven.surefire.its.Junit4VersionsIT): Exit code was non-zero: 1; command
line and log = 
  test47(org.apache.maven.surefire.its.CheckTestNgVersionsIT): Exit code was non-zero: 1;
command line and log = 
  test502(org.apache.maven.surefire.its.CheckTestNgVersionsIT): Exit code was non-zero: 1;
command line and log = 
  test51(org.apache.maven.surefire.its.CheckTestNgVersionsIT): Exit code was non-zero: 1;
command line and log = 
  test55(org.apache.maven.surefire.its.CheckTestNgVersionsIT): Exit code was non-zero: 1;
command line and log = 
  test56(org.apache.maven.surefire.its.CheckTestNgVersionsIT): Exit code was non-zero: 1;
command line and log = 
  test57(org.apache.maven.surefire.its.CheckTestNgVersionsIT): Exit code was non-zero: 1;
command line and log = 
  test58(org.apache.maven.surefire.its.CheckTestNgVersionsIT): Exit code was non-zero: 1;
command line and log = 
  test59(org.apache.maven.surefire.its.CheckTestNgVersionsIT): Exit code was non-zero: 1;
command line and log = 
  test510(org.apache.maven.surefire.its.CheckTestNgVersionsIT): Exit code was non-zero: 1;
command line and log = 
  test511(org.apache.maven.surefire.its.CheckTestNgVersionsIT): Exit code was non-zero: 1;
command line and log = 
  test512(org.apache.maven.surefire.its.CheckTestNgVersionsIT): Exit code was non-zero: 1;
command line and log = 
  test513(org.apache.maven.surefire.its.CheckTestNgVersionsIT): Exit code was non-zero: 1;
command line and log = 
  test5131(org.apache.maven.surefire.its.CheckTestNgVersionsIT): Exit code was non-zero: 1;
command line and log = 
  test514(org.apache.maven.surefire.its.CheckTestNgVersionsIT): Exit code was non-zero: 1;
command line and log = 
  test5141(org.apache.maven.surefire.its.CheckTestNgVersionsIT): Exit code was non-zero: 1;
command line and log = 
  test5142(org.apache.maven.surefire.its.CheckTestNgVersionsIT): Exit code was non-zero: 1;
command line and log = 
  test60(org.apache.maven.surefire.its.CheckTestNgVersionsIT): Exit code was non-zero: 1;
command line and log = 
  testWellFormedXmlFailures(org.apache.maven.surefire.its.Surefire224WellFormedXmlFailuresIT):
Exit code was non-zero: 1; command line and log = 
  testIncludesExcludes(org.apache.maven.surefire.its.IncludesExcludesIT): Exit code was non-zero:
1; command line and log = 
  testRegexIncludesExcludes(org.apache.maven.surefire.its.IncludesExcludesIT): Exit code was
non-zero: 1; command line and log = 
  testPathBasedIncludesExcludes(org.apache.maven.surefire.its.IncludesExcludesIT): Exit code
was non-zero: 1; command line and log = 
  testMethodPattern(org.apache.maven.surefire.its.TestNgTestMethodPatternIT): Exit code was
non-zero: 1; command line and log = 
  test47(org.apache.maven.surefire.its.Junit47concurrencyIT): Exit code was non-zero: 1; command
line and log = 
  testTestNgGroupThreadParallel(org.apache.maven.surefire.its.TestNgGroupsIT): Exit code was
non-zero: 1; command line and log = 
  testGroups(org.apache.maven.surefire.its.TestNgGroupsIT): Exit code was non-zero: 1; command
line and log = 
  testMethodPattern(org.apache.maven.surefire.its.TestNgTestMethodPatternAfterIT): Exit code
was non-zero: 1; command line and log = 
  testWhenUseSystemClassLoader(org.apache.maven.surefire.its.misc.Surefire763EnvironmentForkModeIT):
Exit code was non-zero: 1; command line and log = 
  testWhenDontUseSystemClassLoader(org.apache.maven.surefire.its.misc.Surefire763EnvironmentForkModeIT):
Exit code was non-zero: 1; command line and log = 
  testCharsetProvider(org.apache.maven.surefire.its.Surefire162CharsetProviderIT): Exit code
was non-zero: 1; command line and log = 
  testJunit4Ignore(org.apache.maven.surefire.its.Junit4IgnoreIT): Exit code was non-zero:
1; command line and log = 
  testJunit47ParallelIgnore(org.apache.maven.surefire.its.Junit4IgnoreIT): Exit code was non-zero:
1; command line and log = 
  testSingleMethod(org.apache.maven.surefire.its.TestNgTestSingleMethodIT): Exit code was
non-zero: 1; command line and log = 
  testAdditionalClasspath(org.apache.maven.surefire.its.ClasspathScopeFilteringIT): Exit code
was non-zero: 1; command line and log = 
  testInnerClass(org.apache.maven.surefire.its.Surefire44InnerClassTestIT): Exit code was
non-zero: 1; command line and log = 
  testForkPerTestNoSetup(org.apache.maven.surefire.its.Surefire146ForkPerTestNoSetupIT): Exit
code was non-zero: 1; command line and log = 
  testMethodPattern(org.apache.maven.surefire.its.JUnit44TestMethodPatternIT): Exit code was
non-zero: 1; command line and log = 
  testJunit3ParallelBuildResultCount(org.apache.maven.surefire.its.Surefire628ConsoleOutputBeforeAndAfterClassIT):
Text not found in log: 628Test1
  testLogOutput(org.apache.maven.surefire.its.Surefire733AllOverrridesCapturedIT): Exit code
was non-zero: 1; command line and log = 
  testTestNGSuite(org.apache.maven.surefire.its.CheckTestNgSuiteXmlSingleIT): Exit code was
non-zero: 1; command line and log = 
  testMethodPattern(org.apache.maven.surefire.its.TestNgTestMethodPatternBeforeIT): Exit code
was non-zero: 1; command line and log = 
  testBuildFailingWhenErrors(org.apache.maven.surefire.its.Surefire685CommaSeparatedIncludesIT):
Exit code was non-zero: 1; command line and log = 
  testAlphabetical(org.apache.maven.surefire.its.RunOrderIT): Exit code was non-zero: 1; command
line and log = 
  testReverseAlphabetical(org.apache.maven.surefire.its.RunOrderIT): Exit code was non-zero:
1; command line and log = 
  testHourly(org.apache.maven.surefire.its.RunOrderIT): Exit code was non-zero: 1; command
line and log = 
  testClassPathOrder(org.apache.maven.surefire.its.ClassPathOrderIT): Exit code was non-zero:
1; command line and log = 
  testRedirectOutputTestNg(org.apache.maven.surefire.its.ReportersIT): Exit code was non-zero:
1; command line and log = 
  testTestNgGroupThreadParallel(org.apache.maven.surefire.its.TestNgParallelWithAnnotationsIT):
Exit code was non-zero: 1; command line and log = 

Tests run: 192, Failures: 8, Errors: 141, Skipped: 0

[JENKINS] Recording test results
[INFO] 
[INFO] --- maven-failsafe-plugin:2.8:verify (default) @ surefire-integration-tests ---[INFO]
Failsafe report directory: <https://builds.apache.org/job/maven-surefire/ws/surefire-integration-tests/target/failsafe-reports>

[JENKINS] Archiving <https://builds.apache.org/job/maven-surefire/ws/surefire-integration-tests/pom.xml>
to /home/hudson/hudson/jobs/maven-surefire/modules/org.apache.maven.surefire$surefire-integration-tests/builds/2011-12-30_16-18-02/archive/org.apache.maven.surefire/surefire-integration-tests/2.12-SNAPSHOT/surefire-integration-tests-2.12-SNAPSHOT.pom
[JENKINS] Archiving <https://builds.apache.org/job/maven-surefire/ws/surefire-integration-tests/target/surefire-integration-tests-2.12-SNAPSHOT.jar>
to /home/hudson/hudson/jobs/maven-surefire/modules/org.apache.maven.surefire$surefire-integration-tests/builds/2011-12-30_16-18-02/archive/org.apache.maven.surefire/surefire-integration-tests/2.12-SNAPSHOT/surefire-integration-tests-2.12-SNAPSHOT.jar
[INFO] ------------------------------------------------------------------------
[INFO] Reactor Summary:
[INFO] 
[INFO] SureFire .......................................... SUCCESS [3:18.736s]
[INFO] ShadeFire JUnit3 Provider ......................... SUCCESS [21.770s]
[INFO] SureFire API ...................................... SUCCESS [1:31.805s]
[INFO] SureFire Booter ................................... SUCCESS [20.350s]
[INFO] SureFire Providers ................................ SUCCESS [5.274s]
[INFO] Shared JUnit3 Provider Code ....................... SUCCESS [15.599s]
[INFO] Shared JUnit4 Provider Code ....................... SUCCESS [14.816s]
[INFO] Shared JUnit48 Provider Code ...................... SUCCESS [18.958s]
[INFO] SureFire JUnit Runner ............................. SUCCESS [18.027s]
[INFO] SureFire JUnit4 Runner ............................ SUCCESS [17.658s]
[INFO] Maven Surefire Common ............................. SUCCESS [21.869s]
[INFO] SureFire JUnitCore Runner ......................... FAILURE [27.235s]
[INFO] SureFire TestNG Utils ............................. SUCCESS [16.439s]
[INFO] SureFire TestNG Runner ............................ SUCCESS [13.819s]
[INFO] Maven Surefire Plugin ............................. SUCCESS [23.569s]
[INFO] Maven Failsafe Plugin ............................. SUCCESS [1:22.788s]
[INFO] Maven Surefire Report Plugin ...................... SUCCESS [38.972s]
[INFO] Maven Surefire Integration Test Setup ............. SKIPPED
[INFO] Maven Surefire Integration Tests .................. FAILURE [20:12.786s]
[INFO] ------------------------------------------------------------------------
[INFO] BUILD FAILURE
[INFO] ------------------------------------------------------------------------
[INFO] Total time: 34:27.801s
[INFO] Finished at: Fri Dec 30 16:54:11 GMT+00:00 2011
[INFO] Final Memory: 34M/183M
[INFO] ------------------------------------------------------------------------
mavenExecutionResult exceptions not empty
message : Failed to execute goal org.apache.maven.plugins:maven-surefire-plugin:2.8:test (default-test)
on project surefire-junit47: Error while executing forked tests.; nested exception is java.lang.IllegalStateException:
testSetStarting called twice
cause : Error while executing forked tests.; nested exception is java.lang.IllegalStateException:
testSetStarting called twice
Stack trace : 
org.apache.maven.lifecycle.LifecycleExecutionException: Failed to execute goal org.apache.maven.plugins:maven-surefire-plugin:2.8:test
(default-test) on project surefire-junit47: Error while executing forked tests.; nested exception
is java.lang.IllegalStateException: testSetStarting called twice
	at org.apache.maven.lifecycle.internal.MojoExecutor.execute(MojoExecutor.java:217)
	at org.apache.maven.lifecycle.internal.MojoExecutor.execute(MojoExecutor.java:153)
	at org.apache.maven.lifecycle.internal.MojoExecutor.execute(MojoExecutor.java:145)
	at org.apache.maven.lifecycle.internal.LifecycleModuleBuilder.buildProject(LifecycleModuleBuilder.java:84)
	at org.apache.maven.lifecycle.internal.LifecycleModuleBuilder.buildProject(LifecycleModuleBuilder.java:59)
	at org.apache.maven.lifecycle.internal.LifecycleStarter.singleThreadedBuild(LifecycleStarter.java:183)
	at org.apache.maven.lifecycle.internal.LifecycleStarter.execute(LifecycleStarter.java:161)
	at org.apache.maven.DefaultMaven.doExecute(DefaultMaven.java:319)
	at org.apache.maven.DefaultMaven.execute(DefaultMaven.java:156)
	at org.jvnet.hudson.maven3.launcher.Maven3Launcher.main(Maven3Launcher.java:79)
	at sun.reflect.NativeMethodAccessorImpl.invoke0(Native Method)
	at sun.reflect.NativeMethodAccessorImpl.invoke(NativeMethodAccessorImpl.java:39)
	at sun.reflect.DelegatingMethodAccessorImpl.invoke(DelegatingMethodAccessorImpl.java:25)
	at java.lang.reflect.Method.invoke(Method.java:592)
	at org.codehaus.plexus.classworlds.launcher.Launcher.launchStandard(Launcher.java:329)
	at org.codehaus.plexus.classworlds.launcher.Launcher.launch(Launcher.java:239)
	at org.jvnet.hudson.maven3.agent.Maven3Main.launch(Maven3Main.java:158)
	at hudson.maven.Maven3Builder.call(Maven3Builder.java:112)
	at hudson.maven.Maven3Builder.call(Maven3Builder.java:70)
	at hudson.remoting.UserRequest.perform(UserRequest.java:118)
	at hudson.remoting.UserRequest.perform(UserRequest.java:48)
	at hudson.remoting.Request$2.run(Request.java:287)
	at java.util.concurrent.Executors$RunnableAdapter.call(Executors.java:417)
	at java.util.concurrent.FutureTask$Sync.innerRun(FutureTask.java:269)
	at java.util.concurrent.FutureTask.run(FutureTask.java:123)
	at java.util.concurrent.ThreadPoolExecutor$Worker.runTask(ThreadPoolExecutor.java:651)
	at java.util.concurrent.ThreadPoolExecutor$Worker.run(ThreadPoolExecutor.java:676)
	at java.lang.Thread.run(Thread.java:595)
Caused by: org.apache.maven.plugin.MojoExecutionException: Error while executing forked tests.;
nested exception is java.lang.IllegalStateException: testSetStarting called twice
	at org.apache.maven.plugin.surefire.SurefirePlugin.executeAfterPreconditionsChecked(SurefirePlugin.java:631)
	at org.apache.maven.plugin.surefire.AbstractSurefireMojo.execute(AbstractSurefireMojo.java:103)
	at org.apache.maven.plugin.DefaultBuildPluginManager.executeMojo(DefaultBuildPluginManager.java:101)
	at org.apache.maven.lifecycle.internal.MojoExecutor.execute(MojoExecutor.java:209)
	... 27 more
Caused by: org.apache.maven.surefire.booter.SurefireBooterForkException: Error while executing
forked tests.; nested exception is java.lang.IllegalStateException: testSetStarting called
twice
	at org.apache.maven.plugin.surefire.booterclient.ForkStarter.fork(ForkStarter.java:240)
	at org.apache.maven.plugin.surefire.booterclient.ForkStarter.runSuitesForkOnce(ForkStarter.java:124)
	at org.apache.maven.plugin.surefire.booterclient.ForkStarter.run(ForkStarter.java:108)
	at org.apache.maven.plugin.surefire.SurefirePlugin.executeAfterPreconditionsChecked(SurefirePlugin.java:617)
	... 30 more
Caused by: java.lang.IllegalStateException: testSetStarting called twice
	at org.apache.maven.plugin.surefire.booterclient.output.FileOutputConsumerProxy.testSetStarting(FileOutputConsumerProxy.java:69)
	at org.apache.maven.plugin.surefire.booterclient.output.SynchronizedOutputConsumer.testSetStarting(SynchronizedOutputConsumer.java:62)
	at org.apache.maven.plugin.surefire.booterclient.ForkingStreamConsumer.consumeLine(ForkingStreamConsumer.java:61)
	at org.codehaus.plexus.util.cli.StreamPumper.consumeLine(StreamPumper.java:190)
	at org.codehaus.plexus.util.cli.StreamPumper.run(StreamPumper.java:135)
message : Failed to execute goal org.apache.maven.plugins:maven-failsafe-plugin:2.8:verify
(default) on project surefire-integration-tests: There are test failures.

Please refer to <https://builds.apache.org/job/maven-surefire/ws/surefire-integration-tests/target/failsafe-reports>
for the individual test results.
cause : There are test failures.

Please refer to <https://builds.apache.org/job/maven-surefire/ws/surefire-integration-tests/target/failsafe-reports>
for the individual test results.
Stack trace : 
org.apache.maven.lifecycle.LifecycleExecutionException: Failed to execute goal org.apache.maven.plugins:maven-failsafe-plugin:2.8:verify
(default) on project surefire-integration-tests: There are test failures.

Please refer to <https://builds.apache.org/job/maven-surefire/ws/surefire-integration-tests/target/failsafe-reports>
for the individual test results.
	at org.apache.maven.lifecycle.internal.MojoExecutor.execute(MojoExecutor.java:213)
	at org.apache.maven.lifecycle.internal.MojoExecutor.execute(MojoExecutor.java:153)
	at org.apache.maven.lifecycle.internal.MojoExecutor.execute(MojoExecutor.java:145)
	at org.apache.maven.lifecycle.internal.LifecycleModuleBuilder.buildProject(LifecycleModuleBuilder.java:84)
	at org.apache.maven.lifecycle.internal.LifecycleModuleBuilder.buildProject(LifecycleModuleBuilder.java:59)
	at org.apache.maven.lifecycle.internal.LifecycleStarter.singleThreadedBuild(LifecycleStarter.java:183)
	at org.apache.maven.lifecycle.internal.LifecycleStarter.execute(LifecycleStarter.java:161)
	at org.apache.maven.DefaultMaven.doExecute(DefaultMaven.java:319)
	at org.apache.maven.DefaultMaven.execute(DefaultMaven.java:156)
	at org.jvnet.hudson.maven3.launcher.Maven3Launcher.main(Maven3Launcher.java:79)
	at sun.reflect.NativeMethodAccessorImpl.invoke0(Native Method)
	at sun.reflect.NativeMethodAccessorImpl.invoke(NativeMethodAccessorImpl.java:39)
	at sun.reflect.DelegatingMethodAccessorImpl.invoke(DelegatingMethodAccessorImpl.java:25)
	at java.lang.reflect.Method.invoke(Method.java:592)
	at org.codehaus.plexus.classworlds.launcher.Launcher.launchStandard(Launcher.java:329)
	at org.codehaus.plexus.classworlds.launcher.Launcher.launch(Launcher.java:239)
	at org.jvnet.hudson.maven3.agent.Maven3Main.launch(Maven3Main.java:158)
	at hudson.maven.Maven3Builder.call(Maven3Builder.java:112)
	at hudson.maven.Maven3Builder.call(Maven3Builder.java:70)
	at hudson.remoting.UserRequest.perform(UserRequest.java:118)
	at hudson.remoting.UserRequest.perform(UserRequest.java:48)
	at hudson.remoting.Request$2.run(Request.java:287)
	at java.util.concurrent.Executors$RunnableAdapter.call(Executors.java:417)
	at java.util.concurrent.FutureTask$Sync.innerRun(FutureTask.java:269)
	at java.util.concurrent.FutureTask.run(FutureTask.java:123)
	at java.util.concurrent.ThreadPoolExecutor$Worker.runTask(ThreadPoolExecutor.java:651)
	at java.util.concurrent.ThreadPoolExecutor$Worker.run(ThreadPoolExecutor.java:676)
	at java.lang.Thread.run(Thread.java:595)
Caused by: org.apache.maven.plugin.MojoFailureException: There are test failures.

Please refer to <https://builds.apache.org/job/maven-surefire/ws/surefire-integration-tests/target/failsafe-reports>
for the individual test results.
	at org.apache.maven.plugin.surefire.SurefireHelper.reportExecution(SurefireHelper.java:74)
	at org.apache.maven.plugin.failsafe.VerifyMojo.execute(VerifyMojo.java:205)
	at org.apache.maven.plugin.DefaultBuildPluginManager.executeMojo(DefaultBuildPluginManager.java:101)
	at org.apache.maven.lifecycle.internal.MojoExecutor.execute(MojoExecutor.java:209)
	... 27 more
Maven failed with error.
Sending e-mails to: notifications@maven.apache.org herve.boutemy@free.fr
Sending e-mails to: notifications@maven.apache.org
channel stopped


Mime
View raw message