maven-notifications mailing list archives

Site index · List index
Message view « Date » · « Thread »
Top « Date » · « Thread »
From Apache Jenkins Server <jenk...@builds.apache.org>
Subject Build failed in Jenkins: maven-site-plugin-3.x » JDK 1.5 (latest),Ubuntu #183
Date Thu, 17 Nov 2011 13:47:37 GMT
See <https://builds.apache.org/job/maven-site-plugin-3.x/./jdk=JDK%201.5%20(latest),label=Ubuntu/183/>

------------------------------------------
[...truncated 981 lines...]
2500 [main] INFO org.apache.maven.plugins.site.SiteDeployWebDavTest - PUT path /site//css/.svn/all-wcprops
Proxy-Authorization : Basic Zm9vOnRpdGk=
Proxy-Connection : Keep-Alive
Content-Length : 346
Host : toto.com
User-Agent : Jakarta Commons-HttpClient/3.1
Expires : 0
Accept-Encoding : gzip
Cache-store : no-store
Pragma : no-cache
Cache-Control : no-cache

2500 [main] INFO org.apache.maven.plugins.site.SiteDeployWebDavTest - MKCOL path /site/css/
Proxy-Authorization : Basic Zm9vOnRpdGk=
Proxy-Connection : Keep-Alive
Content-Length : 0
Host : toto.com
User-Agent : Jakarta Commons-HttpClient/3.1
Expires : 0
Accept-Encoding : gzip
Cache-store : no-store
Pragma : no-cache
Cache-Control : no-cache

2500 [main] INFO org.apache.maven.plugins.site.SiteDeployWebDavTest - PUT path /site//css/maven-base.css
Proxy-Authorization : Basic Zm9vOnRpdGk=
Proxy-Connection : Keep-Alive
Content-Length : 2310
Host : toto.com
User-Agent : Jakarta Commons-HttpClient/3.1
Expires : 0
Accept-Encoding : gzip
Cache-store : no-store
Pragma : no-cache
Cache-Control : no-cache

2500 [main] INFO org.mortbay.log - Stopped SocketConnector@0.0.0.0:45678
Tests run: 3, Failures: 0, Errors: 0, Skipped: 0, Time elapsed: 2.589 sec
Running org.apache.maven.plugins.site.SiteMojoTest
Tests run: 1, Failures: 0, Errors: 0, Skipped: 0, Time elapsed: 0.365 sec
Running org.apache.maven.plugins.site.SiteDeployMojoTest
Tests run: 1, Failures: 0, Errors: 0, Skipped: 0, Time elapsed: 0.138 sec

Results :

Tests run: 5, Failures: 0, Errors: 0, Skipped: 0

[INFO] 
[INFO] --- maven-jar-plugin:2.3.1:jar (default-jar) @ maven-site-plugin ---
[INFO] Building jar: <https://builds.apache.org/job/maven-site-plugin-3.x/./jdk=JDK%201.5%20(latest),label=Ubuntu/ws/target/maven-site-plugin-3.1-SNAPSHOT.jar>
[INFO] 
[INFO] --- maven-plugin-plugin:2.8:addPluginArtifactMetadata (default-addPluginArtifactMetadata)
@ maven-site-plugin ---
[INFO] 
[INFO] --- maven-shade-plugin:1.4:shade (default) @ maven-site-plugin ---
[INFO] Including org.apache.maven.reporting:maven-reporting-api:jar:3.0 in the shaded jar.
[INFO] Excluding org.apache.maven.reporting:maven-reporting-exec:jar:1.0.1 from the shaded
jar.
[INFO] Excluding org.apache.velocity:velocity:jar:1.5 from the shaded jar.
[INFO] Excluding oro:oro:jar:2.0.8 from the shaded jar.
[INFO] Excluding velocity:velocity:jar:1.5 from the shaded jar.
[INFO] Including org.apache.maven:maven-artifact:jar:3.0 in the shaded jar.
[INFO] Excluding org.apache.maven:maven-model-builder:jar:3.0 from the shaded jar.
[INFO] Excluding org.codehaus.plexus:plexus-interpolation:jar:1.14 from the shaded jar.
[INFO] Excluding org.sonatype.sisu:sisu-inject-plexus:jar:1.4.2 from the shaded jar.
[INFO] Excluding org.sonatype.sisu:sisu-inject-bean:jar:1.4.2 from the shaded jar.
[INFO] Excluding org.sonatype.sisu:sisu-guice:jar:noaop:2.1.7 from the shaded jar.
[INFO] Excluding org.codehaus.plexus:plexus-component-annotations:jar:1.5.5 from the shaded
jar.
[INFO] Excluding org.apache.maven:maven-core:jar:3.0 from the shaded jar.
[INFO] Excluding org.apache.maven:maven-repository-metadata:jar:3.0 from the shaded jar.
[INFO] Excluding org.apache.maven:maven-aether-provider:jar:3.0 from the shaded jar.
[INFO] Excluding org.sonatype.aether:aether-impl:jar:1.7 from the shaded jar.
[INFO] Excluding org.sonatype.aether:aether-spi:jar:1.7 from the shaded jar.
[INFO] Excluding org.sonatype.aether:aether-api:jar:1.7 from the shaded jar.
[INFO] Excluding org.sonatype.aether:aether-util:jar:1.7 from the shaded jar.
[INFO] Excluding org.codehaus.plexus:plexus-classworlds:jar:2.2.3 from the shaded jar.
[INFO] Excluding org.sonatype.plexus:plexus-sec-dispatcher:jar:1.3 from the shaded jar.
[INFO] Excluding org.sonatype.plexus:plexus-cipher:jar:1.4 from the shaded jar.
[INFO] Excluding org.apache.maven:maven-model:jar:3.0 from the shaded jar.
[INFO] Excluding org.apache.maven:maven-plugin-api:jar:3.0 from the shaded jar.
[INFO] Excluding org.apache.maven:maven-settings:jar:3.0 from the shaded jar.
[INFO] Excluding org.apache.maven:maven-settings-builder:jar:3.0 from the shaded jar.
[INFO] Excluding org.apache.maven.doxia:doxia-sink-api:jar:1.2 from the shaded jar.
[INFO] Excluding org.apache.maven.doxia:doxia-logging-api:jar:1.2 from the shaded jar.
[INFO] Excluding org.codehaus.plexus:plexus-container-default:jar:1.0-alpha-30 from the shaded
jar.
[INFO] Excluding org.apache.maven.doxia:doxia-core:jar:1.2 from the shaded jar.
[INFO] Excluding xerces:xercesImpl:jar:2.9.1 from the shaded jar.
[INFO] Excluding xml-apis:xml-apis:jar:1.3.04 from the shaded jar.
[INFO] Excluding org.apache.httpcomponents:httpclient:jar:4.0.2 from the shaded jar.
[INFO] Excluding org.apache.httpcomponents:httpcore:jar:4.0.1 from the shaded jar.
[INFO] Excluding commons-logging:commons-logging:jar:1.1.1 from the shaded jar.
[INFO] Excluding commons-codec:commons-codec:jar:1.3 from the shaded jar.
[INFO] Excluding org.apache.maven.doxia:doxia-module-xhtml:jar:1.2 from the shaded jar.
[INFO] Excluding org.apache.maven.doxia:doxia-module-apt:jar:1.2 from the shaded jar.
[INFO] Excluding org.apache.maven.doxia:doxia-module-xdoc:jar:1.2 from the shaded jar.
[INFO] Excluding org.apache.maven.doxia:doxia-module-fml:jar:1.2 from the shaded jar.
[INFO] Excluding javax.servlet:servlet-api:jar:2.5 from the shaded jar.
[INFO] Excluding org.apache.maven.doxia:doxia-decoration-model:jar:1.2 from the shaded jar.
[INFO] Excluding org.apache.maven.doxia:doxia-site-renderer:jar:1.2 from the shaded jar.
[INFO] Excluding commons-collections:commons-collections:jar:3.2.1 from the shaded jar.
[INFO] Excluding org.apache.maven.shared:maven-doxia-tools:jar:1.4 from the shaded jar.
[INFO] Excluding org.apache.maven.wagon:wagon-provider-api:jar:1.0 from the shaded jar.
[INFO] Excluding org.codehaus.plexus:plexus-archiver:jar:1.0 from the shaded jar.
[INFO] Excluding org.codehaus.plexus:plexus-io:jar:1.0 from the shaded jar.
[INFO] Excluding org.codehaus.plexus:plexus-i18n:jar:1.0-beta-7 from the shaded jar.
[INFO] Excluding org.codehaus.plexus:plexus-velocity:jar:1.1.8 from the shaded jar.
[INFO] Excluding org.codehaus.plexus:plexus-utils:jar:1.5.10 from the shaded jar.
[INFO] Excluding org.mortbay.jetty:jetty:jar:6.1.25 from the shaded jar.
[INFO] Excluding org.mortbay.jetty:servlet-api:jar:2.5-20081211 from the shaded jar.
[INFO] Excluding org.mortbay.jetty:jetty-util:jar:6.1.25 from the shaded jar.
[INFO] Excluding commons-lang:commons-lang:jar:2.5 from the shaded jar.
[INFO] Excluding commons-io:commons-io:jar:1.4 from the shaded jar.
[INFO] Replacing original artifact with shaded artifact.
[INFO] Replacing <https://builds.apache.org/job/maven-site-plugin-3.x/./jdk=JDK%201.5%20(latest),label=Ubuntu/ws/target/maven-site-plugin-3.1-SNAPSHOT.jar>
with <https://builds.apache.org/job/maven-site-plugin-3.x/./jdk=JDK%201.5%20(latest),label=Ubuntu/ws/target/maven-site-plugin-3.1-SNAPSHOT-shaded.jar>
[INFO] 
[INFO] --- maven-invoker-plugin:1.5:install (integration-test) @ maven-site-plugin ---
[INFO] Installing <https://builds.apache.org/job/maven-site-plugin-3.x/./jdk=JDK%201.5%20(latest),label=Ubuntu/ws/dependency-reduced-pom.xml>
to <https://builds.apache.org/job/maven-site-plugin-3.x/./jdk=JDK%201.5%20(latest),label=Ubuntu/ws/target/local-repo/org/apache/maven/plugins/maven-site-plugin/3.1-SNAPSHOT/maven-site-plugin-3.1-SNAPSHOT.pom>
[INFO] Installing <https://builds.apache.org/job/maven-site-plugin-3.x/./jdk=JDK%201.5%20(latest),label=Ubuntu/ws/target/maven-site-plugin-3.1-SNAPSHOT.jar>
to <https://builds.apache.org/job/maven-site-plugin-3.x/./jdk=JDK%201.5%20(latest),label=Ubuntu/ws/target/local-repo/org/apache/maven/plugins/maven-site-plugin/3.1-SNAPSHOT/maven-site-plugin-3.1-SNAPSHOT.jar>
[INFO] 
[INFO] --- maven-invoker-plugin:1.5:integration-test (integration-test) @ maven-site-plugin
---
[INFO] Building: MSITE-548/pom.xml
[INFO] ..SUCCESS (8.5 s)
[INFO] Building: it-plugin-test/pom.xml
[INFO] ..SUCCESS (5.7 s)
[INFO] Building: emma-plugin-it/pom.xml
[INFO] ..SUCCESS (9.2 s)
[INFO] Building: full-reporting/pom.xml
[INFO] ..SUCCESS (27.0 s)
[INFO] Building: MSITE-537/pom.xml
[INFO] ..SUCCESS (6.0 s)
[INFO] Building: site-stage-deploy/pom.xml
[INFO] ..SUCCESS (9.8 s)
[INFO] Building: MSITE-609/pom.xml
[INFO] ..SUCCESS (5.5 s)
[INFO] Building: MSITE-265/pom.xml
[INFO] ..SUCCESS (8.8 s)
[INFO] Building: MSITE-304/pom.xml
[INFO] ..SUCCESS (6.5 s)
[INFO] Building: MSITE-484/pom.xml
[INFO] ..SUCCESS (7.2 s)
[INFO] Building: inheritedReports/pom.xml
[INFO] ..SKIPPED 
[INFO] Building: top-parent-no-site/pom.xml
[INFO] ..SUCCESS (6.3 s)
[INFO] Building: site-inheritance/pom.xml
[INFO] ..SUCCESS (8.1 s)
[INFO] Building: MSITE-566/pom.xml
[INFO] ..SUCCESS (3.3 s)
[INFO] Building: new-configuration/pom.xml
[INFO] ..SUCCESS (7.3 s)
[INFO] Building: MSITE-506/pom.xml
[INFO] ..SUCCESS (9.4 s)
[INFO] Building: MSITE-354/pom.xml
[INFO] ..SUCCESS (17.8 s)
[INFO] Building: top-parent-different-site/pom.xml
[INFO] ..SUCCESS (4.6 s)
[INFO] Building: site-jar/pom.xml
[INFO] ..SUCCESS (5.2 s)
[INFO] Building: empty-report-set/pom.xml
[INFO] ..SUCCESS (3.1 s)
[INFO] Building: MSITE-159/pom.xml
[INFO] ..SUCCESS (4.4 s)
[INFO] Building: site-deploy/pom.xml
[INFO] ..SUCCESS (5.0 s)
[INFO] Building: inheritedMenus/pom.xml
[INFO] ..SUCCESS (5.6 s)
[INFO] Building: MSITE-497/pom.xml
[INFO] ..SUCCESS (14.3 s)
[INFO] Building: report-changes-generation/pom.xml
[INFO] ..SUCCESS (10.9 s)
[INFO] Building: MSITE-512/pom.xml
[INFO] ..SUCCESS (5.3 s)
[INFO] Building: interpolation/pom.xml
[INFO] ..SUCCESS (6.4 s)
[INFO] Building: site-attach-descriptor/pom.xml
[INFO] ..SUCCESS (4.5 s)
[INFO] Building: site-skip/pom.xml
[INFO] ..SUCCESS (4.7 s)
[INFO] Building: MSITE-504/pom.xml
[INFO] ..SUCCESS (22.1 s)
[INFO] Building: validate/pom.xml
[INFO] ..FAILED (125.0 s)
[INFO]   The build exited with code 1. See <https://builds.apache.org/job/maven-site-plugin-3.x/./jdk=JDK%201.5%20(latest),label=Ubuntu/ws/target/it/validate/build.log>
for details.
[INFO] Building: MSITE-322/pom.xml
[INFO] ..SUCCESS (7.0 s)
[INFO] Building: MSITE-550/pom.xml
[INFO] ..SUCCESS (3.2 s)
[INFO] Building: MSITE-458/pom.xml
[INFO] ..SUCCESS (11.1 s)
[INFO] Building: MSITE-312/pom.xml
[INFO] ..SUCCESS (4.8 s)
[INFO] Building: MSITE-507/pom.xml
[INFO] ..SUCCESS (53.1 s)
[INFO] Building: no-version/pom.xml
[INFO] ..SUCCESS (5.5 s)
[INFO] Building: MSITE-456/pom.xml
[INFO] ..SUCCESS (4.8 s)
[INFO] Building: surefire-report/pom.xml
[INFO] ..SUCCESS (5.9 s)
[INFO] 
[INFO] --- maven-invoker-plugin:1.5:verify (integration-test) @ maven-site-plugin ---
[INFO] -------------------------------------------------
[INFO] Build Summary:
[INFO]   Passed: 37, Failed: 1, Errors: 0, Skipped: 1
[INFO] -------------------------------------------------
[ERROR] The following builds failed:
[ERROR] *  validate/pom.xml
[INFO] -------------------------------------------------
[INFO] ------------------------------------------------------------------------
[INFO] BUILD FAILURE
[INFO] ------------------------------------------------------------------------
[INFO] Total time: 8:08.114s
[INFO] Finished at: Thu Nov 17 13:47:36 UTC 2011
[INFO] Final Memory: 18M/200M
[INFO] ------------------------------------------------------------------------
[ERROR] Failed to execute goal org.apache.maven.plugins:maven-invoker-plugin:1.5:verify (integration-test)
on project maven-site-plugin: 1 build failed. -> [Help 1]
org.apache.maven.lifecycle.LifecycleExecutionException: Failed to execute goal org.apache.maven.plugins:maven-invoker-plugin:1.5:verify
(integration-test) on project maven-site-plugin: 1 build failed.
	at org.apache.maven.lifecycle.internal.MojoExecutor.execute(MojoExecutor.java:213)
	at org.apache.maven.lifecycle.internal.MojoExecutor.execute(MojoExecutor.java:153)
	at org.apache.maven.lifecycle.internal.MojoExecutor.execute(MojoExecutor.java:145)
	at org.apache.maven.lifecycle.internal.LifecycleModuleBuilder.buildProject(LifecycleModuleBuilder.java:84)
	at org.apache.maven.lifecycle.internal.LifecycleModuleBuilder.buildProject(LifecycleModuleBuilder.java:59)
	at org.apache.maven.lifecycle.internal.LifecycleStarter.singleThreadedBuild(LifecycleStarter.java:183)
	at org.apache.maven.lifecycle.internal.LifecycleStarter.execute(LifecycleStarter.java:161)
	at org.apache.maven.DefaultMaven.doExecute(DefaultMaven.java:319)
	at org.apache.maven.DefaultMaven.execute(DefaultMaven.java:156)
	at org.apache.maven.cli.MavenCli.execute(MavenCli.java:537)
	at org.apache.maven.cli.MavenCli.doMain(MavenCli.java:196)
	at org.apache.maven.cli.MavenCli.main(MavenCli.java:141)
	at sun.reflect.NativeMethodAccessorImpl.invoke0(Native Method)
	at sun.reflect.NativeMethodAccessorImpl.invoke(NativeMethodAccessorImpl.java:39)
	at sun.reflect.DelegatingMethodAccessorImpl.invoke(DelegatingMethodAccessorImpl.java:25)
	at java.lang.reflect.Method.invoke(Method.java:592)
	at org.codehaus.plexus.classworlds.launcher.Launcher.launchEnhanced(Launcher.java:290)
	at org.codehaus.plexus.classworlds.launcher.Launcher.launch(Launcher.java:230)
	at org.codehaus.plexus.classworlds.launcher.Launcher.mainWithExitCode(Launcher.java:409)
	at org.codehaus.plexus.classworlds.launcher.Launcher.main(Launcher.java:352)
Caused by: org.apache.maven.plugin.MojoFailureException: 1 build failed.
	at org.apache.maven.plugin.invoker.InvokerSession.handleFailures(InvokerSession.java:263)
	at org.apache.maven.plugin.invoker.VerifyMojo.execute(VerifyMojo.java:124)
	at org.apache.maven.plugin.DefaultBuildPluginManager.executeMojo(DefaultBuildPluginManager.java:101)
	at org.apache.maven.lifecycle.internal.MojoExecutor.execute(MojoExecutor.java:209)
	... 19 more
[ERROR] 
[ERROR] Re-run Maven using the -X switch to enable full debug logging.
[ERROR] 
[ERROR] For more information about the errors and possible solutions, please read the following
articles:
[ERROR] [Help 1] http://cwiki.apache.org/confluence/display/MAVEN/MojoFailureException
Build step 'Invoke top-level Maven targets' marked build as failure
[locks-and-latches] Releasing all the locks
[locks-and-latches] All the locks released


Mime
View raw message