maven-notifications mailing list archives

Site index · List index
Message view « Date » · « Thread »
Top « Date » · « Thread »
From Apache Jenkins Server <jenk...@builds.apache.org>
Subject Build failed in Jenkins: maven-archetype-m2 #79
Date Thu, 10 Nov 2011 20:12:25 GMT
See <https://builds.apache.org/job/maven-archetype-m2/79/>

------------------------------------------
[...truncated 1363 lines...]
[INFO] Exclude: archetype-samples/**
[INFO] Exclude: **/*.sha1
[INFO] Exclude: src/main/resources/org/apache/maven/archetype/creator/*
[INFO] Exclude: **/Format.java
[INFO] Exclude: **/NamespaceStack.java
[INFO] Exclude: **/XMLOutputter.java
[INFO] Exclude: src/test/**
[INFO] Exclude: src/it/**
[INFO] Exclude: .repository/**
[INFO] [install:install {execution: default-install}]
[INFO] Installing <https://builds.apache.org/job/maven-archetype-m2/ws/archetype-common/target/archetype-common-2.2-SNAPSHOT.jar>
to <https://builds.apache.org/job/maven-archetype-m2/ws/.repository/org/apache/maven/archetype/archetype-common/2.2-SNAPSHOT/archetype-common-2.2-SNAPSHOT.jar>
[JENKINS] Archiving <https://builds.apache.org/job/maven-archetype-m2/ws/archetype-common/pom.xml>
to /home/hudson/hudson/jobs/maven-archetype-m2/modules/org.apache.maven.archetype$archetype-common/builds/2011-11-10_20-09-41/archive/org.apache.maven.archetype/archetype-common/2.2-SNAPSHOT/archetype-common-2.2-SNAPSHOT.pom
[JENKINS] Archiving <https://builds.apache.org/job/maven-archetype-m2/ws/archetype-common/target/archetype-common-2.2-SNAPSHOT.jar>
to /home/hudson/hudson/jobs/maven-archetype-m2/modules/org.apache.maven.archetype$archetype-common/builds/2011-11-10_20-09-41/archive/org.apache.maven.archetype/archetype-common/2.2-SNAPSHOT/archetype-common-2.2-SNAPSHOT.jar
[INFO] ------------------------------------------------------------------------
[INFO] Building Maven Archetype Packaging
[INFO]    task-segment: [clean, install]
[INFO] ------------------------------------------------------------------------
[INFO] [clean:clean {execution: default-clean}]
[INFO] Deleting <https://builds.apache.org/job/maven-archetype-m2/ws/archetype-packaging/target>
[INFO] [remote-resources:process {execution: default}]
[debug] execute contextualize
[INFO] [resources:resources {execution: default-resources}]
[INFO] Using 'UTF-8' encoding to copy filtered resources.
[INFO] Copying 1 resource
[INFO] Copying 3 resources
[INFO] [compiler:compile {execution: default-compile}]
[INFO] No sources to compile
[INFO] [plexus-component-metadata:generate-metadata {execution: default}]
[debug] execute contextualize
[INFO] [resources:testResources {execution: default-testResources}]
[INFO] Using 'UTF-8' encoding to copy filtered resources.
[INFO] skip non existing resourceDirectory <https://builds.apache.org/job/maven-archetype-m2/ws/archetype-packaging/src/test/resources>
[INFO] Copying 3 resources
[INFO] [compiler:testCompile {execution: default-testCompile}]
[INFO] No sources to compile
[INFO] [surefire:test {execution: default-test}]
[INFO] Surefire report directory: <https://builds.apache.org/job/maven-archetype-m2/ws/archetype-packaging/target/surefire-reports>

-------------------------------------------------------
 T E S T S
-------------------------------------------------------

Results :

Tests run: 0, Failures: 0, Errors: 0, Skipped: 0

[JENKINS] Recording test results
[INFO] [jar:jar {execution: default-jar}]
[INFO] Building jar: <https://builds.apache.org/job/maven-archetype-m2/ws/archetype-packaging/target/archetype-packaging-2.2-SNAPSHOT.jar>
[INFO] [apache-rat:check {execution: rat-check}]
[INFO] Exclude: .gitignore
[INFO] Exclude: DEPENDENCIES
[INFO] Exclude: README.txt
[INFO] Exclude: *.sh
[INFO] Exclude: .git/**
[INFO] Exclude: .idea/**
[INFO] Exclude: **/generated-sources/**
[INFO] Exclude: **/.gitattributes
[INFO] Exclude: archetype-samples/**
[INFO] Exclude: **/*.sha1
[INFO] Exclude: src/main/resources/org/apache/maven/archetype/creator/*
[INFO] Exclude: **/Format.java
[INFO] Exclude: **/NamespaceStack.java
[INFO] Exclude: **/XMLOutputter.java
[INFO] Exclude: src/test/**
[INFO] Exclude: src/it/**
[INFO] Exclude: .repository/**
[INFO] [install:install {execution: default-install}]
[INFO] Installing <https://builds.apache.org/job/maven-archetype-m2/ws/archetype-packaging/target/archetype-packaging-2.2-SNAPSHOT.jar>
to <https://builds.apache.org/job/maven-archetype-m2/ws/.repository/org/apache/maven/archetype/archetype-packaging/2.2-SNAPSHOT/archetype-packaging-2.2-SNAPSHOT.jar>
[JENKINS] Archiving <https://builds.apache.org/job/maven-archetype-m2/ws/archetype-packaging/pom.xml>
to /home/hudson/hudson/jobs/maven-archetype-m2/modules/org.apache.maven.archetype$archetype-packaging/builds/2011-11-10_20-09-41/archive/org.apache.maven.archetype/archetype-packaging/2.2-SNAPSHOT/archetype-packaging-2.2-SNAPSHOT.pom
[JENKINS] Archiving <https://builds.apache.org/job/maven-archetype-m2/ws/archetype-packaging/target/archetype-packaging-2.2-SNAPSHOT.jar>
to /home/hudson/hudson/jobs/maven-archetype-m2/modules/org.apache.maven.archetype$archetype-packaging/builds/2011-11-10_20-09-41/archive/org.apache.maven.archetype/archetype-packaging/2.2-SNAPSHOT/archetype-packaging-2.2-SNAPSHOT.jar
[INFO] ------------------------------------------------------------------------
[INFO] Building Maven Archetype Plugin
[INFO]    task-segment: [clean, install]
[INFO] ------------------------------------------------------------------------
[INFO] [clean:clean {execution: default-clean}]
[INFO] Deleting <https://builds.apache.org/job/maven-archetype-m2/ws/maven-archetype-plugin/target>
[INFO] [plugin:helpmojo {execution: generated-helpmojo}]
[INFO] Using 'UTF-8' encoding to read mojo metadata.
[INFO] Applying mojo extractor for language: java
[INFO] Mojo extractor for language: java found 7 mojo descriptors.
[INFO] Applying mojo extractor for language: bsh
[INFO] Mojo extractor for language: bsh found 0 mojo descriptors.
[INFO] snapshot org.apache.maven.shared:maven-script-interpreter:1.0-SNAPSHOT: checking for
updates from apache.snapshots
Downloading: http://repository.apache.org/snapshots/org/apache/maven/shared/maven-script-interpreter/1.0-SNAPSHOT/maven-script-interpreter-1.0-20111110.200913-12.pom
3K downloaded  (maven-script-interpreter-1.0-20111110.200913-12.pom)
Downloading: http://repo1.maven.org/maven2/org/apache/maven/shared/maven-shared-components/17/maven-shared-components-17.pom

Downloading: http://repository.apache.org/snapshots/org/apache/maven/shared/maven-script-interpreter/1.0-SNAPSHOT/maven-script-interpreter-1.0-20111110.200913-12.jar
20K downloaded  (maven-script-interpreter-1.0-20111110.200913-12.jar)
[INFO] [plugin:descriptor {execution: default-descriptor}]
[INFO] Using 'UTF-8' encoding to read mojo metadata.
[INFO] Applying mojo extractor for language: java
[INFO] Mojo extractor for language: java found 8 mojo descriptors.
[INFO] Applying mojo extractor for language: bsh
[INFO] Mojo extractor for language: bsh found 0 mojo descriptors.
[INFO] [remote-resources:process {execution: default}]
[debug] execute contextualize
[INFO] [resources:resources {execution: default-resources}]
[INFO] Using 'UTF-8' encoding to copy filtered resources.
[INFO] skip non existing resourceDirectory <https://builds.apache.org/job/maven-archetype-m2/ws/maven-archetype-plugin/src/main/resources>
[INFO] Copying 3 resources
[INFO] [compiler:compile {execution: default-compile}]
[INFO] Compiling 28 source files to <https://builds.apache.org/job/maven-archetype-m2/ws/maven-archetype-plugin/target/classes>
[INFO] [plexus-component-metadata:generate-metadata {execution: default}]
[INFO] Discovered 8 component descriptors(s)
[debug] execute contextualize
[INFO] [resources:testResources {execution: default-testResources}]
[INFO] Using 'UTF-8' encoding to copy filtered resources.
[INFO] skip non existing resourceDirectory <https://builds.apache.org/job/maven-archetype-m2/ws/maven-archetype-plugin/src/test/resources>
[INFO] Copying 3 resources
[INFO] [compiler:testCompile {execution: default-testCompile}]
[INFO] Compiling 4 source files to <https://builds.apache.org/job/maven-archetype-m2/ws/maven-archetype-plugin/target/test-classes>
[INFO] [surefire:test {execution: default-test}]
[INFO] Surefire report directory: <https://builds.apache.org/job/maven-archetype-m2/ws/maven-archetype-plugin/target/surefire-reports>

-------------------------------------------------------
 T E S T S
-------------------------------------------------------
Running org.apache.maven.archetype.ui.generation.DefaultArchetypeSelectorTest
[INFO] No catalog defined. Using internal catalog
[WARNING] Archetype not found in any catalog. Falling back to central repository (http://repo1.maven.org/maven2).
[WARNING] Use -DarchetypeRepository=<your repository> if archetype's repository is elsewhere.
[INFO] No catalog defined. Using internal catalog
[INFO] No catalog defined. Using internal catalog
[INFO] No archetype defined. Using maven-archetype-quickstart (org.apache.maven.archetypes:maven-archetype-quickstart:1.0)
[INFO] No catalog defined. Using internal catalog
[INFO] No archetype defined. Using maven-archetype-quickstart (org.apache.maven.archetypes:maven-archetype-quickstart:1.0)
[INFO] No catalog defined. Using internal catalog
[INFO] No archetype defined. Using maven-archetype-quickstart (org.apache.maven.archetypes:maven-archetype-quickstart:1.0)
Tests run: 5, Failures: 0, Errors: 0, Skipped: 0, Time elapsed: 1.059 sec
Running org.apache.maven.archetype.ui.generation.RequiredPropertyComparatorTest
Tests run: 2, Failures: 0, Errors: 0, Skipped: 0, Time elapsed: 0.004 sec
Running org.apache.maven.archetype.ui.generation.DefaultArchetypeSelectionQueryerTest
Tests run: 5, Failures: 0, Errors: 0, Skipped: 0, Time elapsed: 0.251 sec
Running org.apache.maven.archetype.ui.generation.DefaultArchetypeGenerationConfiguratorTest
[WARNING] Property groupId is missing. Add -DgroupId=someValue
[WARNING] Property package is missing. Add -Dpackage=someValue
Tests run: 3, Failures: 0, Errors: 0, Skipped: 0, Time elapsed: 0.145 sec

Results :

Tests run: 15, Failures: 0, Errors: 0, Skipped: 0

[JENKINS] Recording test results
[INFO] [jar:jar {execution: default-jar}]
[INFO] Building jar: <https://builds.apache.org/job/maven-archetype-m2/ws/maven-archetype-plugin/target/maven-archetype-plugin-2.2-SNAPSHOT.jar>
[INFO] [plugin:addPluginArtifactMetadata {execution: default-addPluginArtifactMetadata}]
[INFO] [invoker:install {execution: integration-test}]
[INFO] Installing <https://builds.apache.org/job/maven-archetype-m2/ws/archetype-models/archetype-catalog/pom.xml>
to <https://builds.apache.org/job/maven-archetype-m2/ws/maven-archetype-plugin/target/local-repo/org/apache/maven/archetype/archetype-catalog/2.2-SNAPSHOT/archetype-catalog-2.2-SNAPSHOT.pom>
[INFO] Installing <https://builds.apache.org/job/maven-archetype-m2/ws/archetype-models/archetype-catalog/target/archetype-catalog-2.2-SNAPSHOT.jar>
to <https://builds.apache.org/job/maven-archetype-m2/ws/maven-archetype-plugin/target/local-repo/org/apache/maven/archetype/archetype-catalog/2.2-SNAPSHOT/archetype-catalog-2.2-SNAPSHOT.jar>
[INFO] Installing <https://builds.apache.org/job/maven-archetype-m2/ws/archetype-models/pom.xml>
to <https://builds.apache.org/job/maven-archetype-m2/ws/maven-archetype-plugin/target/local-repo/org/apache/maven/archetype/archetype-models/2.2-SNAPSHOT/archetype-models-2.2-SNAPSHOT.pom>
[INFO] Installing <https://builds.apache.org/job/maven-archetype-m2/ws/pom.xml> to <https://builds.apache.org/job/maven-archetype-m2/ws/maven-archetype-plugin/target/local-repo/org/apache/maven/archetype/maven-archetype/2.2-SNAPSHOT/maven-archetype-2.2-SNAPSHOT.pom>
[INFO] Installing <https://builds.apache.org/job/maven-archetype-m2/ws/archetype-models/archetype-descriptor/pom.xml>
to <https://builds.apache.org/job/maven-archetype-m2/ws/maven-archetype-plugin/target/local-repo/org/apache/maven/archetype/archetype-descriptor/2.2-SNAPSHOT/archetype-descriptor-2.2-SNAPSHOT.pom>
[INFO] Installing <https://builds.apache.org/job/maven-archetype-m2/ws/archetype-models/archetype-descriptor/target/archetype-descriptor-2.2-SNAPSHOT.jar>
to <https://builds.apache.org/job/maven-archetype-m2/ws/maven-archetype-plugin/target/local-repo/org/apache/maven/archetype/archetype-descriptor/2.2-SNAPSHOT/archetype-descriptor-2.2-SNAPSHOT.jar>
[INFO] Installing <https://builds.apache.org/job/maven-archetype-m2/ws/archetype-models/archetype-registry/pom.xml>
to <https://builds.apache.org/job/maven-archetype-m2/ws/maven-archetype-plugin/target/local-repo/org/apache/maven/archetype/archetype-registry/2.2-SNAPSHOT/archetype-registry-2.2-SNAPSHOT.pom>
[INFO] Installing <https://builds.apache.org/job/maven-archetype-m2/ws/archetype-models/archetype-registry/target/archetype-registry-2.2-SNAPSHOT.jar>
to <https://builds.apache.org/job/maven-archetype-m2/ws/maven-archetype-plugin/target/local-repo/org/apache/maven/archetype/archetype-registry/2.2-SNAPSHOT/archetype-registry-2.2-SNAPSHOT.jar>
[INFO] Installing <https://builds.apache.org/job/maven-archetype-m2/ws/archetype-common/pom.xml>
to <https://builds.apache.org/job/maven-archetype-m2/ws/maven-archetype-plugin/target/local-repo/org/apache/maven/archetype/archetype-common/2.2-SNAPSHOT/archetype-common-2.2-SNAPSHOT.pom>
[INFO] Installing <https://builds.apache.org/job/maven-archetype-m2/ws/archetype-common/target/archetype-common-2.2-SNAPSHOT.jar>
to <https://builds.apache.org/job/maven-archetype-m2/ws/maven-archetype-plugin/target/local-repo/org/apache/maven/archetype/archetype-common/2.2-SNAPSHOT/archetype-common-2.2-SNAPSHOT.jar>
[INFO] Installing <https://builds.apache.org/job/maven-archetype-m2/ws/maven-archetype-plugin/pom.xml>
to <https://builds.apache.org/job/maven-archetype-m2/ws/maven-archetype-plugin/target/local-repo/org/apache/maven/plugins/maven-archetype-plugin/2.2-SNAPSHOT/maven-archetype-plugin-2.2-SNAPSHOT.pom>
[INFO] Installing <https://builds.apache.org/job/maven-archetype-m2/ws/maven-archetype-plugin/target/maven-archetype-plugin-2.2-SNAPSHOT.jar>
to <https://builds.apache.org/job/maven-archetype-m2/ws/maven-archetype-plugin/target/local-repo/org/apache/maven/plugins/maven-archetype-plugin/2.2-SNAPSHOT/maven-archetype-plugin-2.2-SNAPSHOT.jar>
[INFO] [invoker:run {execution: integration-test}]
[INFO] Building: create-from-project/pom.xml
[INFO] ..SUCCESS (7.6 s)
[INFO] Building: property-setting-cli/pom.xml
[INFO] ..SUCCESS (5.6 s)
[INFO] Building: build-archetype/pom.xml
[INFO] ..FAILED (3.2 s)
[INFO]   The build exited with code 1. See <https://builds.apache.org/job/maven-archetype-m2/ws/maven-archetype-plugin/target/it/build-archetype/build.log>
for details.
[INFO] -------------------------------------------------
[INFO] Build Summary:
[INFO]   Passed: 2, Failed: 1, Errors: 0, Skipped: 0
[INFO] -------------------------------------------------
[ERROR] The following builds failed:
[ERROR] *  build-archetype/pom.xml
[INFO] -------------------------------------------------
[JENKINS] Archiving <https://builds.apache.org/job/maven-archetype-m2/ws/maven-archetype-plugin/pom.xml>
to /home/hudson/hudson/jobs/maven-archetype-m2/modules/org.apache.maven.plugins$maven-archetype-plugin/builds/2011-11-10_20-09-41/archive/org.apache.maven.plugins/maven-archetype-plugin/2.2-SNAPSHOT/maven-archetype-plugin-2.2-SNAPSHOT.pom
[JENKINS] Archiving <https://builds.apache.org/job/maven-archetype-m2/ws/maven-archetype-plugin/target/maven-archetype-plugin-2.2-SNAPSHOT.jar>
to /home/hudson/hudson/jobs/maven-archetype-m2/modules/org.apache.maven.plugins$maven-archetype-plugin/builds/2011-11-10_20-09-41/archive/org.apache.maven.plugins/maven-archetype-plugin/2.2-SNAPSHOT/maven-archetype-plugin-2.2-SNAPSHOT.jar
[INFO] 
[INFO] 
[INFO] ------------------------------------------------------------------------
[INFO] Reactor Summary:
[INFO] ------------------------------------------------------------------------
[INFO] Maven Archetype ....................................... SUCCESS [30.075s]
[INFO] Maven Archetype Testing ............................... SUCCESS [0.262s]
[INFO] Maven Archetype Webapp Proxy .......................... SUCCESS [4.105s]
[INFO] Maven Archetype Webapp Repository ..................... SUCCESS [1.365s]
[INFO] Maven Archetype Models ................................ SUCCESS [0.266s]
[INFO] Maven Archetype Catalog Model ......................... SUCCESS [2.512s]
[INFO] Maven Archetype Descriptor Model ...................... SUCCESS [1.283s]
[INFO] Maven Archetype Registry Model ........................ SUCCESS [1.201s]
[INFO] Maven Archetype Common ................................ SUCCESS [45.626s]
[INFO] Maven Archetype Packaging ............................. SUCCESS [0.740s]
[INFO] Maven Archetype Plugin ................................ FAILED [31.162s]
[INFO] ------------------------------------------------------------------------
[INFO] Error for project: Maven Archetype Plugin (during install)
[INFO] ------------------------------------------------------------------------
[INFO] : org.apache.maven.plugin.invoker.InvokerSession@66c2c9
1 build failed.
[INFO] ------------------------------------------------------------------------
[INFO] Trace
org.apache.maven.BuildFailureException: 1 build failed.
	at org.apache.maven.lifecycle.DefaultLifecycleExecutor.executeGoals(DefaultLifecycleExecutor.java:715)
	at org.apache.maven.lifecycle.DefaultLifecycleExecutor.executeGoalWithLifecycle(DefaultLifecycleExecutor.java:556)
	at org.apache.maven.lifecycle.DefaultLifecycleExecutor.executeGoal(DefaultLifecycleExecutor.java:535)
	at org.apache.maven.lifecycle.DefaultLifecycleExecutor.executeGoalAndHandleFailures(DefaultLifecycleExecutor.java:387)
	at org.apache.maven.lifecycle.DefaultLifecycleExecutor.executeTaskSegments(DefaultLifecycleExecutor.java:348)
	at org.apache.maven.lifecycle.DefaultLifecycleExecutor.execute(DefaultLifecycleExecutor.java:180)
	at org.apache.maven.lifecycle.LifecycleExecutorInterceptor.execute(LifecycleExecutorInterceptor.java:65)
	at org.apache.maven.DefaultMaven.doExecute(DefaultMaven.java:328)
	at org.apache.maven.DefaultMaven.execute(DefaultMaven.java:138)
	at org.apache.maven.cli.MavenCli.main(MavenCli.java:362)
	at sun.reflect.NativeMethodAccessorImpl.invoke0(Native Method)
	at sun.reflect.NativeMethodAccessorImpl.invoke(NativeMethodAccessorImpl.java:39)
	at sun.reflect.DelegatingMethodAccessorImpl.invoke(DelegatingMethodAccessorImpl.java:25)
	at java.lang.reflect.Method.invoke(Method.java:592)
	at org.codehaus.classworlds.Launcher.launchEnhanced(Launcher.java:315)
	at org.codehaus.classworlds.Launcher.launch(Launcher.java:255)
	at hudson.maven.agent.Main.launch(Main.java:185)
	at hudson.maven.MavenBuilder.call(MavenBuilder.java:160)
	at hudson.maven.MavenModuleSetBuild$Builder.call(MavenModuleSetBuild.java:1059)
	at hudson.maven.MavenModuleSetBuild$Builder.call(MavenModuleSetBuild.java:990)
	at hudson.remoting.UserRequest.perform(UserRequest.java:118)
	at hudson.remoting.UserRequest.perform(UserRequest.java:48)
	at hudson.remoting.Request$2.run(Request.java:287)
	at java.util.concurrent.Executors$RunnableAdapter.call(Executors.java:417)
	at java.util.concurrent.FutureTask$Sync.innerRun(FutureTask.java:269)
	at java.util.concurrent.FutureTask.run(FutureTask.java:123)
	at java.util.concurrent.ThreadPoolExecutor$Worker.runTask(ThreadPoolExecutor.java:651)
	at java.util.concurrent.ThreadPoolExecutor$Worker.run(ThreadPoolExecutor.java:676)
	at java.lang.Thread.run(Thread.java:595)
Caused by: org.apache.maven.plugin.MojoFailureException: 1 build failed.
	at org.apache.maven.plugin.invoker.InvokerSession.handleFailures(InvokerSession.java:263)
	at org.apache.maven.plugin.invoker.InvokerMojo.processResults(InvokerMojo.java:58)
	at org.apache.maven.plugin.invoker.AbstractInvokerMojo.execute(AbstractInvokerMojo.java:620)
	at org.apache.maven.plugin.DefaultPluginManager.executeMojo(DefaultPluginManager.java:490)
	at hudson.maven.agent.PluginManagerInterceptor.executeMojo(PluginManagerInterceptor.java:182)
	at org.apache.maven.lifecycle.DefaultLifecycleExecutor.executeGoals(DefaultLifecycleExecutor.java:694)
	... 28 more
[INFO] ------------------------------------------------------------------------
[INFO] BUILD ERRORS
[INFO] ------------------------------------------------------------------------
[INFO] Total time: 2 minutes 15 seconds
[INFO] Finished at: Thu Nov 10 20:12:23 UTC 2011
[INFO] Final Memory: 86M/187M
[INFO] ------------------------------------------------------------------------
Waiting for Jenkins to finish collecting data
Sending e-mails to: notifications@maven.apache.org
channel stopped


Mime
View raw message