maven-notifications mailing list archives

Site index · List index
Message view « Date » · « Thread »
Top « Date » · « Thread »
From Apache Jenkins Server <jenk...@builds.apache.org>
Subject Build failed in Jenkins: maven-plugins-ITs-m3 #274
Date Sat, 12 Nov 2011 22:30:29 GMT
See <https://builds.apache.org/job/maven-plugins-ITs-m3/274/changes>

Changes:

[olamy] exception has changed in script interpreter component and a bit of formatting

------------------------------------------
[...truncated 8498 lines...]
[INFO] --- maven-plugin-plugin:2.7:descriptor (default-descriptor) @ maven-remote-resources-plugin
---
[INFO] Using 'UTF-8' encoding to read mojo metadata.
[INFO] Applying mojo extractor for language: java
[INFO] Mojo extractor for language: java found 3 mojo descriptors.
[INFO] Applying mojo extractor for language: bsh
[INFO] Mojo extractor for language: bsh found 0 mojo descriptors.
[INFO] 
[INFO] --- maven-remote-resources-plugin:1.1:process (default) @ maven-remote-resources-plugin
---
[INFO] 
[INFO] --- maven-resources-plugin:2.4.3:resources (default-resources) @ maven-remote-resources-plugin
---
[INFO] Using 'UTF-8' encoding to copy filtered resources.
[INFO] Copying 1 resource
[INFO] Copying 3 resources
[INFO] 
[INFO] --- maven-compiler-plugin:2.3.2:compile (default-compile) @ maven-remote-resources-plugin
---
[INFO] Compiling 11 source files to <https://builds.apache.org/job/maven-plugins-ITs-m3/ws/maven-remote-resources-plugin/target/classes>
[INFO] 
[INFO] --- maven-resources-plugin:2.4.3:testResources (default-testResources) @ maven-remote-resources-plugin
---
[INFO] Using 'UTF-8' encoding to copy filtered resources.
[INFO] Copying 7 resources
[INFO] Copying 42 resources
[INFO] Copying 1 resource
[INFO] Copying 3 resources
[INFO] 
[INFO] --- maven-compiler-plugin:2.3.2:testCompile (default-testCompile) @ maven-remote-resources-plugin
---
[INFO] Compiling 17 source files to <https://builds.apache.org/job/maven-plugins-ITs-m3/ws/maven-remote-resources-plugin/target/test-classes>
[INFO] 
[INFO] --- maven-surefire-plugin:2.7.2:test (default-test) @ maven-remote-resources-plugin
---
[INFO] Surefire report directory: <https://builds.apache.org/job/maven-plugins-ITs-m3/ws/maven-remote-resources-plugin/target/surefire-reports>

-------------------------------------------------------
 T E S T S
-------------------------------------------------------
Running org.apache.maven.plugin.resources.remote.RemoteResourcesMojoTest
[INFO] ..SUCCESS (7.5 s)
[INFO] Building: empty-report-set/pom.xml
Tests run: 8, Failures: 0, Errors: 0, Skipped: 0, Time elapsed: 1.107 sec

Results :

Tests run: 8, Failures: 0, Errors: 0, Skipped: 0

[INFO] 
[INFO] --- maven-jar-plugin:2.3.1:jar (default-jar) @ maven-remote-resources-plugin ---
[INFO] Building jar: <https://builds.apache.org/job/maven-plugins-ITs-m3/ws/maven-remote-resources-plugin/target/maven-remote-resources-plugin-1.3-SNAPSHOT.jar>
[INFO] 
[INFO] --- maven-plugin-plugin:2.7:addPluginArtifactMetadata (default-addPluginArtifactMetadata)
@ maven-remote-resources-plugin ---
[INFO] 
[INFO] --- maven-invoker-plugin:1.5:install (install-descriptor) @ maven-remote-resources-plugin
---
[INFO] Installing <https://builds.apache.org/job/maven-plugins-ITs-m3/ws/maven-remote-resources-plugin/pom.xml>
to <https://builds.apache.org/job/maven-plugins-ITs-m3/ws/maven-remote-resources-plugin/target/it-repo/org/apache/maven/plugins/maven-remote-resources-plugin/1.3-SNAPSHOT/maven-remote-resources-plugin-1.3-SNAPSHOT.pom>
[INFO] Installing <https://builds.apache.org/job/maven-plugins-ITs-m3/ws/maven-remote-resources-plugin/target/maven-remote-resources-plugin-1.3-SNAPSHOT.jar>
to <https://builds.apache.org/job/maven-plugins-ITs-m3/ws/maven-remote-resources-plugin/target/it-repo/org/apache/maven/plugins/maven-remote-resources-plugin/1.3-SNAPSHOT/maven-remote-resources-plugin-1.3-SNAPSHOT.jar>
[INFO] 
[INFO] --- maven-failsafe-plugin:2.9:integration-test (integration-tests) @ maven-remote-resources-plugin
---
[INFO] Failsafe report directory: <https://builds.apache.org/job/maven-plugins-ITs-m3/ws/maven-remote-resources-plugin/target/failsafe-reports>

-------------------------------------------------------
 T E S T S
-------------------------------------------------------
Running org.apache.maven.plugin.resources.remote.it.IT_GenerateFromOverride
[INFO] ..SUCCESS (3.5 s)
[INFO] Building: MSITE-497/pom.xml
[INFO] ..SUCCESS (59.4 s)
[INFO] 
[INFO] --- maven-jarsigner-plugin:1.2:verify (verify) @ maven-project-info-reports-plugin
---
[INFO] 1 archive(s) processed
[INFO] 
[INFO] --- maven-invoker-plugin:1.5:verify (integration-test) @ maven-project-info-reports-plugin
---
[INFO] -------------------------------------------------
[INFO] Build Summary:
[INFO]   Passed: 2, Failed: 0, Errors: 0, Skipped: 0
[INFO] -------------------------------------------------
[INFO] 
[INFO] --- maven-install-plugin:2.3.1:install (default-install) @ maven-project-info-reports-plugin
---
[INFO] Installing <https://builds.apache.org/job/maven-plugins-ITs-m3/ws/maven-project-info-reports-plugin/target/maven-project-info-reports-plugin-2.4.1-SNAPSHOT.jar>
to /home/jenkins/.m2/repository/org/apache/maven/plugins/maven-project-info-reports-plugin/2.4.1-SNAPSHOT/maven-project-info-reports-plugin-2.4.1-SNAPSHOT.jar
[INFO] Installing <https://builds.apache.org/job/maven-plugins-ITs-m3/ws/maven-project-info-reports-plugin/pom.xml>
to /home/jenkins/.m2/repository/org/apache/maven/plugins/maven-project-info-reports-plugin/2.4.1-SNAPSHOT/maven-project-info-reports-plugin-2.4.1-SNAPSHOT.pom
[INFO]                                                                         
[INFO] ------------------------------------------------------------------------
[INFO] Building Maven Plugins Aggregator 1-SNAPSHOT
[INFO] ------------------------------------------------------------------------
[WARNING] *****************************************************************
[WARNING] * Your build is requesting parallel execution, but project      *
[WARNING] * contains the following plugin(s) that are not marked as       *
[WARNING] * @threadSafe to support parallel building.                     *
[WARNING] * While this /may/ work fine, please look for plugin updates    *
[WARNING] * and/or request plugins be made thread-safe.                   *
[WARNING] * If reporting an issue, report it against the plugin in        *
[WARNING] * question, not against maven-core                              *
[WARNING] *****************************************************************
[WARNING] The following plugins are not marked @threadSafe in Maven Plugins Aggregator:
[WARNING] org.apache.maven.plugins:maven-remote-resources-plugin:1.1
[WARNING] *****************************************************************
[INFO] 
[INFO] --- maven-clean-plugin:2.4.1:clean (default-clean) @ maven-plugins-aggregator ---
[INFO] Deleting <https://builds.apache.org/job/maven-plugins-ITs-m3/ws/target>
[INFO] 
[INFO] --- maven-remote-resources-plugin:1.1:process (default) @ maven-plugins-aggregator
---
[INFO] 
[INFO] --- maven-install-plugin:2.3.1:install (default-install) @ maven-plugins-aggregator
---
[INFO] Installing <https://builds.apache.org/job/maven-plugins-ITs-m3/ws/pom.xml> to
/home/jenkins/.m2/repository/org/apache/maven/plugins/maven-plugins-aggregator/1-SNAPSHOT/maven-plugins-aggregator-1-SNAPSHOT.pom
[INFO] ..SUCCESS (14.9 s)
[INFO] Building: site-attach-descriptor/pom.xml
[INFO] ..SUCCESS (4.4 s)
[INFO] Building: MSITE-312/pom.xml
[INFO] ..SUCCESS (4.6 s)
[INFO] Building: site-stage-deploy/pom.xml
[INFO] ..SUCCESS (10.0 s)
[INFO] Building: site-deploy/pom.xml
[INFO] ..SUCCESS (4.4 s)
[INFO] Building: report-changes-generation/pom.xml
[INFO] ..SUCCESS (17.3 s)
[INFO] Building: full-reporting/pom.xml
[INFO] ..SUCCESS (42.6 s)
[INFO] Building: new-configuration/pom.xml
Tests run: 1, Failures: 0, Errors: 0, Skipped: 0, Time elapsed: 104.443 sec
Running org.apache.maven.plugin.resources.remote.it.IT_CustomFilterDelimiter
Tests run: 1, Failures: 0, Errors: 0, Skipped: 0, Time elapsed: 2.426 sec
Running org.apache.maven.plugin.resources.remote.it.IT_RunOnlyAtExecutionRoot
[INFO] ..SUCCESS (7.2 s)
[INFO] Building: top-parent-different-site/pom.xml
[INFO] ..SUCCESS (5.0 s)
[INFO] Building: MSITE-265/pom.xml
Tests run: 1, Failures: 0, Errors: 0, Skipped: 0, Time elapsed: 6.123 sec
Running org.apache.maven.plugin.resources.remote.it.IT_SupplementalArtifact
Tests run: 1, Failures: 0, Errors: 0, Skipped: 0, Time elapsed: 6.173 sec
Running org.apache.maven.plugin.resources.remote.it.IT_GetDependencyProjects
[INFO] ..SUCCESS (8.2 s)
[INFO] Building: validate/pom.xml
Tests run: 1, Failures: 0, Errors: 0, Skipped: 0, Time elapsed: 5.935 sec
Running org.apache.maven.plugin.resources.remote.it.IT_BadDependencyPoms
[INFO] ..SUCCESS (4.4 s)
[INFO] Building: site-skip/pom.xml
Tests run: 1, Failures: 0, Errors: 0, Skipped: 0, Time elapsed: 2.755 sec
Running org.apache.maven.plugin.resources.remote.it.IT_GenerateFromBundle
[INFO] ..SUCCESS (4.7 s)
[INFO] Building: site-inheritance/pom.xml
Tests run: 1, Failures: 0, Errors: 0, Skipped: 0, Time elapsed: 2.345 sec
Running org.apache.maven.plugin.resources.remote.it.IT_FilterLocalOverride
Tests run: 1, Failures: 0, Errors: 0, Skipped: 0, Time elapsed: 2.435 sec

Results :

Tests run: 8, Failures: 0, Errors: 0, Skipped: 0

[WARNING] File encoding has not been set, using platform encoding ANSI_X3.4-1968, i.e. build
is platform dependent!
[INFO] 
[INFO] --- maven-failsafe-plugin:2.9:verify (integration-tests) @ maven-remote-resources-plugin
---
[INFO] Failsafe report directory: <https://builds.apache.org/job/maven-plugins-ITs-m3/ws/maven-remote-resources-plugin/target/failsafe-reports>
[WARNING] File encoding has not been set, using platform encoding ANSI_X3.4-1968, i.e. build
is platform dependent!
[INFO] 
[INFO] --- maven-install-plugin:2.3.1:install (default-install) @ maven-remote-resources-plugin
---
[INFO] Installing <https://builds.apache.org/job/maven-plugins-ITs-m3/ws/maven-remote-resources-plugin/target/maven-remote-resources-plugin-1.3-SNAPSHOT.jar>
to /home/jenkins/.m2/repository/org/apache/maven/plugins/maven-remote-resources-plugin/1.3-SNAPSHOT/maven-remote-resources-plugin-1.3-SNAPSHOT.jar
[INFO] Installing <https://builds.apache.org/job/maven-plugins-ITs-m3/ws/maven-remote-resources-plugin/pom.xml>
to /home/jenkins/.m2/repository/org/apache/maven/plugins/maven-remote-resources-plugin/1.3-SNAPSHOT/maven-remote-resources-plugin-1.3-SNAPSHOT.pom
[INFO] ..SUCCESS (7.7 s)
[INFO] Building: MSITE-322/pom.xml
[INFO] ..SUCCESS (7.1 s)
[INFO] Building: surefire-report/pom.xml
[INFO] ..SUCCESS (5.9 s)
[INFO] Building: MSITE-566/pom.xml
[INFO] ..SUCCESS (3.7 s)
[INFO] Building: MSITE-456/pom.xml
[INFO] ..SUCCESS (4.7 s)
[INFO] Building: MSITE-304/pom.xml
[INFO] ..SUCCESS (6.7 s)
[INFO] Building: MSITE-609/pom.xml
[INFO] ..SUCCESS (4.5 s)
[INFO] Building: MSITE-512/pom.xml
[INFO] ..SUCCESS (5.4 s)
[INFO] Building: MSITE-458/pom.xml
[INFO] ..SUCCESS (10.0 s)
[INFO] Building: MSITE-550/pom.xml
[INFO] ..SUCCESS (2.9 s)
[INFO] 
[INFO] --- maven-invoker-plugin:1.5:verify (integration-test) @ maven-site-plugin ---
[INFO] -------------------------------------------------
[INFO] Build Summary:
[INFO]   Passed: 38, Failed: 0, Errors: 0, Skipped: 1
[INFO] -------------------------------------------------
[INFO] 
[INFO] --- maven-install-plugin:2.3.1:install (default-install) @ maven-site-plugin ---
[INFO] Installing <https://builds.apache.org/job/maven-plugins-ITs-m3/ws/maven-site-plugin/target/maven-site-plugin-3.1-SNAPSHOT.jar>
to /home/jenkins/.m2/repository/org/apache/maven/plugins/maven-site-plugin/3.1-SNAPSHOT/maven-site-plugin-3.1-SNAPSHOT.jar
[INFO] Installing <https://builds.apache.org/job/maven-plugins-ITs-m3/ws/maven-site-plugin/dependency-reduced-pom.xml>
to /home/jenkins/.m2/repository/org/apache/maven/plugins/maven-site-plugin/3.1-SNAPSHOT/maven-site-plugin-3.1-SNAPSHOT.pom
[INFO] ------------------------------------------------------------------------
[INFO] Reactor Summary:
[INFO] 
[INFO] Maven Plugins ..................................... SUCCESS [29.573s]
[INFO] Maven ACR Plugin .................................. SUCCESS [52.153s]
[INFO] Maven Ant Plugin .................................. SUCCESS [1:55.870s]
[INFO] Maven AntRun Plugin ............................... SUCCESS [1:11.752s]
[INFO] Maven Eclipse Plugin .............................. SUCCESS [11:22.039s]
[INFO] Maven Assembly Plugin ............................. SUCCESS [14:08.777s]
[INFO] Maven Changelog Plugin ............................ SUCCESS [44.698s]
[INFO] Maven Changes Report Plugin ....................... SUCCESS [1:27.877s]
[INFO] Maven Checkstyle Plugin ........................... SUCCESS [1:30.629s]
[INFO] Maven Clean Plugin ................................ SUCCESS [26.130s]
[INFO] Maven Compiler Plugin ............................. SUCCESS [26.172s]
[INFO] Maven Dependency Plugin ........................... SUCCESS [2:23.394s]
[INFO] Maven Deploy Plugin ............................... SUCCESS [1:56.745s]
[INFO] Maven DOAP Plugin ................................. SUCCESS [21.959s]
[INFO] Maven Documentation Checker Plugin ................ SUCCESS [7.156s]
[INFO] Maven EAR Plugin .................................. SUCCESS [3:44.316s]
[INFO] Maven EJB Plugin .................................. SUCCESS [29.358s]
[INFO] Maven GPG Plugin .................................. SUCCESS [43.797s]
[INFO] Maven Help Plugin ................................. SUCCESS [40.021s]
[INFO] Maven IDEA Plugin ................................. SUCCESS [7.814s]
[INFO] Maven Install Plugin .............................. SUCCESS [44.267s]
[INFO] Maven JAR Plugin .................................. SUCCESS [1:10.469s]
[INFO] Maven Jarsigner Plugin ............................ SUCCESS [27.247s]
[INFO] Maven Javadoc Plugin .............................. SUCCESS [8:24.444s]
[INFO] Maven Linkcheck Plugin ............................ SUCCESS [2.079s]
[INFO] Maven One Plugin .................................. SUCCESS [3.000s]
[INFO] Maven Patch Plugin ................................ SUCCESS [13.372s]
[INFO] Maven PDF Plugin .................................. SUCCESS [36.879s]
[INFO] Maven PMD Plugin .................................. SUCCESS [41.872s]
[INFO] Maven RAR Plugin .................................. SUCCESS [6.854s]
[INFO] Maven Reactor Plugin .............................. SUCCESS [2.878s]
[INFO] Maven Repository Plugin ........................... SUCCESS [2:52.173s]
[INFO] Maven Resources Plugin ............................ SUCCESS [1:00.413s]
[INFO] Maven Shade Plugin ................................ SUCCESS [2:06.663s]
[INFO] Maven Site Plugin 3 ............................... SUCCESS [7:27.397s]
[INFO] Maven Source Plugin ............................... SUCCESS [35.981s]
[INFO] Maven Stage Plugin ................................ SUCCESS [1.905s]
[INFO] Maven Toolchains Plugin ........................... SUCCESS [1.387s]
[INFO] Maven Verifier Plugin ............................. SUCCESS [10.903s]
[INFO] Maven WAR Plugin .................................. SUCCESS [1:08.440s]
[INFO] Maven Invoker Plugin .............................. FAILURE [9.434s]
[INFO] Maven Project Info Reports Plugin ................. SUCCESS [1:58.190s]
[INFO] Maven Remote Resources Plugin ..................... SUCCESS [2:19.044s]
[INFO] Maven Plugins Aggregator .......................... SUCCESS [0.043s]
[INFO] ------------------------------------------------------------------------
[INFO] BUILD FAILURE
[INFO] ------------------------------------------------------------------------
[INFO] Total time: 27:23.401s (Wall Clock)
[INFO] Finished at: Sat Nov 12 22:30:28 UTC 2011
[INFO] Final Memory: 69M/1002M
[INFO] ------------------------------------------------------------------------
[WARNING] The requested profile "apache.snapshots" could not be activated because it does
not exist.
[ERROR] Failed to execute goal org.apache.maven.plugins:maven-compiler-plugin:2.3.2:compile
(default-compile) on project maven-invoker-plugin: Compilation failure
[ERROR] <https://builds.apache.org/job/maven-plugins-ITs-m3/ws/maven-invoker-plugin/src/main/java/org/apache/maven/plugin/invoker/AbstractInvokerMojo.java>:[1425,8]
exception java.io.IOException is never thrown in body of corresponding try statement
[ERROR] -> [Help 1]
[ERROR] 
[ERROR] To see the full stack trace of the errors, re-run Maven with the -e switch.
[ERROR] Re-run Maven using the -X switch to enable full debug logging.
[ERROR] 
[ERROR] For more information about the errors and possible solutions, please read the following
articles:
[ERROR] [Help 1] http://cwiki.apache.org/confluence/display/MAVEN/MojoFailureException
[ERROR] 
[ERROR] After correcting the problems, you can resume the build with the command
[ERROR]   mvn <goals> -rf :maven-invoker-plugin
Build step 'Invoke top-level Maven targets' marked build as failure


Mime
View raw message