maven-notifications mailing list archives

Site index · List index
Message view « Date » · « Thread »
Top « Date » · « Thread »
From Apache Jenkins Server <jenk...@builds.apache.org>
Subject Build failed in Jenkins: maven-archetype-m2 » Maven Archetype Plugin #80
Date Mon, 14 Nov 2011 04:10:38 GMT
See <https://builds.apache.org/job/maven-archetype-m2/org.apache.maven.plugins$maven-archetype-plugin/80/changes>

Changes:

[bimargulies] ARCHETYPE-391: The defaultEncoding parameter is never used
o filled in the missing call to put it into the request.

------------------------------------------
[INFO] ------------------------------------------------------------------------
[INFO] Building Maven Archetype Plugin
[INFO]    task-segment: [clean, install]
[INFO] ------------------------------------------------------------------------
[INFO] [clean:clean {execution: default-clean}]
[INFO] Deleting <https://builds.apache.org/job/maven-archetype-m2/org.apache.maven.plugins$maven-archetype-plugin/ws/target>
[INFO] [plugin:helpmojo {execution: generated-helpmojo}]
[INFO] Using 'UTF-8' encoding to read mojo metadata.
[INFO] Applying mojo extractor for language: java
[INFO] Mojo extractor for language: java found 7 mojo descriptors.
[INFO] Applying mojo extractor for language: bsh
[INFO] Mojo extractor for language: bsh found 0 mojo descriptors.
[INFO] snapshot org.apache.maven.shared:maven-script-interpreter:1.0-SNAPSHOT: checking for
updates from apache.snapshots
[INFO] [plugin:descriptor {execution: default-descriptor}]
[INFO] Using 'UTF-8' encoding to read mojo metadata.
[INFO] Applying mojo extractor for language: java
[INFO] Mojo extractor for language: java found 8 mojo descriptors.
[INFO] Applying mojo extractor for language: bsh
[INFO] Mojo extractor for language: bsh found 0 mojo descriptors.
[INFO] [remote-resources:process {execution: default}]
[debug] execute contextualize
[INFO] [resources:resources {execution: default-resources}]
[INFO] Using 'UTF-8' encoding to copy filtered resources.
[INFO] skip non existing resourceDirectory <https://builds.apache.org/job/maven-archetype-m2/org.apache.maven.plugins$maven-archetype-plugin/ws/src/main/resources>
[INFO] Copying 3 resources
[INFO] [compiler:compile {execution: default-compile}]
[INFO] Compiling 28 source files to <https://builds.apache.org/job/maven-archetype-m2/org.apache.maven.plugins$maven-archetype-plugin/ws/target/classes>
[INFO] [plexus-component-metadata:generate-metadata {execution: default}]
[INFO] Discovered 8 component descriptors(s)
[debug] execute contextualize
[INFO] [resources:testResources {execution: default-testResources}]
[INFO] Using 'UTF-8' encoding to copy filtered resources.
[INFO] skip non existing resourceDirectory <https://builds.apache.org/job/maven-archetype-m2/org.apache.maven.plugins$maven-archetype-plugin/ws/src/test/resources>
[INFO] Copying 3 resources
[INFO] [compiler:testCompile {execution: default-testCompile}]
[INFO] Compiling 4 source files to <https://builds.apache.org/job/maven-archetype-m2/org.apache.maven.plugins$maven-archetype-plugin/ws/target/test-classes>
[INFO] [surefire:test {execution: default-test}]
[INFO] Surefire report directory: <https://builds.apache.org/job/maven-archetype-m2/org.apache.maven.plugins$maven-archetype-plugin/ws/target/surefire-reports>

-------------------------------------------------------
 T E S T S
-------------------------------------------------------
Running org.apache.maven.archetype.ui.generation.DefaultArchetypeSelectorTest
[INFO] No catalog defined. Using internal catalog
[WARNING] Archetype not found in any catalog. Falling back to central repository (http://repo1.maven.org/maven2).
[WARNING] Use -DarchetypeRepository=<your repository> if archetype's repository is elsewhere.
[INFO] No catalog defined. Using internal catalog
[INFO] No catalog defined. Using internal catalog
[INFO] No archetype defined. Using maven-archetype-quickstart (org.apache.maven.archetypes:maven-archetype-quickstart:1.0)
[INFO] No catalog defined. Using internal catalog
[INFO] No archetype defined. Using maven-archetype-quickstart (org.apache.maven.archetypes:maven-archetype-quickstart:1.0)
[INFO] No catalog defined. Using internal catalog
[INFO] No archetype defined. Using maven-archetype-quickstart (org.apache.maven.archetypes:maven-archetype-quickstart:1.0)
Tests run: 5, Failures: 0, Errors: 0, Skipped: 0, Time elapsed: 1.003 sec
Running org.apache.maven.archetype.ui.generation.RequiredPropertyComparatorTest
Tests run: 2, Failures: 0, Errors: 0, Skipped: 0, Time elapsed: 0.002 sec
Running org.apache.maven.archetype.ui.generation.DefaultArchetypeSelectionQueryerTest
Tests run: 5, Failures: 0, Errors: 0, Skipped: 0, Time elapsed: 0.225 sec
Running org.apache.maven.archetype.ui.generation.DefaultArchetypeGenerationConfiguratorTest
[WARNING] Property groupId is missing. Add -DgroupId=someValue
[WARNING] Property package is missing. Add -Dpackage=someValue
Tests run: 3, Failures: 0, Errors: 0, Skipped: 0, Time elapsed: 0.137 sec

Results :

Tests run: 15, Failures: 0, Errors: 0, Skipped: 0

[JENKINS] Recording test results
[INFO] [jar:jar {execution: default-jar}]
[INFO] Building jar: <https://builds.apache.org/job/maven-archetype-m2/org.apache.maven.plugins$maven-archetype-plugin/ws/target/maven-archetype-plugin-2.2-SNAPSHOT.jar>
[INFO] [plugin:addPluginArtifactMetadata {execution: default-addPluginArtifactMetadata}]
[INFO] [invoker:install {execution: integration-test}]
[INFO] Installing /home/jenkins/jenkins-slave/workspace/maven-archetype-m2/archetype-models/archetype-catalog/pom.xml
to <https://builds.apache.org/job/maven-archetype-m2/org.apache.maven.plugins$maven-archetype-plugin/ws/target/local-repo/org/apache/maven/archetype/archetype-catalog/2.2-SNAPSHOT/archetype-catalog-2.2-SNAPSHOT.pom>
[INFO] Installing /home/jenkins/jenkins-slave/workspace/maven-archetype-m2/archetype-models/archetype-catalog/target/archetype-catalog-2.2-SNAPSHOT.jar
to <https://builds.apache.org/job/maven-archetype-m2/org.apache.maven.plugins$maven-archetype-plugin/ws/target/local-repo/org/apache/maven/archetype/archetype-catalog/2.2-SNAPSHOT/archetype-catalog-2.2-SNAPSHOT.jar>
[INFO] Installing /home/jenkins/jenkins-slave/workspace/maven-archetype-m2/archetype-models/pom.xml
to <https://builds.apache.org/job/maven-archetype-m2/org.apache.maven.plugins$maven-archetype-plugin/ws/target/local-repo/org/apache/maven/archetype/archetype-models/2.2-SNAPSHOT/archetype-models-2.2-SNAPSHOT.pom>
[INFO] Installing /home/jenkins/jenkins-slave/workspace/maven-archetype-m2/pom.xml to <https://builds.apache.org/job/maven-archetype-m2/org.apache.maven.plugins$maven-archetype-plugin/ws/target/local-repo/org/apache/maven/archetype/maven-archetype/2.2-SNAPSHOT/maven-archetype-2.2-SNAPSHOT.pom>
[INFO] Installing /home/jenkins/jenkins-slave/workspace/maven-archetype-m2/archetype-models/archetype-descriptor/pom.xml
to <https://builds.apache.org/job/maven-archetype-m2/org.apache.maven.plugins$maven-archetype-plugin/ws/target/local-repo/org/apache/maven/archetype/archetype-descriptor/2.2-SNAPSHOT/archetype-descriptor-2.2-SNAPSHOT.pom>
[INFO] Installing /home/jenkins/jenkins-slave/workspace/maven-archetype-m2/archetype-models/archetype-descriptor/target/archetype-descriptor-2.2-SNAPSHOT.jar
to <https://builds.apache.org/job/maven-archetype-m2/org.apache.maven.plugins$maven-archetype-plugin/ws/target/local-repo/org/apache/maven/archetype/archetype-descriptor/2.2-SNAPSHOT/archetype-descriptor-2.2-SNAPSHOT.jar>
[INFO] Installing /home/jenkins/jenkins-slave/workspace/maven-archetype-m2/archetype-models/archetype-registry/pom.xml
to <https://builds.apache.org/job/maven-archetype-m2/org.apache.maven.plugins$maven-archetype-plugin/ws/target/local-repo/org/apache/maven/archetype/archetype-registry/2.2-SNAPSHOT/archetype-registry-2.2-SNAPSHOT.pom>
[INFO] Installing /home/jenkins/jenkins-slave/workspace/maven-archetype-m2/archetype-models/archetype-registry/target/archetype-registry-2.2-SNAPSHOT.jar
to <https://builds.apache.org/job/maven-archetype-m2/org.apache.maven.plugins$maven-archetype-plugin/ws/target/local-repo/org/apache/maven/archetype/archetype-registry/2.2-SNAPSHOT/archetype-registry-2.2-SNAPSHOT.jar>
[INFO] Installing /home/jenkins/jenkins-slave/workspace/maven-archetype-m2/archetype-common/pom.xml
to <https://builds.apache.org/job/maven-archetype-m2/org.apache.maven.plugins$maven-archetype-plugin/ws/target/local-repo/org/apache/maven/archetype/archetype-common/2.2-SNAPSHOT/archetype-common-2.2-SNAPSHOT.pom>
[INFO] Installing /home/jenkins/jenkins-slave/workspace/maven-archetype-m2/archetype-common/target/archetype-common-2.2-SNAPSHOT.jar
to <https://builds.apache.org/job/maven-archetype-m2/org.apache.maven.plugins$maven-archetype-plugin/ws/target/local-repo/org/apache/maven/archetype/archetype-common/2.2-SNAPSHOT/archetype-common-2.2-SNAPSHOT.jar>
[INFO] Installing <https://builds.apache.org/job/maven-archetype-m2/org.apache.maven.plugins$maven-archetype-plugin/ws/pom.xml>
to <https://builds.apache.org/job/maven-archetype-m2/org.apache.maven.plugins$maven-archetype-plugin/ws/target/local-repo/org/apache/maven/plugins/maven-archetype-plugin/2.2-SNAPSHOT/maven-archetype-plugin-2.2-SNAPSHOT.pom>
[INFO] Installing <https://builds.apache.org/job/maven-archetype-m2/org.apache.maven.plugins$maven-archetype-plugin/ws/target/maven-archetype-plugin-2.2-SNAPSHOT.jar>
to <https://builds.apache.org/job/maven-archetype-m2/org.apache.maven.plugins$maven-archetype-plugin/ws/target/local-repo/org/apache/maven/plugins/maven-archetype-plugin/2.2-SNAPSHOT/maven-archetype-plugin-2.2-SNAPSHOT.jar>
[INFO] [invoker:run {execution: integration-test}]
[INFO] Building: create-from-project/pom.xml
[INFO] ..SUCCESS (7.6 s)
[INFO] Building: property-setting-cli/pom.xml
[INFO] ..SUCCESS (5.6 s)
[INFO] Building: build-archetype/pom.xml
[INFO] ..FAILED (3.2 s)
[INFO]   The build exited with code 1. See <https://builds.apache.org/job/maven-archetype-m2/org.apache.maven.plugins$maven-archetype-plugin/ws/target/it/build-archetype/build.log>
for details.
[INFO] -------------------------------------------------
[INFO] Build Summary:
[INFO]   Passed: 2, Failed: 1, Errors: 0, Skipped: 0
[INFO] -------------------------------------------------
[ERROR] The following builds failed:
[ERROR] *  build-archetype/pom.xml
[INFO] -------------------------------------------------
[JENKINS] Archiving <https://builds.apache.org/job/maven-archetype-m2/org.apache.maven.plugins$maven-archetype-plugin/ws/pom.xml>
to /home/hudson/hudson/jobs/maven-archetype-m2/modules/org.apache.maven.plugins$maven-archetype-plugin/builds/2011-11-14_04-05-48/archive/org.apache.maven.plugins/maven-archetype-plugin/2.2-SNAPSHOT/maven-archetype-plugin-2.2-SNAPSHOT.pom
[JENKINS] Archiving <https://builds.apache.org/job/maven-archetype-m2/org.apache.maven.plugins$maven-archetype-plugin/ws/target/maven-archetype-plugin-2.2-SNAPSHOT.jar>
to /home/hudson/hudson/jobs/maven-archetype-m2/modules/org.apache.maven.plugins$maven-archetype-plugin/builds/2011-11-14_04-05-48/archive/org.apache.maven.plugins/maven-archetype-plugin/2.2-SNAPSHOT/maven-archetype-plugin-2.2-SNAPSHOT.jar
[INFO] 
[INFO] 
[INFO] ------------------------------------------------------------------------
[INFO] Reactor Summary:
[INFO] ------------------------------------------------------------------------
[INFO] Maven Archetype ....................................... SUCCESS [23.981s]
[INFO] Maven Archetype Testing ............................... SUCCESS [0.221s]
[INFO] Maven Archetype Webapp Proxy .......................... SUCCESS [6.457s]
[INFO] Maven Archetype Webapp Repository ..................... SUCCESS [2.538s]
[INFO] Maven Archetype Models ................................ SUCCESS [0.874s]
[INFO] Maven Archetype Catalog Model ......................... SUCCESS [3.213s]
[INFO] Maven Archetype Descriptor Model ...................... SUCCESS [2.857s]
[INFO] Maven Archetype Registry Model ........................ SUCCESS [2.549s]
[INFO] Maven Archetype Common ................................ SUCCESS [2:04.403s]
[INFO] Maven Archetype Packaging ............................. SUCCESS [0.710s]
[INFO] Maven Archetype Plugin ................................ FAILED [25.038s]
[INFO] ------------------------------------------------------------------------
[INFO] Error for project: Maven Archetype Plugin (during install)
[INFO] ------------------------------------------------------------------------
[INFO] : org.apache.maven.plugin.invoker.InvokerSession@1505228
1 build failed.
[INFO] ------------------------------------------------------------------------
[INFO] Trace
org.apache.maven.BuildFailureException: 1 build failed.
	at org.apache.maven.lifecycle.DefaultLifecycleExecutor.executeGoals(DefaultLifecycleExecutor.java:715)
	at org.apache.maven.lifecycle.DefaultLifecycleExecutor.executeGoalWithLifecycle(DefaultLifecycleExecutor.java:556)
	at org.apache.maven.lifecycle.DefaultLifecycleExecutor.executeGoal(DefaultLifecycleExecutor.java:535)
	at org.apache.maven.lifecycle.DefaultLifecycleExecutor.executeGoalAndHandleFailures(DefaultLifecycleExecutor.java:387)
	at org.apache.maven.lifecycle.DefaultLifecycleExecutor.executeTaskSegments(DefaultLifecycleExecutor.java:348)
	at org.apache.maven.lifecycle.DefaultLifecycleExecutor.execute(DefaultLifecycleExecutor.java:180)
	at org.apache.maven.lifecycle.LifecycleExecutorInterceptor.execute(LifecycleExecutorInterceptor.java:65)
	at org.apache.maven.DefaultMaven.doExecute(DefaultMaven.java:328)
	at org.apache.maven.DefaultMaven.execute(DefaultMaven.java:138)
	at org.apache.maven.cli.MavenCli.main(MavenCli.java:362)
	at sun.reflect.NativeMethodAccessorImpl.invoke0(Native Method)
	at sun.reflect.NativeMethodAccessorImpl.invoke(NativeMethodAccessorImpl.java:39)
	at sun.reflect.DelegatingMethodAccessorImpl.invoke(DelegatingMethodAccessorImpl.java:25)
	at java.lang.reflect.Method.invoke(Method.java:592)
	at org.codehaus.classworlds.Launcher.launchEnhanced(Launcher.java:315)
	at org.codehaus.classworlds.Launcher.launch(Launcher.java:255)
	at hudson.maven.agent.Main.launch(Main.java:185)
	at hudson.maven.MavenBuilder.call(MavenBuilder.java:160)
	at hudson.maven.MavenModuleSetBuild$Builder.call(MavenModuleSetBuild.java:1059)
	at hudson.maven.MavenModuleSetBuild$Builder.call(MavenModuleSetBuild.java:990)
	at hudson.remoting.UserRequest.perform(UserRequest.java:118)
	at hudson.remoting.UserRequest.perform(UserRequest.java:48)
	at hudson.remoting.Request$2.run(Request.java:287)
	at java.util.concurrent.Executors$RunnableAdapter.call(Executors.java:417)
	at java.util.concurrent.FutureTask$Sync.innerRun(FutureTask.java:269)
	at java.util.concurrent.FutureTask.run(FutureTask.java:123)
	at java.util.concurrent.ThreadPoolExecutor$Worker.runTask(ThreadPoolExecutor.java:651)
	at java.util.concurrent.ThreadPoolExecutor$Worker.run(ThreadPoolExecutor.java:676)
	at java.lang.Thread.run(Thread.java:595)
Caused by: org.apache.maven.plugin.MojoFailureException: 1 build failed.
	at org.apache.maven.plugin.invoker.InvokerSession.handleFailures(InvokerSession.java:263)
	at org.apache.maven.plugin.invoker.InvokerMojo.processResults(InvokerMojo.java:58)
	at org.apache.maven.plugin.invoker.AbstractInvokerMojo.execute(AbstractInvokerMojo.java:620)
	at org.apache.maven.plugin.DefaultPluginManager.executeMojo(DefaultPluginManager.java:490)
	at hudson.maven.agent.PluginManagerInterceptor.executeMojo(PluginManagerInterceptor.java:182)
	at org.apache.maven.lifecycle.DefaultLifecycleExecutor.executeGoals(DefaultLifecycleExecutor.java:694)
	... 28 more
[INFO] ------------------------------------------------------------------------
[INFO] BUILD ERRORS
[INFO] ------------------------------------------------------------------------
[INFO] Total time: 4 minutes 21 seconds
[INFO] Finished at: Mon Nov 14 04:10:38 UTC 2011
[INFO] Final Memory: 89M/216M
[INFO] ------------------------------------------------------------------------


Mime
View raw message