maven-notifications mailing list archives

Site index · List index
Message view « Date » · « Thread »
Top « Date » · « Thread »
From Apache Jenkins Server <jenk...@builds.apache.org>
Subject Build failed in Jenkins: maven-plugins-ITs-m3 #250
Date Wed, 26 Oct 2011 19:50:10 GMT
See <https://builds.apache.org/job/maven-plugins-ITs-m3/250/changes>

Changes:

[carlos] [MDEP-333] Add a test for the remoteRepositories parameter and fix issue found with
parsing

------------------------------------------
[...truncated 8603 lines...]
[INFO] --- modello-maven-plugin:1.4.1:xpp3-writer (supplemental-models) @ maven-remote-resources-plugin
---
[INFO] outputDirectory: <https://builds.apache.org/job/maven-plugins-ITs-m3/ws/maven-remote-resources-plugin/target/generated-sources/modello>
[INFO] Working on model: src/main/mdo/supplemental-model.mdo
[INFO] Generating current version: 1.0.0
[INFO] 
[INFO] --- modello-maven-plugin:1.4.1:java (supplemental-models) @ maven-remote-resources-plugin
---
[INFO] outputDirectory: <https://builds.apache.org/job/maven-plugins-ITs-m3/ws/maven-remote-resources-plugin/target/generated-sources/modello>
[INFO] Working on model: src/main/mdo/supplemental-model.mdo
[INFO] Generating current version: 1.0.0
[INFO] 
[INFO] --- modello-maven-plugin:1.4.1:xpp3-reader (supplemental-models) @ maven-remote-resources-plugin
---
[INFO] outputDirectory: <https://builds.apache.org/job/maven-plugins-ITs-m3/ws/maven-remote-resources-plugin/target/generated-sources/modello>
[INFO] Working on model: src/main/mdo/supplemental-model.mdo
[INFO] Generating current version: 1.0.0
[INFO] 
[INFO] --- maven-plugin-plugin:2.7:descriptor (default-descriptor) @ maven-remote-resources-plugin
---
[INFO] Using 'UTF-8' encoding to read mojo metadata.
[INFO] Applying mojo extractor for language: java
[INFO] Mojo extractor for language: java found 3 mojo descriptors.
[INFO] Applying mojo extractor for language: bsh
[INFO] Mojo extractor for language: bsh found 0 mojo descriptors.
[INFO] 
[INFO] --- maven-remote-resources-plugin:1.1:process (default) @ maven-remote-resources-plugin
---
[INFO] 
[INFO] --- maven-resources-plugin:2.4.3:resources (default-resources) @ maven-remote-resources-plugin
---
[INFO] Using 'UTF-8' encoding to copy filtered resources.
[INFO] Copying 1 resource
[INFO] Copying 3 resources
[INFO] 
[INFO] --- maven-compiler-plugin:2.3.2:compile (default-compile) @ maven-remote-resources-plugin
---
[INFO] Compiling 11 source files to <https://builds.apache.org/job/maven-plugins-ITs-m3/ws/maven-remote-resources-plugin/target/classes>
[INFO] 
[INFO] --- maven-resources-plugin:2.4.3:testResources (default-testResources) @ maven-remote-resources-plugin
---
[INFO] Using 'UTF-8' encoding to copy filtered resources.
[INFO] Copying 7 resources
[INFO] Copying 42 resources
[INFO] Copying 1 resource
[INFO] Copying 3 resources
[INFO] 
[INFO] --- maven-compiler-plugin:2.3.2:testCompile (default-testCompile) @ maven-remote-resources-plugin
---
[INFO] Compiling 17 source files to <https://builds.apache.org/job/maven-plugins-ITs-m3/ws/maven-remote-resources-plugin/target/test-classes>
[INFO] 
[INFO] --- maven-surefire-plugin:2.7.2:test (default-test) @ maven-remote-resources-plugin
---
[INFO] Surefire report directory: <https://builds.apache.org/job/maven-plugins-ITs-m3/ws/maven-remote-resources-plugin/target/surefire-reports>

-------------------------------------------------------
 T E S T S
-------------------------------------------------------
Running org.apache.maven.plugin.resources.remote.RemoteResourcesMojoTest
Tests run: 8, Failures: 0, Errors: 0, Skipped: 0, Time elapsed: 1.199 sec

Results :

Tests run: 8, Failures: 0, Errors: 0, Skipped: 0

[INFO] 
[INFO] --- maven-jar-plugin:2.3.1:jar (default-jar) @ maven-remote-resources-plugin ---
[INFO] Building jar: <https://builds.apache.org/job/maven-plugins-ITs-m3/ws/maven-remote-resources-plugin/target/maven-remote-resources-plugin-1.3-SNAPSHOT.jar>
[INFO] 
[INFO] --- maven-plugin-plugin:2.7:addPluginArtifactMetadata (default-addPluginArtifactMetadata)
@ maven-remote-resources-plugin ---
[INFO] 
[INFO] --- maven-invoker-plugin:1.5:install (install-descriptor) @ maven-remote-resources-plugin
---
[INFO] Installing <https://builds.apache.org/job/maven-plugins-ITs-m3/ws/maven-remote-resources-plugin/pom.xml>
to <https://builds.apache.org/job/maven-plugins-ITs-m3/ws/maven-remote-resources-plugin/target/it-repo/org/apache/maven/plugins/maven-remote-resources-plugin/1.3-SNAPSHOT/maven-remote-resources-plugin-1.3-SNAPSHOT.pom>
[INFO] Installing <https://builds.apache.org/job/maven-plugins-ITs-m3/ws/maven-remote-resources-plugin/target/maven-remote-resources-plugin-1.3-SNAPSHOT.jar>
to <https://builds.apache.org/job/maven-plugins-ITs-m3/ws/maven-remote-resources-plugin/target/it-repo/org/apache/maven/plugins/maven-remote-resources-plugin/1.3-SNAPSHOT/maven-remote-resources-plugin-1.3-SNAPSHOT.jar>
[INFO] 
[INFO] --- maven-failsafe-plugin:2.9:integration-test (integration-tests) @ maven-remote-resources-plugin
---
[INFO] Failsafe report directory: <https://builds.apache.org/job/maven-plugins-ITs-m3/ws/maven-remote-resources-plugin/target/failsafe-reports>

-------------------------------------------------------
 T E S T S
-------------------------------------------------------
Running org.apache.maven.plugin.resources.remote.it.IT_GenerateFromOverride
[INFO] ..SUCCESS (7.5 s)
[INFO] Building: top-parent-different-site/pom.xml
[INFO] ..SUCCESS (5.0 s)
[INFO] Building: MSITE-265/pom.xml
[INFO] ..SUCCESS (25.3 s)
[INFO] Building: full-pom/pom.xml
[INFO] ..SUCCESS (10.0 s)
[INFO] Building: validate/pom.xml
[INFO] ..SUCCESS (4.4 s)
[INFO] Building: site-skip/pom.xml
[INFO] ..SUCCESS (5.0 s)
[INFO] Building: site-inheritance/pom.xml
[INFO] ..SUCCESS (8.7 s)
[INFO] Building: MSITE-322/pom.xml
[INFO] ..SUCCESS (7.3 s)
[INFO] Building: surefire-report/pom.xml
[INFO] ..SUCCESS (6.8 s)
[INFO] Building: MSITE-566/pom.xml
[INFO] ..SUCCESS (3.4 s)
[INFO] Building: MSITE-456/pom.xml
[INFO] ..SUCCESS (4.7 s)
[INFO] Building: MSITE-304/pom.xml
[INFO] ..SUCCESS (6.5 s)
[INFO] Building: MSITE-609/pom.xml
[INFO] ..SUCCESS (5.3 s)
[INFO] Building: MSITE-512/pom.xml
[INFO] ..SUCCESS (5.5 s)
[INFO] Building: MSITE-458/pom.xml
[INFO] ..SUCCESS (66.3 s)
[INFO] 
[INFO] --- maven-jarsigner-plugin:1.2:verify (verify) @ maven-project-info-reports-plugin
---
[INFO] 1 archive(s) processed
[INFO] 
[INFO] --- maven-invoker-plugin:1.5:verify (integration-test) @ maven-project-info-reports-plugin
---
[INFO] -------------------------------------------------
[INFO] Build Summary:
[INFO]   Passed: 2, Failed: 0, Errors: 0, Skipped: 0
[INFO] -------------------------------------------------
[INFO] 
[INFO] --- maven-install-plugin:2.3.1:install (default-install) @ maven-project-info-reports-plugin
---
[INFO] Installing <https://builds.apache.org/job/maven-plugins-ITs-m3/ws/maven-project-info-reports-plugin/target/maven-project-info-reports-plugin-2.4.1-SNAPSHOT.jar>
to /home/jenkins/.m2/repository/org/apache/maven/plugins/maven-project-info-reports-plugin/2.4.1-SNAPSHOT/maven-project-info-reports-plugin-2.4.1-SNAPSHOT.jar
[INFO] Installing <https://builds.apache.org/job/maven-plugins-ITs-m3/ws/maven-project-info-reports-plugin/pom.xml>
to /home/jenkins/.m2/repository/org/apache/maven/plugins/maven-project-info-reports-plugin/2.4.1-SNAPSHOT/maven-project-info-reports-plugin-2.4.1-SNAPSHOT.pom
[INFO]                                                                         
[INFO] ------------------------------------------------------------------------
[INFO] Building Maven Plugins Aggregator 1-SNAPSHOT
[INFO] ------------------------------------------------------------------------
[WARNING] *****************************************************************
[WARNING] * Your build is requesting parallel execution, but project      *
[WARNING] * contains the following plugin(s) that are not marked as       *
[WARNING] * @threadSafe to support parallel building.                     *
[WARNING] * While this /may/ work fine, please look for plugin updates    *
[WARNING] * and/or request plugins be made thread-safe.                   *
[WARNING] * If reporting an issue, report it against the plugin in        *
[WARNING] * question, not against maven-core                              *
[WARNING] *****************************************************************
[WARNING] The following plugins are not marked @threadSafe in Maven Plugins Aggregator:
[WARNING] org.apache.maven.plugins:maven-remote-resources-plugin:1.1
[WARNING] *****************************************************************
[INFO] 
[INFO] --- maven-clean-plugin:2.4.1:clean (default-clean) @ maven-plugins-aggregator ---
[INFO] Deleting <https://builds.apache.org/job/maven-plugins-ITs-m3/ws/target>
[INFO] 
[INFO] --- maven-remote-resources-plugin:1.1:process (default) @ maven-plugins-aggregator
---
[INFO] 
[INFO] --- maven-install-plugin:2.3.1:install (default-install) @ maven-plugins-aggregator
---
[INFO] Installing <https://builds.apache.org/job/maven-plugins-ITs-m3/ws/pom.xml> to
/home/jenkins/.m2/repository/org/apache/maven/plugins/maven-plugins-aggregator/1-SNAPSHOT/maven-plugins-aggregator-1-SNAPSHOT.pom
[INFO] ..SUCCESS (10.1 s)
[INFO] Building: MSITE-550/pom.xml
[INFO] ..SUCCESS (3.2 s)
[INFO] 
[INFO] --- maven-invoker-plugin:1.5:verify (integration-test) @ maven-site-plugin ---
[INFO] -------------------------------------------------
[INFO] Build Summary:
[INFO]   Passed: 38, Failed: 0, Errors: 0, Skipped: 1
[INFO] -------------------------------------------------
[INFO] 
[INFO] --- maven-install-plugin:2.3.1:install (default-install) @ maven-site-plugin ---
[INFO] Installing <https://builds.apache.org/job/maven-plugins-ITs-m3/ws/maven-site-plugin/target/maven-site-plugin-3.1-SNAPSHOT.jar>
to /home/jenkins/.m2/repository/org/apache/maven/plugins/maven-site-plugin/3.1-SNAPSHOT/maven-site-plugin-3.1-SNAPSHOT.jar
[INFO] Installing <https://builds.apache.org/job/maven-plugins-ITs-m3/ws/maven-site-plugin/dependency-reduced-pom.xml>
to /home/jenkins/.m2/repository/org/apache/maven/plugins/maven-site-plugin/3.1-SNAPSHOT/maven-site-plugin-3.1-SNAPSHOT.pom
Tests run: 1, Failures: 0, Errors: 0, Skipped: 0, Time elapsed: 94.065 sec
Running org.apache.maven.plugin.resources.remote.it.IT_CustomFilterDelimiter
Tests run: 1, Failures: 0, Errors: 0, Skipped: 0, Time elapsed: 2.389 sec
Running org.apache.maven.plugin.resources.remote.it.IT_RunOnlyAtExecutionRoot
Tests run: 1, Failures: 0, Errors: 0, Skipped: 0, Time elapsed: 5.929 sec
Running org.apache.maven.plugin.resources.remote.it.IT_SupplementalArtifact
Tests run: 1, Failures: 0, Errors: 0, Skipped: 0, Time elapsed: 6.272 sec
Running org.apache.maven.plugin.resources.remote.it.IT_GetDependencyProjects
Tests run: 1, Failures: 0, Errors: 0, Skipped: 0, Time elapsed: 5.774 sec
Running org.apache.maven.plugin.resources.remote.it.IT_BadDependencyPoms
Tests run: 1, Failures: 0, Errors: 0, Skipped: 0, Time elapsed: 2.66 sec
Running org.apache.maven.plugin.resources.remote.it.IT_GenerateFromBundle
Tests run: 1, Failures: 0, Errors: 0, Skipped: 0, Time elapsed: 2.338 sec
Running org.apache.maven.plugin.resources.remote.it.IT_FilterLocalOverride
Tests run: 1, Failures: 0, Errors: 0, Skipped: 0, Time elapsed: 2.387 sec

Results :

Tests run: 8, Failures: 0, Errors: 0, Skipped: 0

[WARNING] File encoding has not been set, using platform encoding ANSI_X3.4-1968, i.e. build
is platform dependent!
[INFO] 
[INFO] --- maven-failsafe-plugin:2.9:verify (integration-tests) @ maven-remote-resources-plugin
---
[INFO] Failsafe report directory: <https://builds.apache.org/job/maven-plugins-ITs-m3/ws/maven-remote-resources-plugin/target/failsafe-reports>
[WARNING] File encoding has not been set, using platform encoding ANSI_X3.4-1968, i.e. build
is platform dependent!
[INFO] 
[INFO] --- maven-install-plugin:2.3.1:install (default-install) @ maven-remote-resources-plugin
---
[INFO] Installing <https://builds.apache.org/job/maven-plugins-ITs-m3/ws/maven-remote-resources-plugin/target/maven-remote-resources-plugin-1.3-SNAPSHOT.jar>
to /home/jenkins/.m2/repository/org/apache/maven/plugins/maven-remote-resources-plugin/1.3-SNAPSHOT/maven-remote-resources-plugin-1.3-SNAPSHOT.jar
[INFO] Installing <https://builds.apache.org/job/maven-plugins-ITs-m3/ws/maven-remote-resources-plugin/pom.xml>
to /home/jenkins/.m2/repository/org/apache/maven/plugins/maven-remote-resources-plugin/1.3-SNAPSHOT/maven-remote-resources-plugin-1.3-SNAPSHOT.pom
[INFO] ------------------------------------------------------------------------
[INFO] Reactor Summary:
[INFO] 
[INFO] Maven Plugins ..................................... SUCCESS [2.590s]
[INFO] Maven ACR Plugin .................................. SUCCESS [58.043s]
[INFO] Maven Ant Plugin .................................. SUCCESS [1:50.695s]
[INFO] Maven AntRun Plugin ............................... SUCCESS [1:35.144s]
[INFO] Maven Eclipse Plugin .............................. FAILURE [11:34.768s]
[INFO] Maven Assembly Plugin ............................. SUCCESS [14:01.973s]
[INFO] Maven Changelog Plugin ............................ SUCCESS [38.623s]
[INFO] Maven Changes Report Plugin ....................... SUCCESS [1:19.036s]
[INFO] Maven Checkstyle Plugin ........................... SUCCESS [1:29.625s]
[INFO] Maven Clean Plugin ................................ SUCCESS [16.828s]
[INFO] Maven Compiler Plugin ............................. SUCCESS [23.844s]
[INFO] Maven Dependency Plugin ........................... SUCCESS [2:17.977s]
[INFO] Maven Deploy Plugin ............................... SUCCESS [1:56.673s]
[INFO] Maven DOAP Plugin ................................. SUCCESS [18.488s]
[INFO] Maven Documentation Checker Plugin ................ SUCCESS [5.773s]
[INFO] Maven EAR Plugin .................................. SUCCESS [3:48.335s]
[INFO] Maven EJB Plugin .................................. SUCCESS [30.546s]
[INFO] Maven GPG Plugin .................................. SUCCESS [41.889s]
[INFO] Maven Help Plugin ................................. SUCCESS [39.945s]
[INFO] Maven IDEA Plugin ................................. SUCCESS [8.052s]
[INFO] Maven Install Plugin .............................. SUCCESS [42.281s]
[INFO] Maven JAR Plugin .................................. SUCCESS [1:13.449s]
[INFO] Maven Jarsigner Plugin ............................ SUCCESS [27.300s]
[INFO] Maven Javadoc Plugin .............................. SUCCESS [9:16.805s]
[INFO] Maven Linkcheck Plugin ............................ SUCCESS [1.822s]
[INFO] Maven One Plugin .................................. SUCCESS [1.899s]
[INFO] Maven Patch Plugin ................................ SUCCESS [13.536s]
[INFO] Maven PDF Plugin .................................. SUCCESS [35.441s]
[INFO] Maven PMD Plugin .................................. SUCCESS [31.571s]
[INFO] Maven RAR Plugin .................................. SUCCESS [7.217s]
[INFO] Maven Reactor Plugin .............................. SUCCESS [2.121s]
[INFO] Maven Repository Plugin ........................... SUCCESS [2:54.718s]
[INFO] Maven Resources Plugin ............................ SUCCESS [50.500s]
[INFO] Maven Shade Plugin ................................ SUCCESS [1:55.925s]
[INFO] Maven Site Plugin 3 ............................... SUCCESS [7:39.408s]
[INFO] Maven Source Plugin ............................... SUCCESS [36.473s]
[INFO] Maven Stage Plugin ................................ SUCCESS [1.547s]
[INFO] Maven Toolchains Plugin ........................... SUCCESS [1.247s]
[INFO] Maven Verifier Plugin ............................. SUCCESS [8.445s]
[INFO] Maven WAR Plugin .................................. SUCCESS [1:08.219s]
[INFO] Maven Invoker Plugin .............................. SUCCESS [4:03.195s]
[INFO] Maven Project Info Reports Plugin ................. SUCCESS [1:52.650s]
[INFO] Maven Remote Resources Plugin ..................... SUCCESS [2:06.469s]
[INFO] Maven Plugins Aggregator .......................... SUCCESS [0.061s]
[INFO] ------------------------------------------------------------------------
[INFO] BUILD FAILURE
[INFO] ------------------------------------------------------------------------
[INFO] Total time: 27:30.877s (Wall Clock)
[INFO] Finished at: Wed Oct 26 19:50:10 UTC 2011
[INFO] Final Memory: 68M/999M
[INFO] ------------------------------------------------------------------------
[WARNING] The requested profile "apache.snapshots" could not be activated because it does
not exist.
[ERROR] Failed to execute goal org.apache.maven.plugins:maven-failsafe-plugin:2.9:verify (default)
on project maven-eclipse-plugin: There are test failures.
[ERROR] 
[ERROR] Please refer to <https://builds.apache.org/job/maven-plugins-ITs-m3/ws/maven-eclipse-plugin/target/failsafe-reports>
for the individual test results.
[ERROR] -> [Help 1]
[ERROR] 
[ERROR] To see the full stack trace of the errors, re-run Maven with the -e switch.
[ERROR] Re-run Maven using the -X switch to enable full debug logging.
[ERROR] 
[ERROR] For more information about the errors and possible solutions, please read the following
articles:
[ERROR] [Help 1] http://cwiki.apache.org/confluence/display/MAVEN/MojoFailureException
[ERROR] 
[ERROR] After correcting the problems, you can resume the build with the command
[ERROR]   mvn <goals> -rf :maven-eclipse-plugin
Build step 'Invoke top-level Maven targets' marked build as failure


Mime
View raw message