maven-notifications mailing list archives

Site index · List index
Message view « Date » · « Thread »
Top « Date » · « Thread »
From Apache Jenkins Server <jenk...@builds.apache.org>
Subject Build failed in Jenkins: maven-wagon #51
Date Sat, 17 Sep 2011 15:12:22 GMT
See <https://builds.apache.org/job/maven-wagon/51/changes>

Changes:

[olamy] add a shaded artifact of wagon http with http connection pooling
the shaded jar can be put in a maven3 distrib in ext/lib to override the default lightweight

------------------------------------------
[...truncated 2942 lines...]
-------------------------------------------------------

[INFO] --- maven-surefire-plugin:2.9:test (default-test) @ wagon-ssh ---
Concurrency config is parallel='true', perCoreThreadCount=true, threadCount=2, useUnlimitedThreads=false

Results :

Tests run: 0, Failures: 0, Errors: 0, Skipped: 0

[JENKINS] Recording test results
[INFO] 
[INFO] --- maven-jar-plugin:2.3.1:jar (default-jar) @ wagon-ssh ---
[INFO] Building jar: <https://builds.apache.org/job/maven-wagon/ws/wagon-providers/wagon-ssh/target/wagon-ssh-2.0-SNAPSHOT.jar>
[INFO] 
[INFO] --- maven-site-plugin:3.0:attach-descriptor (attach-descriptor) @ wagon-ssh ---
[INFO] Installing <https://builds.apache.org/job/maven-wagon/ws/wagon-providers/wagon-ssh/target/wagon-ssh-2.0-SNAPSHOT.jar>
to <https://builds.apache.org/job/maven-wagon/ws/.repository/org/apache/maven/wagon/wagon-ssh/2.0-SNAPSHOT/wagon-ssh-2.0-SNAPSHOT.jar>
[INFO] [INFO] Installing <https://builds.apache.org/job/maven-wagon/ws/wagon-providers/wagon-ssh/pom.xml>
to <https://builds.apache.org/job/maven-wagon/ws/.repository/org/apache/maven/wagon/wagon-ssh/2.0-SNAPSHOT/wagon-ssh-2.0-SNAPSHOT.pom>

[INFO] --- maven-install-plugin:2.3.1:install (default-install) @ wagon-ssh ---
projectSucceeded org.apache.maven.wagon:wagon-ssh:2.0-SNAPSHOT
[JENKINS] Archiving <https://builds.apache.org/job/maven-wagon/ws/wagon-providers/wagon-ssh/pom.xml>
to /home/hudson/hudson/jobs/maven-wagon/modules/org.apache.maven.wagon$wagon-ssh/builds/2011-09-17_15-01-25/archive/org.apache.maven.wagon/wagon-ssh/2.0-SNAPSHOT/wagon-ssh-2.0-SNAPSHOT.pom
[JENKINS] Archiving <https://builds.apache.org/job/maven-wagon/ws/wagon-providers/wagon-ssh/target/wagon-ssh-2.0-SNAPSHOT.jar>
to /home/hudson/hudson/jobs/maven-wagon/modules/org.apache.maven.wagon$wagon-ssh/builds/2011-09-17_15-01-25/archive/org.apache.maven.wagon/wagon-ssh/2.0-SNAPSHOT/wagon-ssh-2.0-SNAPSHOT.jar
Running org.apache.maven.wagon.providers.http.HttpWagonTimeoutTest
Tests run: 4, Failures: 0, Errors: 0, Skipped: 0, Time elapsed: 4.437 sec
Running org.apache.maven.wagon.providers.http.HttpsWagonTest
Tests run: 43, Failures: 1, Errors: 0, Skipped: 0, Time elapsed: -2,012,172.099 sec <<<
FAILURE!
Running org.apache.maven.wagon.providers.http.HttpWagonTest
Tests run: 43, Failures: 0, Errors: 0, Skipped: 0, Time elapsed: 14.529 sec

Results :

Failed tests:   testWagonGetIfNewerToStreamIsOlder(org.apache.maven.wagon.providers.http.HttpsWagonTest):


Tests run: 130, Failures: 1, Errors: 0, Skipped: 2

[ERROR] There are test failures.

Please refer to <https://builds.apache.org/job/maven-wagon/ws/wagon-providers/wagon-http/target/surefire-reports>
for the individual test results.
[JENKINS] Recording test results
[INFO] 
[INFO] --- maven-jar-plugin:2.3.1:jar (default-jar) @ wagon-http ---
[INFO] Building jar: <https://builds.apache.org/job/maven-wagon/ws/wagon-providers/wagon-http/target/wagon-http-2.0-SNAPSHOT.jar>
[INFO] 
[INFO] --- maven-site-plugin:3.0:attach-descriptor (attach-descriptor) @ wagon-http ---
[INFO] Downloading: http://repo1.maven.org/maven2/asm/asm/3.2/asm-3.2.pom

[INFO] --- maven-shade-plugin:1.4:shade (default) @ wagon-http ---
Downloaded: http://repo1.maven.org/maven2/asm/asm/3.2/asm-3.2.pom (264 B at 0.7 KB/sec)
Downloading: http://repo1.maven.org/maven2/asm/asm-parent/3.2/asm-parent-3.2.pom
Downloaded: http://repo1.maven.org/maven2/asm/asm-parent/3.2/asm-parent-3.2.pom (5 KB at 8.3
KB/sec)
Downloading: http://repo1.maven.org/maven2/asm/asm-commons/3.2/asm-commons-3.2.pom
Downloaded: http://repo1.maven.org/maven2/asm/asm-commons/3.2/asm-commons-3.2.pom (415 B at
0.8 KB/sec)
Downloading: http://repo1.maven.org/maven2/asm/asm-tree/3.2/asm-tree-3.2.pom
Downloaded: http://repo1.maven.org/maven2/asm/asm-tree/3.2/asm-tree-3.2.pom (404 B at 0.7
KB/sec)
Downloading: http://repo1.maven.org/maven2/org/jdom/jdom/1.1/jdom-1.1.pom
Downloaded: http://repo1.maven.org/maven2/org/jdom/jdom/1.1/jdom-1.1.pom (3 KB at 5.0 KB/sec)
Downloading: http://repo1.maven.org/maven2/org/apache/maven/shared/maven-dependency-tree/1.1/maven-dependency-tree-1.1.pom
Downloaded: http://repo1.maven.org/maven2/org/apache/maven/shared/maven-dependency-tree/1.1/maven-dependency-tree-1.1.pom
(3 KB at 5.8 KB/sec)
Downloading: http://repo1.maven.org/maven2/org/vafer/jdependency/0.6/jdependency-0.6.pom
Downloaded: http://repo1.maven.org/maven2/org/vafer/jdependency/0.6/jdependency-0.6.pom (8
KB at 13.5 KB/sec)
Downloading: http://repo1.maven.org/maven2/org/apache/commons/commons-io/1.3.2/commons-io-1.3.2.pom
Downloaded: http://repo1.maven.org/maven2/org/apache/commons/commons-io/1.3.2/commons-io-1.3.2.pom
(10 KB at 21.4 KB/sec)
Downloading: http://repo1.maven.org/maven2/org/apache/commons/commons-parent/3/commons-parent-3.pom
Downloaded: http://repo1.maven.org/maven2/org/apache/commons/commons-parent/3/commons-parent-3.pom
(12 KB at 22.7 KB/sec)
Downloading: http://repo1.maven.org/maven2/asm/asm-analysis/3.2/asm-analysis-3.2.pom
Downloaded: http://repo1.maven.org/maven2/asm/asm-analysis/3.2/asm-analysis-3.2.pom (417 B
at 0.8 KB/sec)
Downloading: http://repo1.maven.org/maven2/asm/asm-util/3.2/asm-util-3.2.pom
Downloaded: http://repo1.maven.org/maven2/asm/asm-util/3.2/asm-util-3.2.pom (409 B at 0.8
KB/sec)
Downloading: http://repo1.maven.org/maven2/org/codehaus/plexus/plexus-utils/1.5.5/plexus-utils-1.5.5.jar
Downloading: http://repo1.maven.org/maven2/asm/asm/3.2/asm-3.2.jar
Downloading: http://repo1.maven.org/maven2/asm/asm-commons/3.2/asm-commons-3.2.jar
Downloading: http://repo1.maven.org/maven2/asm/asm-tree/3.2/asm-tree-3.2.jar
Downloading: http://repo1.maven.org/maven2/org/jdom/jdom/1.1/jdom-1.1.jar
Downloaded: http://repo1.maven.org/maven2/asm/asm-tree/3.2/asm-tree-3.2.jar (22 KB at 11.0
KB/sec)
Downloading: http://repo1.maven.org/maven2/org/apache/maven/shared/maven-dependency-tree/1.1/maven-dependency-tree-1.1.jar
Downloaded: http://repo1.maven.org/maven2/org/codehaus/plexus/plexus-utils/1.5.5/plexus-utils-1.5.5.jar
(246 KB at 126.0 KB/sec)
Downloading: http://repo1.maven.org/maven2/org/vafer/jdependency/0.6/jdependency-0.6.jar
Downloaded: http://repo1.maven.org/maven2/asm/asm/3.2/asm-3.2.jar (43 KB at 17.0 KB/sec)
Downloaded: http://repo1.maven.org/maven2/asm/asm-commons/3.2/asm-commons-3.2.jar (33 KB at
13.0 KB/sec)
Downloading: http://repo1.maven.org/maven2/org/apache/commons/commons-io/1.3.2/commons-io-1.3.2.jar
Downloading: http://repo1.maven.org/maven2/asm/asm-analysis/3.2/asm-analysis-3.2.jar
Downloaded: http://repo1.maven.org/maven2/org/jdom/jdom/1.1/jdom-1.1.jar (150 KB at 42.8 KB/sec)
Downloading: http://repo1.maven.org/maven2/asm/asm-util/3.2/asm-util-3.2.jar
Downloaded: http://repo1.maven.org/maven2/org/vafer/jdependency/0.6/jdependency-0.6.jar (12
KB at 6.4 KB/sec)
Downloaded: http://repo1.maven.org/maven2/org/apache/maven/shared/maven-dependency-tree/1.1/maven-dependency-tree-1.1.jar
(34 KB at 16.1 KB/sec)
Downloaded: http://repo1.maven.org/maven2/org/apache/commons/commons-io/1.3.2/commons-io-1.3.2.jar
(86 KB at 48.4 KB/sec)
Downloaded: http://repo1.maven.org/maven2/asm/asm-analysis/3.2/asm-analysis-3.2.jar (18 KB
at 8.7 KB/sec)
Downloaded: http://repo1.maven.org/maven2/asm/asm-util/3.2/asm-util-3.2.jar (36 KB at 23.7
KB/sec)
[INFO] Including org.apache.maven.wagon:wagon-http-shared4:jar:2.0-SNAPSHOT in the shaded
jar.
[INFO] Excluding org.jsoup:jsoup:jar:1.6.1 from the shaded jar.
[INFO] Including commons-logging:commons-logging:jar:1.1.1 in the shaded jar.
[INFO] Excluding commons-io:commons-io:jar:2.0.1 from the shaded jar.
[INFO] Including org.apache.httpcomponents:httpclient:jar:4.1.2 in the shaded jar.
[INFO] Including commons-codec:commons-codec:jar:1.4 in the shaded jar.
[INFO] Including org.apache.httpcomponents:httpcore:jar:4.1.2 in the shaded jar.
[INFO] Excluding org.apache.maven.wagon:wagon-provider-api:jar:2.0-SNAPSHOT from the shaded
jar.
[INFO] Excluding org.codehaus.plexus:plexus-utils:jar:2.0.7 from the shaded jar.
[INFO] Attaching shaded artifact.
[INFO] [INFO] Installing <https://builds.apache.org/job/maven-wagon/ws/wagon-providers/wagon-http/target/wagon-http-2.0-SNAPSHOT.jar>
to <https://builds.apache.org/job/maven-wagon/ws/.repository/org/apache/maven/wagon/wagon-http/2.0-SNAPSHOT/wagon-http-2.0-SNAPSHOT.jar>
[INFO] Installing <https://builds.apache.org/job/maven-wagon/ws/wagon-providers/wagon-http/pom.xml>
to <https://builds.apache.org/job/maven-wagon/ws/.repository/org/apache/maven/wagon/wagon-http/2.0-SNAPSHOT/wagon-http-2.0-SNAPSHOT.pom>
[INFO] Installing <https://builds.apache.org/job/maven-wagon/ws/wagon-providers/wagon-http/target/wagon-http-2.0-SNAPSHOT-shaded.jar>
to <https://builds.apache.org/job/maven-wagon/ws/.repository/org/apache/maven/wagon/wagon-http/2.0-SNAPSHOT/wagon-http-2.0-SNAPSHOT-shaded.jar>

[INFO] --- maven-install-plugin:2.3.1:install (default-install) @ wagon-http ---
projectSucceeded org.apache.maven.wagon:wagon-http:2.0-SNAPSHOT
[JENKINS] Archiving <https://builds.apache.org/job/maven-wagon/ws/wagon-providers/wagon-http/pom.xml>
to /home/hudson/hudson/jobs/maven-wagon/modules/org.apache.maven.wagon$wagon-http/builds/2011-09-17_15-01-25/archive/org.apache.maven.wagon/wagon-http/2.0-SNAPSHOT/wagon-http-2.0-SNAPSHOT.pom
[JENKINS] Archiving <https://builds.apache.org/job/maven-wagon/ws/wagon-providers/wagon-http/target/wagon-http-2.0-SNAPSHOT.jar>
to /home/hudson/hudson/jobs/maven-wagon/modules/org.apache.maven.wagon$wagon-http/builds/2011-09-17_15-01-25/archive/org.apache.maven.wagon/wagon-http/2.0-SNAPSHOT/wagon-http-2.0-SNAPSHOT.jar
[JENKINS] Archiving <https://builds.apache.org/job/maven-wagon/ws/wagon-providers/wagon-http/target/wagon-http-2.0-SNAPSHOT-shaded.jar>
to /home/hudson/hudson/jobs/maven-wagon/modules/org.apache.maven.wagon$wagon-http/builds/2011-09-17_15-01-25/archive/org.apache.maven.wagon/wagon-http/2.0-SNAPSHOT/wagon-http-2.0-SNAPSHOT-shaded.jar
sessionEnded
[INFO] ------------------------------------------------------------------------
[INFO] Reactor Summary:
[INFO] 
[INFO] Apache Maven Wagon ................................ SUCCESS [4:24.445s]
[INFO] Apache Maven Wagon :: API ......................... SUCCESS [1:06.357s]
[INFO] Apache Maven Wagon :: Provider Test ............... SUCCESS [16.774s]
[INFO] Apache Maven Wagon :: Providers ................... SUCCESS [1.283s]
[INFO] Apache Maven Wagon :: Providers :: File Provider .. SUCCESS [5.224s]
[INFO] Apache Maven Wagon :: Providers :: FTP Provider ... SUCCESS [33.896s]
[INFO] Apache Maven Wagon :: Providers :: HTTP Shared Library 4  SUCCESS [23.524s]
[INFO] Apache Maven Wagon :: Test Compatibility Kits ..... SUCCESS [2.053s]
[INFO] Apache Maven Wagon :: HTTP Test Compatibility Kit . SUCCESS [16.179s]
[INFO] Apache Maven Wagon :: Providers :: Lightweight HTTP Provider  SUCCESS [1:49.266s]
[INFO] Apache Maven Wagon :: Providers :: HTTP Provider .. SUCCESS [3:52.411s]
[INFO] Apache Maven Wagon :: Providers :: HTTP Shared Library  FAILURE [3.408s]
[INFO] Apache Maven Wagon :: Providers :: SCM Provider ... FAILURE [10.126s]
[INFO] Apache Maven Wagon :: Providers :: SSH Common Library  SUCCESS [3.141s]
[INFO] Apache Maven Wagon :: Providers :: SSH Common Tests  SUCCESS [2.830s]
[INFO] Apache Maven Wagon :: Providers :: SSH External Provider  SUCCESS [2.913s]
[INFO] Apache Maven Wagon :: Providers :: SSH Provider ... SUCCESS [3.096s]
[INFO] Apache Maven Wagon :: Providers :: WebDav Provider  SKIPPED
[INFO] ------------------------------------------------------------------------
[INFO] BUILD FAILURE
[INFO] ------------------------------------------------------------------------
[INFO] Total time: 10:42.353s (Wall Clock)
[INFO] Finished at: Sat Sep 17 15:12:20 UTC 2011
[INFO] Final Memory: 36M/310M
[INFO] ------------------------------------------------------------------------
mavenExecutionResult exceptions not empty
message : Failed to execute goal on project wagon-http-shared: Could not resolve dependencies
for project org.apache.maven.wagon:wagon-http-shared:jar:2.0-SNAPSHOT: The following artifacts
could not be resolved: nekohtml:xercesMinimal:jar:1.9.6.2, commons-codec:commons-codec:jar:1.2:
Could not transfer artifact nekohtml:xercesMinimal:jar:1.9.6.2 from/to central (http://repo1.maven.org/maven2):
GET request of: nekohtml/xercesMinimal/1.9.6.2/xercesMinimal-1.9.6.2.jar from central failed
cause : Could not resolve dependencies for project org.apache.maven.wagon:wagon-http-shared:jar:2.0-SNAPSHOT:
The following artifacts could not be resolved: nekohtml:xercesMinimal:jar:1.9.6.2, commons-codec:commons-codec:jar:1.2:
Could not transfer artifact nekohtml:xercesMinimal:jar:1.9.6.2 from/to central (http://repo1.maven.org/maven2):
GET request of: nekohtml/xercesMinimal/1.9.6.2/xercesMinimal-1.9.6.2.jar from central failed
Stack trace : 
org.apache.maven.lifecycle.LifecycleExecutionException: Failed to execute goal on project
wagon-http-shared: Could not resolve dependencies for project org.apache.maven.wagon:wagon-http-shared:jar:2.0-SNAPSHOT:
The following artifacts could not be resolved: nekohtml:xercesMinimal:jar:1.9.6.2, commons-codec:commons-codec:jar:1.2:
Could not transfer artifact nekohtml:xercesMinimal:jar:1.9.6.2 from/to central (http://repo1.maven.org/maven2):
GET request of: nekohtml/xercesMinimal/1.9.6.2/xercesMinimal-1.9.6.2.jar from central failed
	at org.apache.maven.lifecycle.internal.LifecycleDependencyResolver.getDependencies(LifecycleDependencyResolver.java:196)
	at org.apache.maven.lifecycle.internal.LifecycleDependencyResolver.resolveProjectDependencies(LifecycleDependencyResolver.java:108)
	at org.apache.maven.lifecycle.internal.MojoExecutor.ensureDependenciesAreResolved(MojoExecutor.java:258)
	at org.apache.maven.lifecycle.internal.MojoExecutor.execute(MojoExecutor.java:201)
	at org.apache.maven.lifecycle.internal.MojoExecutor.execute(MojoExecutor.java:153)
	at org.apache.maven.lifecycle.internal.MojoExecutor.execute(MojoExecutor.java:145)
	at org.apache.maven.lifecycle.internal.LifecycleModuleBuilder.buildProject(LifecycleModuleBuilder.java:84)
	at org.apache.maven.lifecycle.internal.LifecycleThreadedBuilder$1.call(LifecycleThreadedBuilder.java:167)
	at org.apache.maven.lifecycle.internal.LifecycleThreadedBuilder$1.call(LifecycleThreadedBuilder.java:164)
	at java.util.concurrent.FutureTask$Sync.innerRun(FutureTask.java:269)
	at java.util.concurrent.FutureTask.run(FutureTask.java:123)
	at java.util.concurrent.ThreadPoolExecutor$Worker.runTask(ThreadPoolExecutor.java:651)
	at java.util.concurrent.ThreadPoolExecutor$Worker.run(ThreadPoolExecutor.java:676)
	at java.lang.Thread.run(Thread.java:595)
Caused by: org.apache.maven.project.DependencyResolutionException: Could not resolve dependencies
for project org.apache.maven.wagon:wagon-http-shared:jar:2.0-SNAPSHOT: The following artifacts
could not be resolved: nekohtml:xercesMinimal:jar:1.9.6.2, commons-codec:commons-codec:jar:1.2:
Could not transfer artifact nekohtml:xercesMinimal:jar:1.9.6.2 from/to central (http://repo1.maven.org/maven2):
GET request of: nekohtml/xercesMinimal/1.9.6.2/xercesMinimal-1.9.6.2.jar from central failed
	at org.apache.maven.project.DefaultProjectDependenciesResolver.resolve(DefaultProjectDependenciesResolver.java:170)
	at org.apache.maven.lifecycle.internal.LifecycleDependencyResolver.getDependencies(LifecycleDependencyResolver.java:171)
	... 13 more
Caused by: org.sonatype.aether.resolution.DependencyResolutionException: The following artifacts
could not be resolved: nekohtml:xercesMinimal:jar:1.9.6.2, commons-codec:commons-codec:jar:1.2:
Could not transfer artifact nekohtml:xercesMinimal:jar:1.9.6.2 from/to central (http://repo1.maven.org/maven2):
GET request of: nekohtml/xercesMinimal/1.9.6.2/xercesMinimal-1.9.6.2.jar from central failed
	at org.sonatype.aether.impl.internal.DefaultRepositorySystem.resolveDependencies(DefaultRepositorySystem.java:412)
	at org.apache.maven.project.DefaultProjectDependenciesResolver.resolve(DefaultProjectDependenciesResolver.java:164)
	... 14 more
Caused by: org.sonatype.aether.resolution.ArtifactResolutionException: The following artifacts
could not be resolved: nekohtml:xercesMinimal:jar:1.9.6.2, commons-codec:commons-codec:jar:1.2:
Could not transfer artifact nekohtml:xercesMinimal:jar:1.9.6.2 from/to central (http://repo1.maven.org/maven2):
GET request of: nekohtml/xercesMinimal/1.9.6.2/xercesMinimal-1.9.6.2.jar from central failed
	at org.sonatype.aether.impl.internal.DefaultArtifactResolver.resolve(DefaultArtifactResolver.java:541)
	at org.sonatype.aether.impl.internal.DefaultArtifactResolver.resolveArtifacts(DefaultArtifactResolver.java:220)
	at org.sonatype.aether.impl.internal.DefaultRepositorySystem.resolveDependencies(DefaultRepositorySystem.java:395)
	... 15 more
Caused by: org.sonatype.aether.transfer.ArtifactTransferException: Could not transfer artifact
nekohtml:xercesMinimal:jar:1.9.6.2 from/to central (http://repo1.maven.org/maven2): GET request
of: nekohtml/xercesMinimal/1.9.6.2/xercesMinimal-1.9.6.2.jar from central failed
	at org.sonatype.aether.connector.wagon.WagonRepositoryConnector$4.wrap(WagonRepositoryConnector.java:949)
	at org.sonatype.aether.connector.wagon.WagonRepositoryConnector$4.wrap(WagonRepositoryConnector.java:940)
	at org.sonatype.aether.connector.wagon.WagonRepositoryConnector$GetTask.flush(WagonRepositoryConnector.java:695)
	at org.sonatype.aether.connector.wagon.WagonRepositoryConnector$GetTask.flush(WagonRepositoryConnector.java:689)
	at org.sonatype.aether.connector.wagon.WagonRepositoryConnector.get(WagonRepositoryConnector.java:445)
	at org.sonatype.aether.impl.internal.DefaultArtifactResolver.resolve(DefaultArtifactResolver.java:460)
	... 17 more
Caused by: org.apache.maven.wagon.TransferFailedException: GET request of: nekohtml/xercesMinimal/1.9.6.2/xercesMinimal-1.9.6.2.jar
from central failed
	at org.apache.maven.wagon.AbstractWagon.getTransfer(AbstractWagon.java:338)
	at org.apache.maven.wagon.AbstractWagon.getTransfer(AbstractWagon.java:299)
	at org.apache.maven.wagon.AbstractWagon.getTransfer(AbstractWagon.java:276)
	at org.apache.maven.wagon.StreamWagon.getIfNewer(StreamWagon.java:97)
	at org.apache.maven.wagon.StreamWagon.get(StreamWagon.java:61)
	at org.sonatype.aether.connector.wagon.WagonRepositoryConnector$GetTask.run(WagonRepositoryConnector.java:608)
	at org.sonatype.aether.util.concurrency.RunnableErrorForwarder$1.run(RunnableErrorForwarder.java:64)
	... 3 more
Caused by: java.io.IOException: Corrupt GZIP trailer
	at java.util.zip.GZIPInputStream.readTrailer(GZIPInputStream.java:177)
	at java.util.zip.GZIPInputStream.read(GZIPInputStream.java:89)
	at org.apache.maven.wagon.AbstractWagon.transfer(AbstractWagon.java:483)
	at org.apache.maven.wagon.AbstractWagon.getTransfer(AbstractWagon.java:328)
	... 9 more
message : Failed to execute goal on project wagon-scm: Could not resolve dependencies for
project org.apache.maven.wagon:wagon-scm:jar:2.0-SNAPSHOT: Could not transfer artifact org.apache.maven.scm:maven-scm-test:jar:1.5
from/to central (http://repo1.maven.org/maven2): GET request of: org/apache/maven/scm/maven-scm-test/1.5/maven-scm-test-1.5.jar
from central failed
cause : Could not resolve dependencies for project org.apache.maven.wagon:wagon-scm:jar:2.0-SNAPSHOT:
Could not transfer artifact org.apache.maven.scm:maven-scm-test:jar:1.5 from/to central (http://repo1.maven.org/maven2):
GET request of: org/apache/maven/scm/maven-scm-test/1.5/maven-scm-test-1.5.jar from central
failed
Stack trace : 
org.apache.maven.lifecycle.LifecycleExecutionException: Failed to execute goal on project
wagon-scm: Could not resolve dependencies for project org.apache.maven.wagon:wagon-scm:jar:2.0-SNAPSHOT:
Could not transfer artifact org.apache.maven.scm:maven-scm-test:jar:1.5 from/to central (http://repo1.maven.org/maven2):
GET request of: org/apache/maven/scm/maven-scm-test/1.5/maven-scm-test-1.5.jar from central
failed
	at org.apache.maven.lifecycle.internal.LifecycleDependencyResolver.getDependencies(LifecycleDependencyResolver.java:196)
	at org.apache.maven.lifecycle.internal.LifecycleDependencyResolver.resolveProjectDependencies(LifecycleDependencyResolver.java:108)
	at org.apache.maven.lifecycle.internal.MojoExecutor.ensureDependenciesAreResolved(MojoExecutor.java:258)
	at org.apache.maven.lifecycle.internal.MojoExecutor.execute(MojoExecutor.java:201)
	at org.apache.maven.lifecycle.internal.MojoExecutor.execute(MojoExecutor.java:153)
	at org.apache.maven.lifecycle.internal.MojoExecutor.execute(MojoExecutor.java:145)
	at org.apache.maven.lifecycle.internal.LifecycleModuleBuilder.buildProject(LifecycleModuleBuilder.java:84)
	at org.apache.maven.lifecycle.internal.LifecycleThreadedBuilder$1.call(LifecycleThreadedBuilder.java:167)
	at org.apache.maven.lifecycle.internal.LifecycleThreadedBuilder$1.call(LifecycleThreadedBuilder.java:164)
	at java.util.concurrent.FutureTask$Sync.innerRun(FutureTask.java:269)
	at java.util.concurrent.FutureTask.run(FutureTask.java:123)
	at java.util.concurrent.ThreadPoolExecutor$Worker.runTask(ThreadPoolExecutor.java:651)
	at java.util.concurrent.ThreadPoolExecutor$Worker.run(ThreadPoolExecutor.java:676)
	at java.lang.Thread.run(Thread.java:595)
Caused by: org.apache.maven.project.DependencyResolutionException: Could not resolve dependencies
for project org.apache.maven.wagon:wagon-scm:jar:2.0-SNAPSHOT: Could not transfer artifact
org.apache.maven.scm:maven-scm-test:jar:1.5 from/to central (http://repo1.maven.org/maven2):
GET request of: org/apache/maven/scm/maven-scm-test/1.5/maven-scm-test-1.5.jar from central
failed
	at org.apache.maven.project.DefaultProjectDependenciesResolver.resolve(DefaultProjectDependenciesResolver.java:170)
	at org.apache.maven.lifecycle.internal.LifecycleDependencyResolver.getDependencies(LifecycleDependencyResolver.java:171)
	... 13 more
Caused by: org.sonatype.aether.resolution.DependencyResolutionException: Could not transfer
artifact org.apache.maven.scm:maven-scm-test:jar:1.5 from/to central (http://repo1.maven.org/maven2):
GET request of: org/apache/maven/scm/maven-scm-test/1.5/maven-scm-test-1.5.jar from central
failed
	at org.sonatype.aether.impl.internal.DefaultRepositorySystem.resolveDependencies(DefaultRepositorySystem.java:412)
	at org.apache.maven.project.DefaultProjectDependenciesResolver.resolve(DefaultProjectDependenciesResolver.java:164)
	... 14 more
Caused by: org.sonatype.aether.resolution.ArtifactResolutionException: Could not transfer
artifact org.apache.maven.scm:maven-scm-test:jar:1.5 from/to central (http://repo1.maven.org/maven2):
GET request of: org/apache/maven/scm/maven-scm-test/1.5/maven-scm-test-1.5.jar from central
failed
	at org.sonatype.aether.impl.internal.DefaultArtifactResolver.resolve(DefaultArtifactResolver.java:541)
	at org.sonatype.aether.impl.internal.DefaultArtifactResolver.resolveArtifacts(DefaultArtifactResolver.java:220)
	at org.sonatype.aether.impl.internal.DefaultRepositorySystem.resolveDependencies(DefaultRepositorySystem.java:395)
	... 15 more
Caused by: org.sonatype.aether.transfer.ArtifactTransferException: Could not transfer artifact
org.apache.maven.scm:maven-scm-test:jar:1.5 from/to central (http://repo1.maven.org/maven2):
GET request of: org/apache/maven/scm/maven-scm-test/1.5/maven-scm-test-1.5.jar from central
failed
	at org.sonatype.aether.connector.wagon.WagonRepositoryConnector$4.wrap(WagonRepositoryConnector.java:949)
	at org.sonatype.aether.connector.wagon.WagonRepositoryConnector$4.wrap(WagonRepositoryConnector.java:940)
	at org.sonatype.aether.connector.wagon.WagonRepositoryConnector$GetTask.flush(WagonRepositoryConnector.java:695)
	at org.sonatype.aether.connector.wagon.WagonRepositoryConnector$GetTask.flush(WagonRepositoryConnector.java:689)
	at org.sonatype.aether.connector.wagon.WagonRepositoryConnector.get(WagonRepositoryConnector.java:445)
	at org.sonatype.aether.impl.internal.DefaultArtifactResolver.resolve(DefaultArtifactResolver.java:460)
	... 17 more
Caused by: org.apache.maven.wagon.TransferFailedException: GET request of: org/apache/maven/scm/maven-scm-test/1.5/maven-scm-test-1.5.jar
from central failed
	at org.apache.maven.wagon.AbstractWagon.getTransfer(AbstractWagon.java:338)
	at org.apache.maven.wagon.AbstractWagon.getTransfer(AbstractWagon.java:299)
	at org.apache.maven.wagon.AbstractWagon.getTransfer(AbstractWagon.java:276)
	at org.apache.maven.wagon.StreamWagon.getIfNewer(StreamWagon.java:97)
	at org.apache.maven.wagon.StreamWagon.get(StreamWagon.java:61)
	at org.sonatype.aether.connector.wagon.WagonRepositoryConnector$GetTask.run(WagonRepositoryConnector.java:608)
	at org.sonatype.aether.util.concurrency.RunnableErrorForwarder$1.run(RunnableErrorForwarder.java:64)
	... 3 more
Caused by: java.io.IOException: Corrupt GZIP trailer
	at java.util.zip.GZIPInputStream.readTrailer(GZIPInputStream.java:177)
	at java.util.zip.GZIPInputStream.read(GZIPInputStream.java:89)
	at org.apache.maven.wagon.AbstractWagon.transfer(AbstractWagon.java:483)
	at org.apache.maven.wagon.AbstractWagon.getTransfer(AbstractWagon.java:328)
	... 9 more
Maven failed with error.
Sending e-mails to: notifications@maven.apache.org olamy@apache.org
Sending e-mails to: notifications@maven.apache.org
channel stopped


Mime
View raw message