maven-notifications mailing list archives

Site index · List index
Message view « Date » · « Thread »
Top « Date » · « Thread »
From Apache Jenkins Server <jenk...@builds.apache.org>
Subject Build failed in Jenkins: core-integration-testing-maven-3-windows #56
Date Thu, 29 Sep 2011 22:38:13 GMT
See <https://builds.apache.org/job/core-integration-testing-maven-3-windows/56/changes>

Changes:

[olamy] fix typo

------------------------------------------
[...truncated 4740 lines...]
0032MavenPrerequisite(it0032)...............................OK (1.3 s)
0030DepPomDepMngtInheritance(it0030)........................OK (4.6 s)
0025MultipleExecutionLevelConfigs(it0025)...................OK (1.9 s)
0024MultipleGoalExecutions(it0024)..........................OK (1.6 s)
0023SettingsProfile(it0023).................................OK (2.0 s)
0021PomProfile(it0021)......................................OK (2.1 s)
0019PluginVersionMngtBySuperPom(it0019).....................OK (2.4 s)
0018DependencyManagement(it0018)............................OK (2.1 s)
0012PomInterpolation(it0012)................................OK (1.8 s)
0011DefaultVersionByDependencyManagement(it0011)............OK (2.3 s)
0010DependencyClosureResolution(it0010).....................OK (2.1 s)
0009GoalConfiguration(it0009)...............................OK (2.2 s)
0008SimplePlugin(it0008)....................................OK (2.1 s)
Tests run: 699, Failures: 0, Errors: 1, Skipped: 0, Time elapsed: 1,557.024 sec <<<
FAILURE!
testit(org.apache.maven.it.MavenITmng2305MultipleProxiesTest)  Time elapsed: 1.541 sec  <<<
ERROR!
org.apache.maven.it.VerificationException: Exit code was non-zero: 1; command line and log
= 
<https://builds.apache.org/job/core-integration-testing-maven-3-windows/ws/apache-maven-3.0-SNAPSHOT\bin\mvn>
--global-settings F:\hudson\hudson-slave\workspace\core-integration-testing-maven-3-windows\core-it\core-it-suite\target\test-classes\settings.xml
--settings settings.xml -e --batch-mode -Djavax.net.ssl.trustStorePassword=store-passwd -Dmaven.artifact.threads=3
-Djavax.net.ssl.trustStore=F:\hudson\hudson-slave\workspace\core-integration-testing-maven-3-windows\core-it\core-it-suite\target\test-classes\mng-2305\keystore
-Dmaven.repo.local=<https://builds.apache.org/job/core-integration-testing-maven-3-windows/ws/.repository>
validate
[INFO] Error stacktraces are turned on.
[INFO] Scanning for projects...
Downloading: file:target/null/org/apache/maven/wagon/wagon-http/2.0/wagon-http-2.0.pom
[WARNING] The POM for org.apache.maven.wagon:wagon-http:jar:2.0 is missing, no dependency
information available
Downloading: file:target/null/org/apache/maven/wagon/wagon-http/2.0/wagon-http-2.0.jar
[ERROR] The build could not read 1 project -> [Help 1]
org.apache.maven.project.ProjectBuildingException: Some problems were encountered while processing
the POMs:
[ERROR] Unresolveable build extension: Plugin org.apache.maven.wagon:wagon-http:2.0 or one
of its dependencies could not be resolved: Could not find artifact org.apache.maven.wagon:wagon-http:jar:2.0
in central (file:target/null) @ 

	at org.apache.maven.project.DefaultProjectBuilder.build(DefaultProjectBuilder.java:363)
	at org.apache.maven.DefaultMaven.collectProjects(DefaultMaven.java:636)
	at org.apache.maven.DefaultMaven.getProjectsForMavenReactor(DefaultMaven.java:585)
	at org.apache.maven.DefaultMaven.doExecute(DefaultMaven.java:234)
	at org.apache.maven.DefaultMaven.execute(DefaultMaven.java:156)
	at org.apache.maven.cli.MavenCli.execute(MavenCli.java:537)
	at org.apache.maven.cli.MavenCli.doMain(MavenCli.java:196)
	at org.apache.maven.cli.MavenCli.main(MavenCli.java:141)
	at sun.reflect.NativeMethodAccessorImpl.invoke0(Native Method)
	at sun.reflect.NativeMethodAccessorImpl.invoke(NativeMethodAccessorImpl.java:39)
	at sun.reflect.DelegatingMethodAccessorImpl.invoke(DelegatingMethodAccessorImpl.java:25)
	at java.lang.reflect.Method.invoke(Method.java:592)
	at org.codehaus.plexus.classworlds.launcher.Launcher.launchEnhanced(Launcher.java:290)
	at org.codehaus.plexus.classworlds.launcher.Launcher.launch(Launcher.java:230)
	at org.codehaus.plexus.classworlds.launcher.Launcher.mainWithExitCode(Launcher.java:409)
	at org.codehaus.plexus.classworlds.launcher.Launcher.main(Launcher.java:352)
[ERROR]   
[ERROR]   The project org.apache.maven.its.mng2305:test:0.1-SNAPSHOT (F:\hudson\hudson-slave\workspace\core-integration-testing-maven-3-windows\core-it\core-it-suite\target\test-classes\mng-2305\pom.xml)
has 1 error
[ERROR]     Unresolveable build extension: Plugin org.apache.maven.wagon:wagon-http:2.0 or
one of its dependencies could not be resolved: Could not find artifact org.apache.maven.wagon:wagon-http:jar:2.0
in central (file:target/null) -> [Help 2]
org.apache.maven.plugin.PluginResolutionException: Plugin org.apache.maven.wagon:wagon-http:2.0
or one of its dependencies could not be resolved: Could not find artifact org.apache.maven.wagon:wagon-http:jar:2.0
in central (file:target/null)
	at org.apache.maven.plugin.internal.DefaultPluginDependenciesResolver.resolve(DefaultPluginDependenciesResolver.java:215)
	at org.apache.maven.project.DefaultProjectBuildingHelper.resolveExtensionArtifacts(DefaultProjectBuildingHelper.java:377)
	at org.apache.maven.project.DefaultProjectBuildingHelper.createProjectRealm(DefaultProjectBuildingHelper.java:237)
	at org.apache.maven.project.DefaultModelBuildingListener.buildExtensionsAssembled(DefaultModelBuildingListener.java:106)
	at org.apache.maven.model.building.ModelBuildingEventCatapult$1.fire(ModelBuildingEventCatapult.java:43)
	at org.apache.maven.model.building.DefaultModelBuilder.fireEvent(DefaultModelBuilder.java:1053)
	at org.apache.maven.model.building.DefaultModelBuilder.build(DefaultModelBuilder.java:388)
	at org.apache.maven.model.building.DefaultModelBuilder.build(DefaultModelBuilder.java:371)
	at org.apache.maven.project.DefaultProjectBuilder.build(DefaultProjectBuilder.java:560)
	at org.apache.maven.project.DefaultProjectBuilder.build(DefaultProjectBuilder.java:352)
	at org.apache.maven.DefaultMaven.collectProjects(DefaultMaven.java:636)
	at org.apache.maven.DefaultMaven.getProjectsForMavenReactor(DefaultMaven.java:585)
	at org.apache.maven.DefaultMaven.doExecute(DefaultMaven.java:234)
	at org.apache.maven.DefaultMaven.execute(DefaultMaven.java:156)
	at org.apache.maven.cli.MavenCli.execute(MavenCli.java:537)
	at org.apache.maven.cli.MavenCli.doMain(MavenCli.java:196)
	at org.apache.maven.cli.MavenCli.main(MavenCli.java:141)
	at sun.reflect.NativeMethodAccessorImpl.invoke0(Native Method)
	at sun.reflect.NativeMethodAccessorImpl.invoke(NativeMethodAccessorImpl.java:39)
	at sun.reflect.DelegatingMethodAccessorImpl.invoke(DelegatingMethodAccessorImpl.java:25)
	at java.lang.reflect.Method.invoke(Method.java:592)
	at org.codehaus.plexus.classworlds.launcher.Launcher.launchEnhanced(Launcher.java:290)
	at org.codehaus.plexus.classworlds.launcher.Launcher.launch(Launcher.java:230)
	at org.codehaus.plexus.classworlds.launcher.Launcher.mainWithExitCode(Launcher.java:409)
	at org.codehaus.plexus.classworlds.launcher.Launcher.main(Launcher.java:352)
Caused by: org.sonatype.aether.resolution.ArtifactResolutionException: Could not find artifact
org.apache.maven.wagon:wagon-http:jar:2.0 in central (file:target/null)
	at org.sonatype.aether.impl.internal.DefaultArtifactResolver.resolve(DefaultArtifactResolver.java:541)
	at org.sonatype.aether.impl.internal.DefaultArtifactResolver.resolveArtifacts(DefaultArtifactResolver.java:220)
	at org.sonatype.aether.impl.internal.DefaultRepositorySystem.resolveDependencies(DefaultRepositorySystem.java:395)
	at org.apache.maven.plugin.internal.DefaultPluginDependenciesResolver.resolve(DefaultPluginDependenciesResolver.java:207)
	... 24 more
Caused by: org.sonatype.aether.transfer.ArtifactNotFoundException: Could not find artifact
org.apache.maven.wagon:wagon-http:jar:2.0 in central (file:target/null)
	at org.sonatype.aether.connector.wagon.WagonRepositoryConnector$4.wrap(WagonRepositoryConnector.java:945)
	at org.sonatype.aether.connector.wagon.WagonRepositoryConnector$4.wrap(WagonRepositoryConnector.java:940)
	at org.sonatype.aether.connector.wagon.WagonRepositoryConnector$GetTask.flush(WagonRepositoryConnector.java:695)
	at org.sonatype.aether.connector.wagon.WagonRepositoryConnector$GetTask.flush(WagonRepositoryConnector.java:689)
	at org.sonatype.aether.connector.wagon.WagonRepositoryConnector.get(WagonRepositoryConnector.java:445)
	at org.sonatype.aether.impl.internal.DefaultArtifactResolver.resolve(DefaultArtifactResolver.java:460)
	... 27 more
[ERROR] 
[ERROR] Re-run Maven using the -X switch to enable full debug logging.
[ERROR] 
[ERROR] For more information about the errors and possible solutions, please read the following
articles:
[ERROR] [Help 1] http://cwiki.apache.org/confluence/display/MAVEN/ProjectBuildingException
[ERROR] [Help 2] http://cwiki.apache.org/confluence/display/MAVEN/PluginResolutionException

	at org.apache.maven.it.Verifier.executeGoals(Verifier.java:1397)
	at org.apache.maven.it.Verifier.executeGoal(Verifier.java:1240)
	at org.apache.maven.it.Verifier.executeGoal(Verifier.java:1234)
	at org.apache.maven.it.MavenITmng2305MultipleProxiesTest.testit(MavenITmng2305MultipleProxiesTest.java:102)
	at sun.reflect.NativeMethodAccessorImpl.invoke0(Native Method)
	at sun.reflect.NativeMethodAccessorImpl.invoke(NativeMethodAccessorImpl.java:39)
	at sun.reflect.DelegatingMethodAccessorImpl.invoke(DelegatingMethodAccessorImpl.java:25)
	at java.lang.reflect.Method.invoke(Method.java:592)
	at junit.framework.TestCase.runTest(TestCase.java:168)
	at org.apache.maven.it.AbstractMavenIntegrationTestCase.runTest(AbstractMavenIntegrationTestCase.java:220)
	at junit.framework.TestCase.runBare(TestCase.java:134)
	at junit.framework.TestResult$1.protect(TestResult.java:110)
	at junit.framework.TestResult.runProtected(TestResult.java:128)
	at junit.framework.TestResult.run(TestResult.java:113)
	at junit.framework.TestCase.run(TestCase.java:124)
	at junit.framework.TestSuite.runTest(TestSuite.java:243)
	at junit.framework.TestSuite.run(TestSuite.java:238)
	at junit.framework.TestSuite.runTest(TestSuite.java:243)
	at junit.framework.TestSuite.run(TestSuite.java:238)
	at org.junit.internal.runners.JUnit38ClassRunner.run(JUnit38ClassRunner.java:83)
	at org.apache.maven.surefire.junit4.JUnit4TestSet.execute(JUnit4TestSet.java:53)
	at org.apache.maven.surefire.junit4.JUnit4Provider.executeTestSet(JUnit4Provider.java:123)
	at org.apache.maven.surefire.junit4.JUnit4Provider.invoke(JUnit4Provider.java:104)
	at sun.reflect.NativeMethodAccessorImpl.invoke0(Native Method)
	at sun.reflect.NativeMethodAccessorImpl.invoke(NativeMethodAccessorImpl.java:39)
	at sun.reflect.DelegatingMethodAccessorImpl.invoke(DelegatingMethodAccessorImpl.java:25)
	at java.lang.reflect.Method.invoke(Method.java:592)
	at org.apache.maven.surefire.util.ReflectionUtils.invokeMethodWithArray(ReflectionUtils.java:164)
	at org.apache.maven.surefire.booter.ProviderFactory$ProviderProxy.invoke(ProviderFactory.java:110)
	at org.apache.maven.surefire.booter.SurefireStarter.invokeProvider(SurefireStarter.java:172)
	at org.apache.maven.surefire.booter.SurefireStarter.runSuitesInProcess(SurefireStarter.java:120)
	at org.apache.maven.plugin.surefire.AbstractSurefireMojo.executeProvider(AbstractSurefireMojo.java:194)
	at org.apache.maven.plugin.surefire.AbstractSurefireMojo.executeAllProviders(AbstractSurefireMojo.java:176)
	at org.apache.maven.plugin.surefire.AbstractSurefireMojo.executeAfterPreconditionsChecked(AbstractSurefireMojo.java:134)
	at org.apache.maven.plugin.surefire.AbstractSurefireMojo.execute(AbstractSurefireMojo.java:97)
	at org.apache.maven.plugin.DefaultBuildPluginManager.executeMojo(DefaultBuildPluginManager.java:101)
	at org.apache.maven.lifecycle.internal.MojoExecutor.execute(MojoExecutor.java:209)
	at org.apache.maven.lifecycle.internal.MojoExecutor.execute(MojoExecutor.java:153)
	at org.apache.maven.lifecycle.internal.MojoExecutor.execute(MojoExecutor.java:145)
	at org.apache.maven.lifecycle.internal.LifecycleModuleBuilder.buildProject(LifecycleModuleBuilder.java:84)
	at org.apache.maven.lifecycle.internal.LifecycleModuleBuilder.buildProject(LifecycleModuleBuilder.java:59)
	at org.apache.maven.lifecycle.internal.LifecycleStarter.singleThreadedBuild(LifecycleStarter.java:183)
	at org.apache.maven.lifecycle.internal.LifecycleStarter.execute(LifecycleStarter.java:161)
	at org.apache.maven.DefaultMaven.doExecute(DefaultMaven.java:319)
	at org.apache.maven.DefaultMaven.execute(DefaultMaven.java:156)
	at org.apache.maven.cli.MavenCli.execute(MavenCli.java:537)
	at org.apache.maven.cli.MavenCli.doMain(MavenCli.java:196)
	at org.apache.maven.cli.MavenCli.main(MavenCli.java:141)
	at sun.reflect.NativeMethodAccessorImpl.invoke0(Native Method)
	at sun.reflect.NativeMethodAccessorImpl.invoke(NativeMethodAccessorImpl.java:39)
	at sun.reflect.DelegatingMethodAccessorImpl.invoke(DelegatingMethodAccessorImpl.java:25)
	at java.lang.reflect.Method.invoke(Method.java:592)
	at org.codehaus.plexus.classworlds.launcher.Launcher.launchEnhanced(Launcher.java:290)
	at org.codehaus.plexus.classworlds.launcher.Launcher.launch(Launcher.java:230)
	at org.codehaus.plexus.classworlds.launcher.Launcher.mainWithExitCode(Launcher.java:409)
	at org.codehaus.plexus.classworlds.launcher.Launcher.main(Launcher.java:352)

Results :

Tests in error: 
  testit(org.apache.maven.it.MavenITmng2305MultipleProxiesTest): Exit code was non-zero: 1;
command line and log = 

Tests run: 699, Failures: 0, Errors: 1, Skipped: 0

[INFO] ------------------------------------------------------------------------
[INFO] Reactor Summary:
[INFO] 
[INFO] Maven Core ITs .................................... SUCCESS [2.947s]
[INFO] Maven IT Support .................................. SUCCESS [0.057s]
[INFO] Maven IT :: Plugins ............................... SUCCESS [0.051s]
[INFO] Maven IT Plugin :: Active Collection .............. SUCCESS [2.008s]
[INFO] Maven IT Plugin :: Ant-Based ...................... SUCCESS [0.632s]
[INFO] Maven IT Plugin :: Artifact ....................... SUCCESS [1.158s]
[INFO] Maven IT Plugin :: Class Loader :: Dependency A ... SUCCESS [0.374s]
[INFO] Maven IT Plugin :: Class Loader :: Dependency B ... SUCCESS [0.438s]
[INFO] Maven IT Plugin :: Class Loader :: Dependency C ... SUCCESS [0.098s]
[INFO] Maven IT Plugin :: Class Loader ................... SUCCESS [1.518s]
[INFO] Maven IT Plugin :: Class Loader :: Aggregator ..... SUCCESS [0.028s]
[INFO] Maven IT Plugin :: Configuration .................. SUCCESS [0.954s]
[INFO] Maven IT Plugin :: Context Passing ................ SUCCESS [0.388s]
[INFO] Maven ITs :: Core Plugin Stubs .................... SUCCESS [0.021s]
[INFO] Maven IT Clean Plugin Stub ........................ SUCCESS [0.572s]
[INFO] Maven IT Compiler Plugin Stub ..................... SUCCESS [0.600s]
[INFO] Maven IT Deploy Plugin Stub ....................... SUCCESS [0.469s]
[INFO] Maven IT EAR Plugin Stub .......................... SUCCESS [0.414s]
[INFO] Maven IT EJB Plugin Stub .......................... SUCCESS [0.562s]
[INFO] Maven IT Install Plugin Stub ...................... SUCCESS [0.537s]
[INFO] Maven IT JAR Plugin Stub .......................... SUCCESS [0.593s]
[INFO] Maven IT Javadoc Plugin Stub ...................... SUCCESS [0.475s]
[INFO] Maven IT Plugin Plugin Stub ....................... SUCCESS [0.462s]
[INFO] Maven IT RAR Plugin Stub .......................... SUCCESS [0.510s]
[INFO] Maven IT Resources Plugin Stub .................... SUCCESS [0.427s]
[INFO] Maven IT Site Plugin Stub ......................... SUCCESS [0.505s]
[INFO] Maven IT Source Plugin Stub ....................... SUCCESS [0.414s]
[INFO] Maven IT Surefire Plugin Stub ..................... SUCCESS [0.439s]
[INFO] Maven IT WAR Plugin Stub .......................... SUCCESS [0.397s]
[INFO] Maven IT Plugin :: Dependency Collection .......... SUCCESS [0.822s]
[INFO] Maven IT Plugin :: Dependency Resolution .......... SUCCESS [0.633s]
[INFO] Maven IT Plugin :: Expression ..................... SUCCESS [1.240s]
[INFO] Maven IT Plugin :: Error Mojos .................... SUCCESS [0.728s]
[INFO] Maven IT Component ................................ SUCCESS [0.559s]
[INFO] Maven IT Plugin :: Extension Consumer ............. SUCCESS [0.388s]
[INFO] Maven IT Plugin :: Extension Provider ............. SUCCESS [0.412s]
[INFO] Maven IT Plugin :: Fork ........................... SUCCESS [0.574s]
[INFO] Maven IT Plugin :: Invalid Descriptor ............. SUCCESS [0.556s]
[INFO] Maven IT Plugin :: Log File ....................... SUCCESS [0.487s]
[INFO] Maven IT Plugin :: No Default Component ........... SUCCESS [0.460s]
[INFO] Maven IT Plugin :: No Project ..................... SUCCESS [0.733s]
[INFO] Maven IT Plugin :: Online ......................... SUCCESS [0.365s]
[INFO] Maven IT Plugin :: Optional Mojos ................. SUCCESS [0.388s]
[INFO] Maven IT Plugin :: Packaging ...................... SUCCESS [0.367s]
[INFO] Maven IT Plugin :: Parameter Implementation ....... SUCCESS [0.383s]
[INFO] Maven IT Plugin :: Plugin Dependency .............. SUCCESS [0.540s]
[INFO] Maven IT Plugin :: Project ........................ SUCCESS [0.499s]
[INFO] Maven IT Helper Library ........................... SUCCESS [1.429s]
[INFO] Maven IT Plugin :: Project Interpolation .......... SUCCESS [0.706s]
[INFO] Maven IT Plugin :: Setter ......................... SUCCESS [0.342s]
[INFO] Maven IT Plugin :: Singleton Component ............ SUCCESS [0.380s]
[INFO] Maven IT Plugin :: Site ........................... SUCCESS [0.555s]
[INFO] Maven IT Plugin :: Toolchain ...................... SUCCESS [1.606s]
[INFO] Maven IT Plugin :: Touch .......................... SUCCESS [0.696s]
[INFO] Maven IT Plugin :: Uses Properties Plugin ......... SUCCESS [0.371s]
[INFO] Maven IT Plugin :: Uses Wagon Plugin .............. SUCCESS [1.057s]
[INFO] Maven IT Plugin :: This plugin should contain the mojos needed by all tests.  SUCCESS
[0.377s]
[INFO] Maven IT Plugin :: Plexus Utils 1.1 ............... SUCCESS [0.545s]
[INFO] Maven IT Plugin :: Plexus Utils New ............... SUCCESS [0.692s]
[INFO] Maven IT Plugin :: Plexus Component API ........... SUCCESS [0.804s]
[INFO] Maven IT Plugin :: Log4J Client ................... SUCCESS [0.498s]
[INFO] maven-it-plugin-extension1 ........................ SUCCESS [0.341s]
[INFO] maven-it-plugin-extension2 ........................ SUCCESS [0.333s]
[INFO] Maven IT Toolchain ................................ SUCCESS [0.805s]
[INFO] Maven IT Wagon .................................... SUCCESS [1.056s]
[INFO] Maven IT Support Artifacts ........................ SUCCESS [0.382s]
[INFO] Maven IT Extension ................................ SUCCESS [0.314s]
[INFO] Maven ITs ......................................... FAILURE [27:15.416s]
[INFO] ------------------------------------------------------------------------
[INFO] BUILD FAILURE
[INFO] ------------------------------------------------------------------------
[INFO] Total time: 27:58.615s
[INFO] Finished at: Thu Sep 29 23:38:11 BST 2011
[INFO] Final Memory: 35M/686M
[INFO] ------------------------------------------------------------------------
[ERROR] Failed to execute goal org.apache.maven.plugins:maven-surefire-plugin:2.9:test (default-test)
on project core-it-suite: There are test failures.
[ERROR] 
[ERROR] Please refer to F:\hudson\hudson-slave\workspace\core-integration-testing-maven-3-windows\core-it\core-it-suite\target\surefire-reports
for the individual test results.
[ERROR] -> [Help 1]
[ERROR] 
[ERROR] To see the full stack trace of the errors, re-run Maven with the -e switch.
[ERROR] Re-run Maven using the -X switch to enable full debug logging.
[ERROR] 
[ERROR] For more information about the errors and possible solutions, please read the following
articles:
[ERROR] [Help 1] http://cwiki.apache.org/confluence/display/MAVEN/MojoFailureException
[ERROR] 
[ERROR] After correcting the problems, you can resume the build with the command
[ERROR]   mvn <goals> -rf :core-it-suite
Build step 'Invoke top-level Maven targets' marked build as failure
Recording test results


Mime
View raw message