maven-notifications mailing list archives

Site index · List index
Message view « Date » · « Thread »
Top « Date » · « Thread »
From Apache Jenkins Server <jenk...@builds.apache.org>
Subject Build failed in Jenkins: core-integration-testing-maven-3-windows #36
Date Thu, 08 Sep 2011 12:23:53 GMT
See <https://builds.apache.org/job/core-integration-testing-maven-3-windows/36/changes>

Changes:

[bentmann] o Updated to buildnumber-maven-plugin:1.0

------------------------------------------
[...truncated 39402 lines...]
  testitMatchesById(org.apache.maven.it.MavenITmng2576MakeLikeReactorTest): Exit code was
non-zero: 1; command line and log = 
  testitMatchesByArtifactId(org.apache.maven.it.MavenITmng2576MakeLikeReactorTest): Exit code
was non-zero: 1; command line and log = 
  testitResumeFrom(org.apache.maven.it.MavenITmng2576MakeLikeReactorTest): Exit code was non-zero:
1; command line and log = 
  testitDefaultFormat(org.apache.maven.it.MavenITmng2562TimestampTest): Exit code was non-zero:
1; command line and log = 
  testitCustomFormat(org.apache.maven.it.MavenITmng2562TimestampTest): Exit code was non-zero:
1; command line and log = 
  testitSameValueAcrossModules(org.apache.maven.it.MavenITmng2562TimestampTest): Exit code
was non-zero: 1; command line and log = 
  testit(org.apache.maven.it.MavenITmng2486TimestampedDependencyVersionInterpolationTest):
Exit code was non-zero: 1; command line and log = 
  testitMNG2432(org.apache.maven.it.MavenITmng2432PluginPrefixOrderTest): Exit code was non-zero:
1; command line and log = 
  testit(org.apache.maven.it.MavenITmng2387InactiveProxyTest): Exit code was non-zero: 1;
command line and log = 
  testit(org.apache.maven.it.MavenITmng2363BasedirAwareFileActivatorTest): Exit code was non-zero:
1; command line and log = 
  testit(org.apache.maven.it.MavenITmng2362DeployedPomEncodingTest): Exit code was non-zero:
1; command line and log = 
  testitMNG2339a(org.apache.maven.it.MavenITmng2339BadProjectInterpolationTest): Exit code
was non-zero: 1; command line and log = 
  testitMNG2339b(org.apache.maven.it.MavenITmng2339BadProjectInterpolationTest): Exit code
was non-zero: 1; command line and log = 
  testitMNG2318(org.apache.maven.it.MavenITmng2318LocalParentResolutionTest): Exit code was
non-zero: 1; command line and log = 
  testitMNG2309(org.apache.maven.it.MavenITmng2309ProfileInjectionOrderTest): Exit code was
non-zero: 1; command line and log = 
  testit(org.apache.maven.it.MavenITmng2305MultipleProxiesTest): Exit code was non-zero: 1;
command line and log = 
  testitMNG2293(org.apache.maven.it.MavenITmng2293CustomPluginParamImplTest): Exit code was
non-zero: 1; command line and log = 
  testitMNG2277(org.apache.maven.it.MavenITmng2277AggregatorAndResolutionPluginsTest): Exit
code was non-zero: 1; command line and log = 
  testitActivation(org.apache.maven.it.MavenITmng2276ProfileActivationBySettingsPropertyTest):
Exit code was non-zero: 1; command line and log = 
  testitCliWins(org.apache.maven.it.MavenITmng2276ProfileActivationBySettingsPropertyTest):
Exit code was non-zero: 1; command line and log = 
  testitMNG2254(org.apache.maven.it.MavenITmng2254PomEncodingTest): Exit code was non-zero:
1; command line and log = 
  testitMNG2234(org.apache.maven.it.MavenITmng2234ActiveProfilesFromSettingsTest): Exit code
was non-zero: 1; command line and log = 
  testitMNG2228(org.apache.maven.it.MavenITmng2228ComponentInjectionTest): Exit code was non-zero:
1; command line and log = 
  testit(org.apache.maven.it.MavenITmng2222OutputDirectoryReactorResolutionTest): Exit code
was non-zero: 1; command line and log = 
  testitMNG2201(org.apache.maven.it.MavenITmng2201PluginConfigInterpolationTest): Exit code
was non-zero: 1; command line and log = 
  testitMNG2174(org.apache.maven.it.MavenITmng2174PluginDepsManagedByParentProfileTest): Exit
code was non-zero: 1; command line and log = 
  testit(org.apache.maven.it.MavenITmng2140ReactorAwareDepResolutionWhenForkTest): Exit code
was non-zero: 1; command line and log = 
  testitMNG2136(org.apache.maven.it.MavenITmng2136ActiveByDefaultProfileTest): Exit code was
non-zero: 1; command line and log = 
  testit(org.apache.maven.it.MavenITmng2135PluginBuildInReactorTest): Exit code was non-zero:
1; command line and log = 
  testitMNG2130(org.apache.maven.it.MavenITmng2130ParentLookupFromReactorCacheTest): Exit
code was non-zero: 1; command line and log = 
  testitMNG2124(org.apache.maven.it.MavenITmng2124PomInterpolationWithParentValuesTest): Exit
code was non-zero: 1; command line and log = 
  testitMNG2123(org.apache.maven.it.MavenITmng2123VersionRangeDependencyTest): Exit code was
non-zero: 1; command line and log = 
  testit(org.apache.maven.it.MavenITmng2103PluginExecutionInheritanceTest): Exit code was
non-zero: 1; command line and log = 
  testit(org.apache.maven.it.MavenITmng2098VersionRangeSatisfiedFromWrongRepoTest): Exit code
was non-zero: 1; command line and log = 
  testitInheritedIdFields(org.apache.maven.it.MavenITmng2068ReactorRelativeParentsTest): Exit
code was non-zero: 1; command line and log = 
  testitExplicitIdFields(org.apache.maven.it.MavenITmng2068ReactorRelativeParentsTest): Exit
code was non-zero: 1; command line and log = 
  testitComplex(org.apache.maven.it.MavenITmng2068ReactorRelativeParentsTest): Exit code was
non-zero: 1; command line and log = 
  testitMNG2054(org.apache.maven.it.MavenITmng2054PluginExecutionInheritanceTest): Exit code
was non-zero: 1; command line and log = 
  testitMNG2052(org.apache.maven.it.MavenITmng2052InterpolateWithSettingsProfilePropertiesTest):
Exit code was non-zero: 1; command line and log = 
  testitMNG2045(org.apache.maven.it.MavenITmng2045testJarDependenciesBrokenInReactorTest):
Exit code was non-zero: 1; command line and log = 
  testitMNG2006(org.apache.maven.it.MavenITmng2006ChildPathAwareUrlInheritanceTest): Exit
code was non-zero: 1; command line and log = 
  testitMNG1995(org.apache.maven.it.MavenITmng1995InterpolateBooleanModelElementsTest): Exit
code was non-zero: 1; command line and log = 
  testitMNG1992(org.apache.maven.it.MavenITmng1992SystemPropOverridesPomPropTest): Exit code
was non-zero: 1; command line and log = 
  testitMNG1957(org.apache.maven.it.MavenITmng1957JdkActivationWithVersionRangeTest): Exit
code was non-zero: 1; command line and log = 
  testitDirectVsIndirect(org.apache.maven.it.MavenITmng1895ScopeConflictResolutionTest): Exit
code was non-zero: 1; command line and log = 
  testitCompileVsRuntime(org.apache.maven.it.MavenITmng1895ScopeConflictResolutionTest): Exit
code was non-zero: 1; command line and log = 
  testitCompileVsTest(org.apache.maven.it.MavenITmng1895ScopeConflictResolutionTest): Exit
code was non-zero: 1; command line and log = 
  testitCompileVsProvided(org.apache.maven.it.MavenITmng1895ScopeConflictResolutionTest):
Exit code was non-zero: 1; command line and log = 
  testitRuntimeVsTest(org.apache.maven.it.MavenITmng1895ScopeConflictResolutionTest): Exit
code was non-zero: 1; command line and log = 
  testitRuntimeVsProvided(org.apache.maven.it.MavenITmng1895ScopeConflictResolutionTest):
Exit code was non-zero: 1; command line and log = 
  testitProvidedVsTest(org.apache.maven.it.MavenITmng1895ScopeConflictResolutionTest): Exit
code was non-zero: 1; command line and log = 
  testVersion(org.apache.maven.it.MavenITmng1830ShowVersionTest): Exit code was non-zero:
1; command line and log = 
  testit(org.apache.maven.it.MavenITmng1751ForcedMetadataUpdateDuringDeploymentTest): Exit
code was non-zero: 1; command line and log = 
  testitMNG1703(org.apache.maven.it.MavenITmng1703PluginMgmtDepInheritanceTest): Exit code
was non-zero: 1; command line and log = 
  testit(org.apache.maven.it.MavenITmng1701DuplicatePluginTest): Exit code was non-zero: 1;
command line and log = 
  testitMNG1493(org.apache.maven.it.MavenITmng1493NonStandardModulePomNamesTest): Exit code
was non-zero: 1; command line and log = 
  testitMNG1415(org.apache.maven.it.MavenITmng1415QuotedSystemPropertiesTest): Exit code was
non-zero: 1; command line and log = 
  testitMNG1412(org.apache.maven.it.MavenITmng1412DependenciesOrderTest): Exit code was non-zero:
1; command line and log = 
  testitMNG1349(org.apache.maven.it.MavenITmng1349ChecksumFormatsTest): Exit code was non-zero:
1; command line and log = 
  testitMNG1323(org.apache.maven.it.MavenITmng1323AntrunDependenciesTest): Exit code was non-zero:
1; command line and log = 
  testitMNG1233(org.apache.maven.it.MavenITmng1233WarDepWithProvidedScopeTest): Exit code
was non-zero: 1; command line and log = 
  testit(org.apache.maven.it.MavenITmng1144MultipleDefaultGoalsTest): Exit code was non-zero:
1; command line and log = 
  testitAB(org.apache.maven.it.MavenITmng1142VersionRangeIntersectionTest): Exit code was
non-zero: 1; command line and log = 
  testitBA(org.apache.maven.it.MavenITmng1142VersionRangeIntersectionTest): Exit code was
non-zero: 1; command line and log = 
  testitMNG1088(org.apache.maven.it.MavenITmng1088ReactorPluginResolutionTest): Exit code
was non-zero: 1; command line and log = 
  testitForkLifecycle(org.apache.maven.it.MavenITmng1073AggregatorForksReactorTest): Exit
code was non-zero: 1; command line and log = 
  testitForkGoal(org.apache.maven.it.MavenITmng1073AggregatorForksReactorTest): Exit code
was non-zero: 1; command line and log = 
  testitMNG1052(org.apache.maven.it.MavenITmng1052PluginMngtConfigTest): Exit code was non-zero:
1; command line and log = 
  testitMNG1021(org.apache.maven.it.MavenITmng1021EqualAttachmentBuildNumberTest): Exit code
was non-zero: 1; command line and log = 
  testitMNG0985(org.apache.maven.it.MavenITmng0985NonExecutedPluginMngtGoalsTest): Exit code
was non-zero: 1; command line and log = 
  testitMNG0956(org.apache.maven.it.MavenITmng0956ComponentInjectionViaProjectLevelPluginDepTest):
Exit code was non-zero: 1; command line and log = 
  testit(org.apache.maven.it.MavenITmng0947OptionalDependencyTest): Exit code was non-zero:
1; command line and log = 
  testitMNG0870(org.apache.maven.it.MavenITmng0870ReactorAwarePluginDiscoveryTest): Exit code
was non-zero: 1; command line and log = 
  testitMNG866(org.apache.maven.it.MavenITmng0866EvaluateDefaultValueTest): Exit code was
non-zero: 1; command line and log = 
  testitMNG848(org.apache.maven.it.MavenITmng0848SystemPropOverridesDefaultValueTest): Exit
code was non-zero: 1; command line and log = 
  testitMNG0823(org.apache.maven.it.MavenITmng0823MojoContextPassingTest): Exit code was non-zero:
1; command line and log = 
  testitMNG0820(org.apache.maven.it.MavenITmng0820ConflictResolutionTest): Exit code was non-zero:
1; command line and log = 
  testitMNG0818(org.apache.maven.it.MavenITmng0818WarDepsNotTransitiveTest): Exit code was
non-zero: 1; command line and log = 
  testitMNG814(org.apache.maven.it.MavenITmng0814ExplicitProfileActivationTest): Exit code
was non-zero: 1; command line and log = 
  testitMNG0786(org.apache.maven.it.MavenITmng0786ProfileAwareReactorTest): Exit code was
non-zero: 1; command line and log = 
  testitMNG0781(org.apache.maven.it.MavenITmng0781PluginConfigVsExecConfigTest): Exit code
was non-zero: 1; command line and log = 
  testitMNG773(org.apache.maven.it.MavenITmng0773SettingsProfileReactorPollutionTest): Exit
code was non-zero: 1; command line and log = 
  testitMNG768(org.apache.maven.it.MavenITmng0768OfflineModeTest): Exit code was non-zero:
1; command line and log = 
  testitMNG761(org.apache.maven.it.MavenITmng0761MissingSnapshotDistRepoTest): Exit code was
non-zero: 1; command line and log = 
  testitMNG680(org.apache.maven.it.MavenITmng0680ParentBasedirTest): Exit code was non-zero:
1; command line and log = 
  testitLifecycle(org.apache.maven.it.MavenITmng0674PluginParameterAliasTest): Exit code was
non-zero: 1; command line and log = 
  testitCli(org.apache.maven.it.MavenITmng0674PluginParameterAliasTest): Exit code was non-zero:
1; command line and log = 
  testitMNG666(org.apache.maven.it.MavenITmng0666IgnoreLegacyPomTest): Exit code was non-zero:
1; command line and log = 
  testitMNG557(org.apache.maven.it.MavenITmng0557UserSettingsCliOptionTest): Exit code was
non-zero: 1; command line and log = 
  testitMNG522(org.apache.maven.it.MavenITmng0522InheritedPluginMgmtConfigTest): Exit code
was non-zero: 1; command line and log = 
  testitMNG507(org.apache.maven.it.MavenITmng0507ArtifactRelocationTest): Exit code was non-zero:
1; command line and log = 
  testitMNG505(org.apache.maven.it.MavenITmng0505VersionRangeTest): Exit code was non-zero:
1; command line and log = 
  testitMNG496(org.apache.maven.it.MavenITmng0496IgnoreUnknownPluginParametersTest): Exit
code was non-zero: 1; command line and log = 
  testitModel(org.apache.maven.it.MavenITmng0479OverrideCentralRepoTest): Exit code was non-zero:
1; command line and log = 
  testitResolution(org.apache.maven.it.MavenITmng0479OverrideCentralRepoTest): Exit code was
non-zero: 1; command line and log = 
  testitMNG471(org.apache.maven.it.MavenITmng0471CustomLifecycleTest): Exit code was non-zero:
1; command line and log = 
  testitBuildConfigDominantDuringBuild(org.apache.maven.it.MavenITmng0469ReportConfigTest):
Exit code was non-zero: 1; command line and log = 
  testitBuildConfigIrrelevantForReports(org.apache.maven.it.MavenITmng0469ReportConfigTest):
Exit code was non-zero: 1; command line and log = 
  testit(org.apache.maven.it.MavenITmng0461TolerateMissingDependencyPomTest): Exit code was
non-zero: 1; command line and log = 
  testitLifecycleInvocation(org.apache.maven.it.MavenITmng0449PluginVersionResolutionTest):
Exit code was non-zero: 1; command line and log = 
  testitCliInvocation(org.apache.maven.it.MavenITmng0449PluginVersionResolutionTest): Exit
code was non-zero: 1; command line and log = 
  testitMNG377(org.apache.maven.it.MavenITmng0377PluginLookupFromPrefixTest): Exit code was
non-zero: 1; command line and log = 
  testitMNG294(org.apache.maven.it.MavenITmng0294MergeGlobalAndUserSettingsTest): Exit code
was non-zero: 1; command line and log = 
  testitMNG282(org.apache.maven.it.MavenITmng0282NonReactorExecWhenProjectIndependentTest):
Exit code was non-zero: 1; command line and log = 
  testitMNG0249(org.apache.maven.it.MavenITmng0249ResolveDepsFromReactorTest): Exit code was
non-zero: 1; command line and log = 
  testit(org.apache.maven.it.MavenITmng0187CollectedProjectsTest): Exit code was non-zero:
1; command line and log = 
  testitFailNever(org.apache.maven.it.MavenITmng0095ReactorFailureBehaviorTest): Exit code
was non-zero: 1; command line and log = 
  testit0144(org.apache.maven.it.MavenIT0144LifecycleExecutionOrderTest): Exit code was non-zero:
1; command line and log = 
  testitCompileScope(org.apache.maven.it.MavenIT0143TransitiveDependencyScopesTest): Exit
code was non-zero: 1; command line and log = 
  testitProvidedScope(org.apache.maven.it.MavenIT0143TransitiveDependencyScopesTest): Exit
code was non-zero: 1; command line and log = 
  testitRuntimeScope(org.apache.maven.it.MavenIT0143TransitiveDependencyScopesTest): Exit
code was non-zero: 1; command line and log = 
  testitTestScope(org.apache.maven.it.MavenIT0143TransitiveDependencyScopesTest): Exit code
was non-zero: 1; command line and log = 
  testit0142(org.apache.maven.it.MavenIT0142DirectDependencyScopesTest): Exit code was non-zero:
1; command line and log = 
  testit0140(org.apache.maven.it.MavenIT0140InterpolationWithPomPrefixTest): Exit code was
non-zero: 1; command line and log = 
  testit0139(org.apache.maven.it.MavenIT0139InterpolationWithProjectPrefixTest): Exit code
was non-zero: 1; command line and log = 
  testit0138(org.apache.maven.it.MavenIT0138PluginLifecycleTest): Exit code was non-zero:
1; command line and log = 
  testit0137(org.apache.maven.it.MavenIT0137EarLifecycleTest): Exit code was non-zero: 1;
command line and log = 
  testit0136(org.apache.maven.it.MavenIT0136RarLifecycleTest): Exit code was non-zero: 1;
command line and log = 
  testit0135(org.apache.maven.it.MavenIT0135EjbLifecycleTest): Exit code was non-zero: 1;
command line and log = 
  testit0134(org.apache.maven.it.MavenIT0134WarLifecycleTest): Exit code was non-zero: 1;
command line and log = 
  testit0133(org.apache.maven.it.MavenIT0133JarLifecycleTest): Exit code was non-zero: 1;
command line and log = 
  testit0132(org.apache.maven.it.MavenIT0132PomLifecycleTest): Exit code was non-zero: 1;
command line and log = 
  testit0131(org.apache.maven.it.MavenIT0131SiteLifecycleTest): Exit code was non-zero: 1;
command line and log = 
  testit0130(org.apache.maven.it.MavenIT0130CleanLifecycleTest): Exit code was non-zero: 1;
command line and log = 
  testit0113(org.apache.maven.it.MavenIT0113ServerAuthzAvailableToWagonMgrInPluginTest): Exit
code was non-zero: 1; command line and log = 
  testit0090(org.apache.maven.it.MavenIT0090EnvVarInterpolationTest): Exit code was non-zero:
1; command line and log = 
  testit0087(org.apache.maven.it.MavenIT0087PluginRealmWithProjectLevelDepsTest): Exit code
was non-zero: 1; command line and log = 
  testit0086(org.apache.maven.it.MavenIT0086PluginRealmTest): Exit code was non-zero: 1; command
line and log = 
  testit0085(org.apache.maven.it.MavenIT0085TransitiveSystemScopeTest): Exit code was non-zero:
1; command line and log = 
  testit0072(org.apache.maven.it.MavenIT0072InterpolationWithDottedPropertyTest): Exit code
was non-zero: 1; command line and log = 
  testit0071(org.apache.maven.it.MavenIT0071PluginConfigWithDottedPropertyTest): Exit code
was non-zero: 1; command line and log = 
  testit0064(org.apache.maven.it.MavenIT0064MojoConfigViaSettersTest): Exit code was non-zero:
1; command line and log = 
  testit0063(org.apache.maven.it.MavenIT0063SystemScopeDependencyTest): Exit code was non-zero:
1; command line and log = 
  testit0056(org.apache.maven.it.MavenIT0056MultipleGoalExecutionsTest): Exit code was non-zero:
1; command line and log = 
  testit0052(org.apache.maven.it.MavenIT0052ReleaseProfileTest): Exit code was non-zero: 1;
command line and log = 
  testit0051(org.apache.maven.it.MavenIT0051ReleaseProfileTest): Exit code was non-zero: 1;
command line and log = 
  testit0041(org.apache.maven.it.MavenIT0041ArtifactTypeFromPluginExtensionTest): Exit code
was non-zero: 1; command line and log = 
  testit0040(org.apache.maven.it.MavenIT0040PackagingFromPluginExtensionTest): Exit code was
non-zero: 1; command line and log = 
  testit0038(org.apache.maven.it.MavenIT0038AlternatePomFileDifferentDirTest): Exit code was
non-zero: 1; command line and log = 
  testit0037(org.apache.maven.it.MavenIT0037AlternatePomFileSameDirTest): Exit code was non-zero:
1; command line and log = 
  testit0032(org.apache.maven.it.MavenIT0032MavenPrerequisiteTest): Exit code was non-zero:
1; command line and log = 
  testit0030(org.apache.maven.it.MavenIT0030DepPomDepMngtInheritanceTest): Exit code was non-zero:
1; command line and log = 
  testit0025(org.apache.maven.it.MavenIT0025MultipleExecutionLevelConfigsTest): Exit code
was non-zero: 1; command line and log = 
  testit0024(org.apache.maven.it.MavenIT0024MultipleGoalExecutionsTest): Exit code was non-zero:
1; command line and log = 
  testit0023(org.apache.maven.it.MavenIT0023SettingsProfileTest): Exit code was non-zero:
1; command line and log = 
  testit0021(org.apache.maven.it.MavenIT0021PomProfileTest): Exit code was non-zero: 1; command
line and log = 
  testit0019(org.apache.maven.it.MavenIT0019PluginVersionMngtBySuperPomTest): Exit code was
non-zero: 1; command line and log = 
  testit0018(org.apache.maven.it.MavenIT0018DependencyManagementTest): Exit code was non-zero:
1; command line and log = 
  testit0012(org.apache.maven.it.MavenIT0012PomInterpolationTest): Exit code was non-zero:
1; command line and log = 
  testit0011(org.apache.maven.it.MavenIT0011DefaultVersionByDependencyManagementTest): Exit
code was non-zero: 1; command line and log = 
  testit0010(org.apache.maven.it.MavenIT0010DependencyClosureResolutionTest): Exit code was
non-zero: 1; command line and log = 
  testit0009(org.apache.maven.it.MavenIT0009GoalConfigurationTest): Exit code was non-zero:
1; command line and log = 
  testit0008(org.apache.maven.it.MavenIT0008SimplePluginTest): Exit code was non-zero: 1;
command line and log = 

Tests run: 699, Failures: 17, Errors: 533, Skipped: 0

[INFO] ------------------------------------------------------------------------
[INFO] Reactor Summary:
[INFO] 
[INFO] Maven Core ITs .................................... SUCCESS [6.396s]
[INFO] Maven IT Support .................................. SUCCESS [0.105s]
[INFO] Maven IT :: Plugins ............................... SUCCESS [0.073s]
[INFO] Maven IT Plugin :: Active Collection .............. SUCCESS [5.733s]
[INFO] Maven IT Plugin :: Ant-Based ...................... SUCCESS [3.653s]
[INFO] Maven IT Plugin :: Artifact ....................... SUCCESS [8.631s]
[INFO] Maven IT Plugin :: Class Loader :: Dependency A ... SUCCESS [3.909s]
[INFO] Maven IT Plugin :: Class Loader :: Dependency B ... SUCCESS [3.643s]
[INFO] Maven IT Plugin :: Class Loader :: Dependency C ... SUCCESS [0.389s]
[INFO] Maven IT Plugin :: Class Loader ................... SUCCESS [32.423s]
[INFO] Maven IT Plugin :: Class Loader :: Aggregator ..... SUCCESS [0.145s]
[INFO] Maven IT Plugin :: Configuration .................. SUCCESS [7.232s]
[INFO] Maven IT Plugin :: Context Passing ................ SUCCESS [4.806s]
[INFO] Maven ITs :: Core Plugin Stubs .................... SUCCESS [0.189s]
[INFO] Maven IT Clean Plugin Stub ........................ SUCCESS [1.600s]
[INFO] Maven IT Compiler Plugin Stub ..................... SUCCESS [1.302s]
[INFO] Maven IT Deploy Plugin Stub ....................... SUCCESS [0.643s]
[INFO] Maven IT EAR Plugin Stub .......................... SUCCESS [0.893s]
[INFO] Maven IT EJB Plugin Stub .......................... SUCCESS [0.668s]
[INFO] Maven IT Install Plugin Stub ...................... SUCCESS [0.944s]
[INFO] Maven IT JAR Plugin Stub .......................... SUCCESS [0.740s]
[INFO] Maven IT Javadoc Plugin Stub ...................... SUCCESS [0.724s]
[INFO] Maven IT Plugin Plugin Stub ....................... SUCCESS [0.776s]
[INFO] Maven IT RAR Plugin Stub .......................... SUCCESS [0.661s]
[INFO] Maven IT Resources Plugin Stub .................... SUCCESS [0.770s]
[INFO] Maven IT Site Plugin Stub ......................... SUCCESS [0.928s]
[INFO] Maven IT Source Plugin Stub ....................... SUCCESS [0.888s]
[INFO] Maven IT Surefire Plugin Stub ..................... SUCCESS [1.020s]
[INFO] Maven IT WAR Plugin Stub .......................... SUCCESS [1.254s]
[INFO] Maven IT Plugin :: Dependency Collection .......... SUCCESS [1.890s]
[INFO] Maven IT Plugin :: Dependency Resolution .......... SUCCESS [1.625s]
[INFO] Maven IT Plugin :: Expression ..................... SUCCESS [2.255s]
[INFO] Maven IT Plugin :: Error Mojos .................... SUCCESS [1.511s]
[INFO] Maven IT Component ................................ SUCCESS [0.970s]
[INFO] Maven IT Plugin :: Extension Consumer ............. SUCCESS [0.695s]
[INFO] Maven IT Plugin :: Extension Provider ............. SUCCESS [0.650s]
[INFO] Maven IT Plugin :: Fork ........................... SUCCESS [1.280s]
[INFO] Maven IT Plugin :: Invalid Descriptor ............. SUCCESS [1.138s]
[INFO] Maven IT Plugin :: Log File ....................... SUCCESS [0.648s]
[INFO] Maven IT Plugin :: No Default Component ........... SUCCESS [0.693s]
[INFO] Maven IT Plugin :: No Project ..................... SUCCESS [1.720s]
[INFO] Maven IT Plugin :: Online ......................... SUCCESS [0.560s]
[INFO] Maven IT Plugin :: Optional Mojos ................. SUCCESS [0.803s]
[INFO] Maven IT Plugin :: Packaging ...................... SUCCESS [0.839s]
[INFO] Maven IT Plugin :: Parameter Implementation ....... SUCCESS [0.594s]
[INFO] Maven IT Plugin :: Plugin Dependency .............. SUCCESS [0.963s]
[INFO] Maven IT Plugin :: Project ........................ SUCCESS [0.839s]
[INFO] Maven IT Helper Library ........................... SUCCESS [3.874s]
[INFO] Maven IT Plugin :: Project Interpolation .......... SUCCESS [1.246s]
[INFO] Maven IT Plugin :: Setter ......................... SUCCESS [0.729s]
[INFO] Maven IT Plugin :: Singleton Component ............ SUCCESS [0.648s]
[INFO] Maven IT Plugin :: Site ........................... SUCCESS [0.832s]
[INFO] Maven IT Plugin :: Toolchain ...................... SUCCESS [3.517s]
[INFO] Maven IT Plugin :: Touch .......................... SUCCESS [1.152s]
[INFO] Maven IT Plugin :: Uses Properties Plugin ......... SUCCESS [0.916s]
[INFO] Maven IT Plugin :: Uses Wagon Plugin .............. SUCCESS [1.313s]
[INFO] Maven IT Plugin :: This plugin should contain the mojos needed by all tests.  SUCCESS
[0.679s]
[INFO] Maven IT Plugin :: Plexus Utils 1.1 ............... SUCCESS [1.017s]
[INFO] Maven IT Plugin :: Plexus Utils New ............... SUCCESS [1.157s]
[INFO] Maven IT Plugin :: Plexus Component API ........... SUCCESS [1.374s]
[INFO] Maven IT Plugin :: Log4J Client ................... SUCCESS [0.564s]
[INFO] maven-it-plugin-extension1 ........................ SUCCESS [0.490s]
[INFO] maven-it-plugin-extension2 ........................ SUCCESS [0.395s]
[INFO] Maven IT Toolchain ................................ SUCCESS [1.269s]
[INFO] Maven IT Wagon .................................... SUCCESS [2.617s]
[INFO] Maven IT Support Artifacts ........................ SUCCESS [0.720s]
[INFO] Maven IT Extension ................................ SUCCESS [0.377s]
[INFO] Maven ITs ......................................... FAILURE [7:51.297s]
[INFO] ------------------------------------------------------------------------
[INFO] BUILD FAILURE
[INFO] ------------------------------------------------------------------------
[INFO] Total time: 10:18.505s
[INFO] Finished at: Thu Sep 08 13:23:30 BST 2011
[INFO] Final Memory: 55M/686M
[INFO] ------------------------------------------------------------------------
[ERROR] Failed to execute goal org.apache.maven.plugins:maven-surefire-plugin:2.9:test (default-test)
on project core-it-suite: There are test failures.
[ERROR] 
[ERROR] Please refer to F:\hudson\hudson-slave\workspace\core-integration-testing-maven-3-windows\core-it\core-it-suite\target\surefire-reports
for the individual test results.
[ERROR] -> [Help 1]
[ERROR] 
[ERROR] To see the full stack trace of the errors, re-run Maven with the -e switch.
[ERROR] Re-run Maven using the -X switch to enable full debug logging.
[ERROR] 
[ERROR] For more information about the errors and possible solutions, please read the following
articles:
[ERROR] [Help 1] http://cwiki.apache.org/confluence/display/MAVEN/MojoFailureException
[ERROR] 
[ERROR] After correcting the problems, you can resume the build with the command
[ERROR]   mvn <goals> -rf :core-it-suite
Build step 'Invoke top-level Maven targets' marked build as failure
Recording test results


Mime
View raw message