maven-notifications mailing list archives

Site index · List index
Message view « Date » · « Thread »
Top « Date » · « Thread »
From Apache Jenkins Server <jenk...@builds.apache.org>
Subject Build failed in Jenkins: core-integration-testing-maven-3-windows #22
Date Tue, 16 Aug 2011 15:42:50 GMT
See <https://builds.apache.org/job/core-integration-testing-maven-3-windows/22/changes>

Changes:

[brett] add reference to dev@ list

------------------------------------------
[...truncated 4829 lines...]
	at org.apache.maven.model.building.DefaultModelBuilder.build(DefaultModelBuilder.java:232)
	at org.apache.maven.project.DefaultProjectBuilder.build(DefaultProjectBuilder.java:385)
	at org.apache.maven.project.DefaultProjectBuilder.build(DefaultProjectBuilder.java:354)
	at org.apache.maven.project.DefaultProjectBuilder.build(DefaultProjectBuilder.java:318)
	at org.apache.maven.DefaultMaven.collectProjects(DefaultMaven.java:643)
	at org.apache.maven.DefaultMaven.getProjectsForMavenReactor(DefaultMaven.java:592)
	at org.apache.maven.DefaultMaven.doExecute(DefaultMaven.java:233)
	at org.apache.maven.DefaultMaven.execute(DefaultMaven.java:156)
	at org.apache.maven.cli.MavenCli.execute(MavenCli.java:537)
	at org.apache.maven.cli.MavenCli.doMain(MavenCli.java:196)
	at org.apache.maven.cli.MavenCli.main(MavenCli.java:141)
	at sun.reflect.NativeMethodAccessorImpl.invoke0(Native Method)
	at sun.reflect.NativeMethodAccessorImpl.invoke(NativeMethodAccessorImpl.java:39)
	at sun.reflect.DelegatingMethodAccessorImpl.invoke(DelegatingMethodAccessorImpl.java:25)
	at java.lang.reflect.Method.invoke(Method.java:592)
	at org.codehaus.plexus.classworlds.launcher.Launcher.launchEnhanced(Launcher.java:290)
	at org.codehaus.plexus.classworlds.launcher.Launcher.launch(Launcher.java:230)
	at org.codehaus.plexus.classworlds.launcher.Launcher.mainWithExitCode(Launcher.java:409)
	at org.codehaus.plexus.classworlds.launcher.Launcher.main(Launcher.java:352)
[ERROR] 
[ERROR] Re-run Maven using the -X switch to enable full debug logging.
[ERROR] 
[ERROR] For more information about the errors and possible solutions, please read the following
articles:
[ERROR] [Help 1] http://cwiki.apache.org/confluence/display/MAVEN/OutOfMemoryError

Exception in thread "CompilerThread0" java.lang.OutOfMemoryError: requested 232976 bytes for
Chunk::new. Out of swap space?

	at org.apache.maven.it.Verifier.executeGoals(Verifier.java:1397)
	at org.apache.maven.it.Verifier.executeGoal(Verifier.java:1240)
	at org.apache.maven.it.Verifier.executeGoal(Verifier.java:1234)
	at org.apache.maven.it.MavenITmng4768NearestMatchConflictResolutionTest.testit(MavenITmng4768NearestMatchConflictResolutionTest.java:99)
	at org.apache.maven.it.MavenITmng4768NearestMatchConflictResolutionTest.testitABD(MavenITmng4768NearestMatchConflictResolutionTest.java:47)
	at sun.reflect.NativeMethodAccessorImpl.invoke0(Native Method)
	at sun.reflect.NativeMethodAccessorImpl.invoke(NativeMethodAccessorImpl.java:39)
	at sun.reflect.DelegatingMethodAccessorImpl.invoke(DelegatingMethodAccessorImpl.java:25)
	at java.lang.reflect.Method.invoke(Method.java:592)
	at junit.framework.TestCase.runTest(TestCase.java:168)
	at org.apache.maven.it.AbstractMavenIntegrationTestCase.runTest(AbstractMavenIntegrationTestCase.java:220)
	at junit.framework.TestCase.runBare(TestCase.java:134)
	at junit.framework.TestResult$1.protect(TestResult.java:110)
	at junit.framework.TestResult.runProtected(TestResult.java:128)
	at junit.framework.TestResult.run(TestResult.java:113)
	at junit.framework.TestCase.run(TestCase.java:124)
	at junit.framework.TestSuite.runTest(TestSuite.java:243)
	at junit.framework.TestSuite.run(TestSuite.java:238)
	at junit.framework.TestSuite.runTest(TestSuite.java:243)
	at junit.framework.TestSuite.run(TestSuite.java:238)
	at org.junit.internal.runners.JUnit38ClassRunner.run(JUnit38ClassRunner.java:83)
	at org.apache.maven.surefire.junit4.JUnit4TestSet.execute(JUnit4TestSet.java:53)
	at org.apache.maven.surefire.junit4.JUnit4Provider.executeTestSet(JUnit4Provider.java:123)
	at org.apache.maven.surefire.junit4.JUnit4Provider.invoke(JUnit4Provider.java:104)
	at sun.reflect.NativeMethodAccessorImpl.invoke0(Native Method)
	at sun.reflect.NativeMethodAccessorImpl.invoke(NativeMethodAccessorImpl.java:39)
	at sun.reflect.DelegatingMethodAccessorImpl.invoke(DelegatingMethodAccessorImpl.java:25)
	at java.lang.reflect.Method.invoke(Method.java:592)
	at org.apache.maven.surefire.util.ReflectionUtils.invokeMethodWithArray(ReflectionUtils.java:164)
	at org.apache.maven.surefire.booter.ProviderFactory$ProviderProxy.invoke(ProviderFactory.java:110)
	at org.apache.maven.surefire.booter.SurefireStarter.invokeProvider(SurefireStarter.java:172)
	at org.apache.maven.surefire.booter.SurefireStarter.runSuitesInProcess(SurefireStarter.java:120)
	at org.apache.maven.plugin.surefire.AbstractSurefireMojo.executeProvider(AbstractSurefireMojo.java:194)
	at org.apache.maven.plugin.surefire.AbstractSurefireMojo.executeAllProviders(AbstractSurefireMojo.java:176)
	at org.apache.maven.plugin.surefire.AbstractSurefireMojo.executeAfterPreconditionsChecked(AbstractSurefireMojo.java:134)
	at org.apache.maven.plugin.surefire.AbstractSurefireMojo.execute(AbstractSurefireMojo.java:97)
	at org.apache.maven.plugin.DefaultBuildPluginManager.executeMojo(DefaultBuildPluginManager.java:101)
	at org.apache.maven.lifecycle.internal.MojoExecutor.execute(MojoExecutor.java:209)
	at org.apache.maven.lifecycle.internal.MojoExecutor.execute(MojoExecutor.java:153)
	at org.apache.maven.lifecycle.internal.MojoExecutor.execute(MojoExecutor.java:145)
	at org.apache.maven.lifecycle.internal.LifecycleModuleBuilder.buildProject(LifecycleModuleBuilder.java:84)
	at org.apache.maven.lifecycle.internal.LifecycleModuleBuilder.buildProject(LifecycleModuleBuilder.java:59)
	at org.apache.maven.lifecycle.internal.LifecycleStarter.singleThreadedBuild(LifecycleStarter.java:183)
	at org.apache.maven.lifecycle.internal.LifecycleStarter.execute(LifecycleStarter.java:161)
	at org.apache.maven.DefaultMaven.doExecute(DefaultMaven.java:319)
	at org.apache.maven.DefaultMaven.execute(DefaultMaven.java:156)
	at org.apache.maven.cli.MavenCli.execute(MavenCli.java:537)
	at org.apache.maven.cli.MavenCli.doMain(MavenCli.java:196)
	at org.apache.maven.cli.MavenCli.main(MavenCli.java:141)
	at sun.reflect.NativeMethodAccessorImpl.invoke0(Native Method)
	at sun.reflect.NativeMethodAccessorImpl.invoke(NativeMethodAccessorImpl.java:39)
	at sun.reflect.DelegatingMethodAccessorImpl.invoke(DelegatingMethodAccessorImpl.java:25)
	at java.lang.reflect.Method.invoke(Method.java:592)
	at org.codehaus.plexus.classworlds.launcher.Launcher.launchEnhanced(Launcher.java:290)
	at org.codehaus.plexus.classworlds.launcher.Launcher.launch(Launcher.java:230)
	at org.codehaus.plexus.classworlds.launcher.Launcher.mainWithExitCode(Launcher.java:409)
	at org.codehaus.plexus.classworlds.launcher.Launcher.main(Launcher.java:352)
testitADB(org.apache.maven.it.MavenITmng4768NearestMatchConflictResolutionTest)  Time elapsed:
0.145 sec  <<< ERROR!
org.apache.maven.it.VerificationException: Exit code was non-zero: 1; command line and log
= 
<https://builds.apache.org/job/core-integration-testing-maven-3-windows/ws/apache-maven-3.0-SNAPSHOT\bin\mvn>
--global-settings F:\hudson\hudson-slave\workspace\core-integration-testing-maven-3-windows\core-it\core-it-suite\target\test-classes\settings.xml
-s settings.xml -e --batch-mode -Dmaven.repo.local=<https://builds.apache.org/job/core-integration-testing-maven-3-windows/ws/.repository>
validate

Exception in thread "CompilerThread1" java.lang.OutOfMemoryError: requested 277616 bytes for
Chunk::new. Out of swap space?

	at org.apache.maven.it.Verifier.executeGoals(Verifier.java:1397)
	at org.apache.maven.it.Verifier.executeGoal(Verifier.java:1240)
	at org.apache.maven.it.Verifier.executeGoal(Verifier.java:1234)
	at org.apache.maven.it.MavenITmng4768NearestMatchConflictResolutionTest.testit(MavenITmng4768NearestMatchConflictResolutionTest.java:99)
	at org.apache.maven.it.MavenITmng4768NearestMatchConflictResolutionTest.testitADB(MavenITmng4768NearestMatchConflictResolutionTest.java:54)
	at sun.reflect.NativeMethodAccessorImpl.invoke0(Native Method)
	at sun.reflect.NativeMethodAccessorImpl.invoke(NativeMethodAccessorImpl.java:39)
	at sun.reflect.DelegatingMethodAccessorImpl.invoke(DelegatingMethodAccessorImpl.java:25)
	at java.lang.reflect.Method.invoke(Method.java:592)
	at junit.framework.TestCase.runTest(TestCase.java:168)
	at org.apache.maven.it.AbstractMavenIntegrationTestCase.runTest(AbstractMavenIntegrationTestCase.java:220)
	at junit.framework.TestCase.runBare(TestCase.java:134)
	at junit.framework.TestResult$1.protect(TestResult.java:110)
	at junit.framework.TestResult.runProtected(TestResult.java:128)
	at junit.framework.TestResult.run(TestResult.java:113)
	at junit.framework.TestCase.run(TestCase.java:124)
	at junit.framework.TestSuite.runTest(TestSuite.java:243)
	at junit.framework.TestSuite.run(TestSuite.java:238)
	at junit.framework.TestSuite.runTest(TestSuite.java:243)
	at junit.framework.TestSuite.run(TestSuite.java:238)
	at org.junit.internal.runners.JUnit38ClassRunner.run(JUnit38ClassRunner.java:83)
	at org.apache.maven.surefire.junit4.JUnit4TestSet.execute(JUnit4TestSet.java:53)
	at org.apache.maven.surefire.junit4.JUnit4Provider.executeTestSet(JUnit4Provider.java:123)
	at org.apache.maven.surefire.junit4.JUnit4Provider.invoke(JUnit4Provider.java:104)
	at sun.reflect.NativeMethodAccessorImpl.invoke0(Native Method)
	at sun.reflect.NativeMethodAccessorImpl.invoke(NativeMethodAccessorImpl.java:39)
	at sun.reflect.DelegatingMethodAccessorImpl.invoke(DelegatingMethodAccessorImpl.java:25)
	at java.lang.reflect.Method.invoke(Method.java:592)
	at org.apache.maven.surefire.util.ReflectionUtils.invokeMethodWithArray(ReflectionUtils.java:164)
	at org.apache.maven.surefire.booter.ProviderFactory$ProviderProxy.invoke(ProviderFactory.java:110)
	at org.apache.maven.surefire.booter.SurefireStarter.invokeProvider(SurefireStarter.java:172)
	at org.apache.maven.surefire.booter.SurefireStarter.runSuitesInProcess(SurefireStarter.java:120)
	at org.apache.maven.plugin.surefire.AbstractSurefireMojo.executeProvider(AbstractSurefireMojo.java:194)
	at org.apache.maven.plugin.surefire.AbstractSurefireMojo.executeAllProviders(AbstractSurefireMojo.java:176)
	at org.apache.maven.plugin.surefire.AbstractSurefireMojo.executeAfterPreconditionsChecked(AbstractSurefireMojo.java:134)
	at org.apache.maven.plugin.surefire.AbstractSurefireMojo.execute(AbstractSurefireMojo.java:97)
	at org.apache.maven.plugin.DefaultBuildPluginManager.executeMojo(DefaultBuildPluginManager.java:101)
	at org.apache.maven.lifecycle.internal.MojoExecutor.execute(MojoExecutor.java:209)
	at org.apache.maven.lifecycle.internal.MojoExecutor.execute(MojoExecutor.java:153)
	at org.apache.maven.lifecycle.internal.MojoExecutor.execute(MojoExecutor.java:145)
	at org.apache.maven.lifecycle.internal.LifecycleModuleBuilder.buildProject(LifecycleModuleBuilder.java:84)
	at org.apache.maven.lifecycle.internal.LifecycleModuleBuilder.buildProject(LifecycleModuleBuilder.java:59)
	at org.apache.maven.lifecycle.internal.LifecycleStarter.singleThreadedBuild(LifecycleStarter.java:183)
	at org.apache.maven.lifecycle.internal.LifecycleStarter.execute(LifecycleStarter.java:161)
	at org.apache.maven.DefaultMaven.doExecute(DefaultMaven.java:319)
	at org.apache.maven.DefaultMaven.execute(DefaultMaven.java:156)
	at org.apache.maven.cli.MavenCli.execute(MavenCli.java:537)
	at org.apache.maven.cli.MavenCli.doMain(MavenCli.java:196)
	at org.apache.maven.cli.MavenCli.main(MavenCli.java:141)
	at sun.reflect.NativeMethodAccessorImpl.invoke0(Native Method)
	at sun.reflect.NativeMethodAccessorImpl.invoke(NativeMethodAccessorImpl.java:39)
	at sun.reflect.DelegatingMethodAccessorImpl.invoke(DelegatingMethodAccessorImpl.java:25)
	at java.lang.reflect.Method.invoke(Method.java:592)
	at org.codehaus.plexus.classworlds.launcher.Launcher.launchEnhanced(Launcher.java:290)
	at org.codehaus.plexus.classworlds.launcher.Launcher.launch(Launcher.java:230)
	at org.codehaus.plexus.classworlds.launcher.Launcher.mainWithExitCode(Launcher.java:409)
	at org.codehaus.plexus.classworlds.launcher.Launcher.main(Launcher.java:352)

Results :

Tests in error: 
  testitCmdLine(org.apache.maven.it.MavenITmng4776ForkedReactorPluginVersionResolutionTest):
Exit code was non-zero: 1; command line and log = 
  testitABD(org.apache.maven.it.MavenITmng4768NearestMatchConflictResolutionTest): Exit code
was non-zero: 1; command line and log = 
  testitADB(org.apache.maven.it.MavenITmng4768NearestMatchConflictResolutionTest): Exit code
was non-zero: 1; command line and log = 

Tests run: 699, Failures: 0, Errors: 3, Skipped: 0

[INFO] ------------------------------------------------------------------------
[INFO] Reactor Summary:
[INFO] 
[INFO] Maven Core ITs .................................... SUCCESS [4.386s]
[INFO] Maven IT Support .................................. SUCCESS [0.076s]
[INFO] Maven IT :: Plugins ............................... SUCCESS [0.113s]
[INFO] Maven IT Plugin :: Active Collection .............. SUCCESS [4.216s]
[INFO] Maven IT Plugin :: Ant-Based ...................... SUCCESS [1.356s]
[INFO] Maven IT Plugin :: Artifact ....................... SUCCESS [1.957s]
[INFO] Maven IT Plugin :: Class Loader :: Dependency A ... SUCCESS [0.582s]
[INFO] Maven IT Plugin :: Class Loader :: Dependency B ... SUCCESS [1.007s]
[INFO] Maven IT Plugin :: Class Loader :: Dependency C ... SUCCESS [0.337s]
[INFO] Maven IT Plugin :: Class Loader ................... SUCCESS [2.562s]
[INFO] Maven IT Plugin :: Class Loader :: Aggregator ..... SUCCESS [0.165s]
[INFO] Maven IT Plugin :: Configuration .................. SUCCESS [1.497s]
[INFO] Maven IT Plugin :: Context Passing ................ SUCCESS [0.540s]
[INFO] Maven ITs :: Core Plugin Stubs .................... SUCCESS [0.027s]
[INFO] Maven IT Clean Plugin Stub ........................ SUCCESS [1.122s]
[INFO] Maven IT Compiler Plugin Stub ..................... SUCCESS [0.542s]
[INFO] Maven IT Deploy Plugin Stub ....................... SUCCESS [0.515s]
[INFO] Maven IT EAR Plugin Stub .......................... SUCCESS [0.684s]
[INFO] Maven IT EJB Plugin Stub .......................... SUCCESS [0.854s]
[INFO] Maven IT Install Plugin Stub ...................... SUCCESS [0.494s]
[INFO] Maven IT JAR Plugin Stub .......................... SUCCESS [0.749s]
[INFO] Maven IT Javadoc Plugin Stub ...................... SUCCESS [1.047s]
[INFO] Maven IT Plugin Plugin Stub ....................... SUCCESS [0.730s]
[INFO] Maven IT RAR Plugin Stub .......................... SUCCESS [0.675s]
[INFO] Maven IT Resources Plugin Stub .................... SUCCESS [0.585s]
[INFO] Maven IT Site Plugin Stub ......................... SUCCESS [0.862s]
[INFO] Maven IT Source Plugin Stub ....................... SUCCESS [0.705s]
[INFO] Maven IT Surefire Plugin Stub ..................... SUCCESS [0.670s]
[INFO] Maven IT WAR Plugin Stub .......................... SUCCESS [0.441s]
[INFO] Maven IT Plugin :: Dependency Collection .......... SUCCESS [1.816s]
[INFO] Maven IT Plugin :: Dependency Resolution .......... SUCCESS [1.323s]
[INFO] Maven IT Plugin :: Expression ..................... SUCCESS [2.540s]
[INFO] Maven IT Plugin :: Error Mojos .................... SUCCESS [1.487s]
[INFO] Maven IT Component ................................ SUCCESS [1.026s]
[INFO] Maven IT Plugin :: Extension Consumer ............. SUCCESS [0.608s]
[INFO] Maven IT Plugin :: Extension Provider ............. SUCCESS [0.807s]
[INFO] Maven IT Plugin :: Fork ........................... SUCCESS [0.900s]
[INFO] Maven IT Plugin :: Invalid Descriptor ............. SUCCESS [0.873s]
[INFO] Maven IT Plugin :: Log File ....................... SUCCESS [0.703s]
[INFO] Maven IT Plugin :: No Default Component ........... SUCCESS [0.633s]
[INFO] Maven IT Plugin :: No Project ..................... SUCCESS [0.991s]
[INFO] Maven IT Plugin :: Online ......................... SUCCESS [0.459s]
[INFO] Maven IT Plugin :: Optional Mojos ................. SUCCESS [2.310s]
[INFO] Maven IT Plugin :: Packaging ...................... SUCCESS [0.659s]
[INFO] Maven IT Plugin :: Parameter Implementation ....... SUCCESS [0.479s]
[INFO] Maven IT Plugin :: Plugin Dependency .............. SUCCESS [1.144s]
[INFO] Maven IT Plugin :: Project ........................ SUCCESS [1.050s]
[INFO] Maven IT Helper Library ........................... SUCCESS [3.399s]
[INFO] Maven IT Plugin :: Project Interpolation .......... SUCCESS [1.255s]
[INFO] Maven IT Plugin :: Setter ......................... SUCCESS [0.641s]
[INFO] Maven IT Plugin :: Singleton Component ............ SUCCESS [0.882s]
[INFO] Maven IT Plugin :: Site ........................... SUCCESS [0.893s]
[INFO] Maven IT Plugin :: Toolchain ...................... SUCCESS [2.247s]
[INFO] Maven IT Plugin :: Touch .......................... SUCCESS [0.954s]
[INFO] Maven IT Plugin :: Uses Properties Plugin ......... SUCCESS [0.482s]
[INFO] Maven IT Plugin :: Uses Wagon Plugin .............. SUCCESS [1.072s]
[INFO] Maven IT Plugin :: This plugin should contain the mojos needed by all tests.  SUCCESS
[0.436s]
[INFO] Maven IT Plugin :: Plexus Utils 1.1 ............... SUCCESS [0.777s]
[INFO] Maven IT Plugin :: Plexus Utils New ............... SUCCESS [0.833s]
[INFO] Maven IT Plugin :: Plexus Component API ........... SUCCESS [1.003s]
[INFO] Maven IT Plugin :: Log4J Client ................... SUCCESS [0.544s]
[INFO] maven-it-plugin-extension1 ........................ SUCCESS [0.599s]
[INFO] maven-it-plugin-extension2 ........................ SUCCESS [0.534s]
[INFO] Maven IT Toolchain ................................ SUCCESS [1.220s]
[INFO] Maven IT Wagon .................................... SUCCESS [1.658s]
[INFO] Maven IT Support Artifacts ........................ SUCCESS [0.603s]
[INFO] Maven IT Extension ................................ SUCCESS [0.425s]
[INFO] Maven ITs ......................................... FAILURE [29:48.019s]
[INFO] ------------------------------------------------------------------------
[INFO] BUILD FAILURE
[INFO] ------------------------------------------------------------------------
[INFO] Total time: 31:02.745s
[INFO] Finished at: Tue Aug 16 16:42:46 BST 2011
[INFO] Final Memory: 35M/670M
[INFO] ------------------------------------------------------------------------
[ERROR] Failed to execute goal org.apache.maven.plugins:maven-surefire-plugin:2.9:test (default-test)
on project core-it-suite: There are test failures.
[ERROR] 
[ERROR] Please refer to F:\hudson\hudson-slave\workspace\core-integration-testing-maven-3-windows\core-it\core-it-suite\target\surefire-reports
for the individual test results.
[ERROR] -> [Help 1]
[ERROR] 
[ERROR] To see the full stack trace of the errors, re-run Maven with the -e switch.
[ERROR] Re-run Maven using the -X switch to enable full debug logging.
[ERROR] 
[ERROR] For more information about the errors and possible solutions, please read the following
articles:
[ERROR] [Help 1] http://cwiki.apache.org/confluence/display/MAVEN/MojoFailureException
[ERROR] 
[ERROR] After correcting the problems, you can resume the build with the command
[ERROR]   mvn <goals> -rf :core-it-suite
Recording test results


Mime
View raw message