maven-notifications mailing list archives

Site index · List index
Message view « Date » · « Thread »
Top « Date » · « Thread »
From Apache Jenkins Server <jenk...@builds.apache.org>
Subject Build failed in Jenkins: maven-plugins #396
Date Mon, 15 Aug 2011 21:03:06 GMT
See <https://builds.apache.org/job/maven-plugins/396/changes>

Changes:

[hboutemy] added stagingSiteURL configuration

[hboutemy] [maven-release-plugin] prepare for next development iteration

[hboutemy] [maven-release-plugin] prepare release maven-plugins-22

[hboutemy] prepare maven-plugins version 22 release

[hboutemy] updated parent pom to actual release

[hboutemy] define an artifactId as near as possible from parent artifactId "maven-plugins"
to give a good Project Summary report

------------------------------------------
Started by an SCM change
Building remotely on ubuntu3
Updating http://svn.apache.org/repos/asf/maven/plugins/trunk
U         maven-plugins/src/site-docs/apt/index.apt
U         maven-plugins/pom.xml
U         maven-plugins/site-pom.xml
AU        maven-checkstyle-plugin/src/it/MCHECKSTYLE-131/module/src/main/java/example/module/package-info.java
U         maven-checkstyle-plugin/src/it/MCHECKSTYLE-131/checkstyle.xml
U         maven-site-plugin/src/site/apt/examples/sitedescriptor.apt
At revision 1158007
Found mavenVersion 3.0.3 from file jar:file:/home/jenkins/jenkins-slave/tools/Maven_3.0.3/lib/maven-core-3.0.3.jar!/META-INF/maven/org.apache.maven/maven-core/pom.properties
Parsing POMs
ERROR: Failed to parse POMs
hudson.util.IOException2: remote file operation failed: <https://builds.apache.org/job/maven-plugins/ws/>
at hudson.remoting.Channel@444562af:ubuntu3
	at hudson.FilePath.act(FilePath.java:754)
	at hudson.FilePath.act(FilePath.java:740)
	at hudson.maven.MavenModuleSetBuild$RunnerImpl.parsePoms(MavenModuleSetBuild.java:817)
	at hudson.maven.MavenModuleSetBuild$RunnerImpl.doRun(MavenModuleSetBuild.java:617)
	at hudson.model.AbstractBuild$AbstractRunner.run(AbstractBuild.java:429)
	at hudson.model.Run.run(Run.java:1374)
	at hudson.maven.MavenModuleSetBuild.run(MavenModuleSetBuild.java:467)
	at hudson.model.ResourceController.execute(ResourceController.java:88)
	at hudson.model.Executor.run(Executor.java:145)
Caused by: hudson.remoting.ProxyException: hudson.maven.MavenModuleSetBuild$MavenExecutionException:
org.apache.maven.project.ProjectBuildingException: Some problems were encountered while processing
the POMs:
[FATAL] Non-resolvable parent POM: Failure to find org.apache.maven:maven-parent:pom:21 in
http://repo1.maven.org/maven2 was cached in the local repository, resolution will not be reattempted
until the update interval of central has elapsed or updates are forced and 'parent.relativePath'
points at wrong local POM @ line 23, column 11

	at hudson.maven.MavenModuleSetBuild$PomParser.invoke(MavenModuleSetBuild.java:1327)
	at hudson.maven.MavenModuleSetBuild$PomParser.invoke(MavenModuleSetBuild.java:1110)
	at hudson.FilePath$FileCallableWrapper.call(FilePath.java:1979)
	at hudson.remoting.UserRequest.perform(UserRequest.java:118)
	at hudson.remoting.UserRequest.perform(UserRequest.java:48)
	at hudson.remoting.Request$2.run(Request.java:270)
	at java.util.concurrent.Executors$RunnableAdapter.call(Executors.java:441)
	at java.util.concurrent.FutureTask$Sync.innerRun(FutureTask.java:303)
	at java.util.concurrent.FutureTask.run(FutureTask.java:138)
	at java.util.concurrent.ThreadPoolExecutor$Worker.runTask(ThreadPoolExecutor.java:886)
	at java.util.concurrent.ThreadPoolExecutor$Worker.run(ThreadPoolExecutor.java:908)
	at java.lang.Thread.run(Thread.java:662)
Caused by: hudson.remoting.ProxyException: org.apache.maven.project.ProjectBuildingException:
Some problems were encountered while processing the POMs:
[FATAL] Non-resolvable parent POM: Failure to find org.apache.maven:maven-parent:pom:21 in
http://repo1.maven.org/maven2 was cached in the local repository, resolution will not be reattempted
until the update interval of central has elapsed or updates are forced and 'parent.relativePath'
points at wrong local POM @ line 23, column 11

	at org.apache.maven.project.DefaultProjectBuilder.build(DefaultProjectBuilder.java:339)
	at hudson.maven.MavenEmbedder.buildProjects(MavenEmbedder.java:360)
	at hudson.maven.MavenEmbedder.readProjects(MavenEmbedder.java:330)
	at hudson.maven.MavenModuleSetBuild$PomParser.invoke(MavenModuleSetBuild.java:1277)
	... 11 more


Mime
View raw message