maven-notifications mailing list archives

Site index · List index
Message view « Date » · « Thread »
Top « Date » · « Thread »
From Apache Jenkins Server <jenk...@builds.apache.org>
Subject Build failed in Jenkins: core-integration-testing-maven-3-trunk-windows #9
Date Mon, 01 Aug 2011 14:06:32 GMT
See <https://builds.apache.org/job/core-integration-testing-maven-3-trunk-windows/9/changes>

Changes:

[brett] only take the canonical file on the input path, so we resolve any symlinks (/private/tmp
on Mac OS X for /tmp, and similar for storage location of some CI installs), without invalidating
the test by modifying the paths either from the properties or from getRoot()

------------------------------------------
[...truncated 2590 lines...]
[INFO] --- maven-jar-plugin:2.3.1:jar (default-jar) @ maven-it-plugin-no-project ---
[INFO] Building jar: F:\hudson\hudson-slave\workspace\core-integration-testing-maven-3-trunk-windows\core-integration-testing-trunk\core-it-support\core-it-plugins\maven-it-plugin-no-project\target\maven-it-plugin-no-project-2.1-SNAPSHOT.jar
[INFO] 
[INFO] --- maven-plugin-plugin:2.8:addPluginArtifactMetadata (default-addPluginArtifactMetadata)
@ maven-it-plugin-no-project ---
[INFO] 
[INFO] --- maven-install-plugin:2.3.1:install (default-install) @ maven-it-plugin-no-project
---
[INFO] Installing F:\hudson\hudson-slave\workspace\core-integration-testing-maven-3-trunk-windows\core-integration-testing-trunk\core-it-support\core-it-plugins\maven-it-plugin-no-project\target\maven-it-plugin-no-project-2.1-SNAPSHOT.jar
to <https://builds.apache.org/job/core-integration-testing-maven-3-trunk-windows/ws/.repository\org\apache\maven\its\plugins\maven-it-plugin-no-project\2.1-SNAPSHOT\maven-it-plugin-no-project-2.1-SNAPSHOT.jar>
[INFO] Installing F:\hudson\hudson-slave\workspace\core-integration-testing-maven-3-trunk-windows\core-integration-testing-trunk\core-it-support\core-it-plugins\maven-it-plugin-no-project\pom.xml
to <https://builds.apache.org/job/core-integration-testing-maven-3-trunk-windows/ws/.repository\org\apache\maven\its\plugins\maven-it-plugin-no-project\2.1-SNAPSHOT\maven-it-plugin-no-project-2.1-SNAPSHOT.pom>
[INFO]                                                                         
[INFO] ------------------------------------------------------------------------
[INFO] Building Maven IT Plugin :: Online 2.1-SNAPSHOT
[INFO] ------------------------------------------------------------------------
[INFO] 
[INFO] --- maven-clean-plugin:2.4.1:clean (default-clean) @ maven-it-plugin-online ---
[INFO] Deleting F:\hudson\hudson-slave\workspace\core-integration-testing-maven-3-trunk-windows\core-integration-testing-trunk\core-it-support\core-it-plugins\maven-it-plugin-online\target
[INFO] 
[INFO] --- maven-plugin-plugin:2.8:descriptor (default-descriptor) @ maven-it-plugin-online
---
[INFO] Using 'UTF-8' encoding to read mojo metadata.
[INFO] Applying mojo extractor for language: java
[INFO] Mojo extractor for language: java found 1 mojo descriptors.
[INFO] Applying mojo extractor for language: bsh
[INFO] Mojo extractor for language: bsh found 0 mojo descriptors.
[INFO] 
[INFO] --- maven-remote-resources-plugin:1.2.1:process (default) @ maven-it-plugin-online
---
[INFO] 
[INFO] --- maven-resources-plugin:2.5:resources (default-resources) @ maven-it-plugin-online
---
[debug] execute contextualize
[INFO] Using 'UTF-8' encoding to copy filtered resources.
[INFO] skip non existing resourceDirectory F:\hudson\hudson-slave\workspace\core-integration-testing-maven-3-trunk-windows\core-integration-testing-trunk\core-it-support\core-it-plugins\maven-it-plugin-online\src\main\resources
[INFO] Copying 3 resources
[INFO] 
[INFO] --- maven-compiler-plugin:2.3.2:compile (default-compile) @ maven-it-plugin-online
---
[INFO] Compiling 1 source file to F:\hudson\hudson-slave\workspace\core-integration-testing-maven-3-trunk-windows\core-integration-testing-trunk\core-it-support\core-it-plugins\maven-it-plugin-online\target\classes
[INFO] 
[INFO] --- maven-resources-plugin:2.5:testResources (default-testResources) @ maven-it-plugin-online
---
[debug] execute contextualize
[INFO] Using 'UTF-8' encoding to copy filtered resources.
[INFO] skip non existing resourceDirectory F:\hudson\hudson-slave\workspace\core-integration-testing-maven-3-trunk-windows\core-integration-testing-trunk\core-it-support\core-it-plugins\maven-it-plugin-online\src\test\resources
[INFO] Copying 3 resources
[INFO] 
[INFO] --- maven-compiler-plugin:2.3.2:testCompile (default-testCompile) @ maven-it-plugin-online
---
[INFO] Not compiling test sources
[INFO] 
[INFO] --- maven-surefire-plugin:2.9:test (default-test) @ maven-it-plugin-online ---
[INFO] Tests are skipped.
[INFO] 
[INFO] --- maven-jar-plugin:2.3.1:jar (default-jar) @ maven-it-plugin-online ---
[INFO] Building jar: F:\hudson\hudson-slave\workspace\core-integration-testing-maven-3-trunk-windows\core-integration-testing-trunk\core-it-support\core-it-plugins\maven-it-plugin-online\target\maven-it-plugin-online-2.1-SNAPSHOT.jar
[INFO] 
[INFO] --- maven-plugin-plugin:2.8:addPluginArtifactMetadata (default-addPluginArtifactMetadata)
@ maven-it-plugin-online ---
[INFO] 
[INFO] --- maven-install-plugin:2.3.1:install (default-install) @ maven-it-plugin-online ---
[INFO] Installing F:\hudson\hudson-slave\workspace\core-integration-testing-maven-3-trunk-windows\core-integration-testing-trunk\core-it-support\core-it-plugins\maven-it-plugin-online\target\maven-it-plugin-online-2.1-SNAPSHOT.jar
to <https://builds.apache.org/job/core-integration-testing-maven-3-trunk-windows/ws/.repository\org\apache\maven\its\plugins\maven-it-plugin-online\2.1-SNAPSHOT\maven-it-plugin-online-2.1-SNAPSHOT.jar>
[INFO] Installing F:\hudson\hudson-slave\workspace\core-integration-testing-maven-3-trunk-windows\core-integration-testing-trunk\core-it-support\core-it-plugins\maven-it-plugin-online\pom.xml
to <https://builds.apache.org/job/core-integration-testing-maven-3-trunk-windows/ws/.repository\org\apache\maven\its\plugins\maven-it-plugin-online\2.1-SNAPSHOT\maven-it-plugin-online-2.1-SNAPSHOT.pom>
[INFO]                                                                         
[INFO] ------------------------------------------------------------------------
[INFO] Building Maven IT Plugin :: Optional Mojos 2.1-SNAPSHOT
[INFO] ------------------------------------------------------------------------
[INFO] 
[INFO] --- maven-clean-plugin:2.4.1:clean (default-clean) @ maven-it-plugin-optional-mojos
---
[INFO] Deleting F:\hudson\hudson-slave\workspace\core-integration-testing-maven-3-trunk-windows\core-integration-testing-trunk\core-it-support\core-it-plugins\maven-it-plugin-optional-mojos\target
[INFO] 
[INFO] --- maven-plugin-plugin:2.8:descriptor (default-descriptor) @ maven-it-plugin-optional-mojos
---
[INFO] Using 'UTF-8' encoding to read mojo metadata.
[INFO] Applying mojo extractor for language: java
[INFO] Mojo extractor for language: java found 1 mojo descriptors.
[INFO] Applying mojo extractor for language: bsh
[INFO] Mojo extractor for language: bsh found 0 mojo descriptors.
[INFO] 
[INFO] --- maven-remote-resources-plugin:1.2.1:process (default) @ maven-it-plugin-optional-mojos
---
[INFO] 
[INFO] --- maven-resources-plugin:2.5:resources (default-resources) @ maven-it-plugin-optional-mojos
---
[debug] execute contextualize
[INFO] Using 'UTF-8' encoding to copy filtered resources.
[INFO] Copying 1 resource
[INFO] Copying 3 resources
[INFO] 
[INFO] --- maven-compiler-plugin:2.3.2:compile (default-compile) @ maven-it-plugin-optional-mojos
---
[INFO] Compiling 1 source file to F:\hudson\hudson-slave\workspace\core-integration-testing-maven-3-trunk-windows\core-integration-testing-trunk\core-it-support\core-it-plugins\maven-it-plugin-optional-mojos\target\classes
[INFO] 
[INFO] --- maven-resources-plugin:2.5:testResources (default-testResources) @ maven-it-plugin-optional-mojos
---
[debug] execute contextualize
[INFO] Using 'UTF-8' encoding to copy filtered resources.
[INFO] skip non existing resourceDirectory F:\hudson\hudson-slave\workspace\core-integration-testing-maven-3-trunk-windows\core-integration-testing-trunk\core-it-support\core-it-plugins\maven-it-plugin-optional-mojos\src\test\resources
[INFO] Copying 3 resources
[INFO] 
[INFO] --- maven-compiler-plugin:2.3.2:testCompile (default-testCompile) @ maven-it-plugin-optional-mojos
---
[INFO] Not compiling test sources
[INFO] 
[INFO] --- maven-surefire-plugin:2.9:test (default-test) @ maven-it-plugin-optional-mojos
---
[INFO] Tests are skipped.
[INFO] 
[INFO] --- maven-jar-plugin:2.3.1:jar (default-jar) @ maven-it-plugin-optional-mojos ---
[INFO] Building jar: F:\hudson\hudson-slave\workspace\core-integration-testing-maven-3-trunk-windows\core-integration-testing-trunk\core-it-support\core-it-plugins\maven-it-plugin-optional-mojos\target\maven-it-plugin-optional-mojos-2.1-SNAPSHOT.jar
[INFO] 
[INFO] --- maven-plugin-plugin:2.8:addPluginArtifactMetadata (default-addPluginArtifactMetadata)
@ maven-it-plugin-optional-mojos ---
[INFO] 
[INFO] --- maven-install-plugin:2.3.1:install (default-install) @ maven-it-plugin-optional-mojos
---
[INFO] Installing F:\hudson\hudson-slave\workspace\core-integration-testing-maven-3-trunk-windows\core-integration-testing-trunk\core-it-support\core-it-plugins\maven-it-plugin-optional-mojos\target\maven-it-plugin-optional-mojos-2.1-SNAPSHOT.jar
to <https://builds.apache.org/job/core-integration-testing-maven-3-trunk-windows/ws/.repository\org\apache\maven\its\plugins\maven-it-plugin-optional-mojos\2.1-SNAPSHOT\maven-it-plugin-optional-mojos-2.1-SNAPSHOT.jar>
[INFO] Installing F:\hudson\hudson-slave\workspace\core-integration-testing-maven-3-trunk-windows\core-integration-testing-trunk\core-it-support\core-it-plugins\maven-it-plugin-optional-mojos\pom.xml
to <https://builds.apache.org/job/core-integration-testing-maven-3-trunk-windows/ws/.repository\org\apache\maven\its\plugins\maven-it-plugin-optional-mojos\2.1-SNAPSHOT\maven-it-plugin-optional-mojos-2.1-SNAPSHOT.pom>
[INFO]                                                                         
[INFO] ------------------------------------------------------------------------
[INFO] Building Maven IT Plugin :: Packaging 2.1-SNAPSHOT
[INFO] ------------------------------------------------------------------------
[INFO] 
[INFO] --- maven-clean-plugin:2.4.1:clean (default-clean) @ maven-it-plugin-packaging ---
[INFO] Deleting F:\hudson\hudson-slave\workspace\core-integration-testing-maven-3-trunk-windows\core-integration-testing-trunk\core-it-support\core-it-plugins\maven-it-plugin-packaging\target
[INFO] 
[INFO] --- maven-plugin-plugin:2.8:descriptor (default-descriptor) @ maven-it-plugin-packaging
---
[INFO] Using 'UTF-8' encoding to read mojo metadata.
[INFO] Applying mojo extractor for language: java
[INFO] Mojo extractor for language: java found 2 mojo descriptors.
[INFO] Applying mojo extractor for language: bsh
[INFO] Mojo extractor for language: bsh found 0 mojo descriptors.
[INFO] 
[INFO] --- maven-remote-resources-plugin:1.2.1:process (default) @ maven-it-plugin-packaging
---
[INFO] 
[INFO] --- maven-resources-plugin:2.5:resources (default-resources) @ maven-it-plugin-packaging
---
[debug] execute contextualize
[INFO] Using 'UTF-8' encoding to copy filtered resources.
[INFO] Copying 1 resource
[INFO] Copying 3 resources
[INFO] 
[INFO] --- maven-compiler-plugin:2.3.2:compile (default-compile) @ maven-it-plugin-packaging
---
[INFO] Compiling 2 source files to F:\hudson\hudson-slave\workspace\core-integration-testing-maven-3-trunk-windows\core-integration-testing-trunk\core-it-support\core-it-plugins\maven-it-plugin-packaging\target\classes
[INFO] 
[INFO] --- maven-resources-plugin:2.5:testResources (default-testResources) @ maven-it-plugin-packaging
---
[debug] execute contextualize
[INFO] Using 'UTF-8' encoding to copy filtered resources.
[INFO] skip non existing resourceDirectory F:\hudson\hudson-slave\workspace\core-integration-testing-maven-3-trunk-windows\core-integration-testing-trunk\core-it-support\core-it-plugins\maven-it-plugin-packaging\src\test\resources
[INFO] Copying 3 resources
[INFO] 
[INFO] --- maven-compiler-plugin:2.3.2:testCompile (default-testCompile) @ maven-it-plugin-packaging
---
[INFO] Not compiling test sources
[INFO] 
[INFO] --- maven-surefire-plugin:2.9:test (default-test) @ maven-it-plugin-packaging ---
[INFO] Tests are skipped.
[INFO] 
[INFO] --- maven-jar-plugin:2.3.1:jar (default-jar) @ maven-it-plugin-packaging ---
[INFO] Building jar: F:\hudson\hudson-slave\workspace\core-integration-testing-maven-3-trunk-windows\core-integration-testing-trunk\core-it-support\core-it-plugins\maven-it-plugin-packaging\target\maven-it-plugin-packaging-2.1-SNAPSHOT.jar
[INFO] 
[INFO] --- maven-plugin-plugin:2.8:addPluginArtifactMetadata (default-addPluginArtifactMetadata)
@ maven-it-plugin-packaging ---
[INFO] 
[INFO] --- maven-install-plugin:2.3.1:install (default-install) @ maven-it-plugin-packaging
---
[INFO] Installing F:\hudson\hudson-slave\workspace\core-integration-testing-maven-3-trunk-windows\core-integration-testing-trunk\core-it-support\core-it-plugins\maven-it-plugin-packaging\target\maven-it-plugin-packaging-2.1-SNAPSHOT.jar
to <https://builds.apache.org/job/core-integration-testing-maven-3-trunk-windows/ws/.repository\org\apache\maven\its\plugins\maven-it-plugin-packaging\2.1-SNAPSHOT\maven-it-plugin-packaging-2.1-SNAPSHOT.jar>
[INFO] Installing F:\hudson\hudson-slave\workspace\core-integration-testing-maven-3-trunk-windows\core-integration-testing-trunk\core-it-support\core-it-plugins\maven-it-plugin-packaging\pom.xml
to <https://builds.apache.org/job/core-integration-testing-maven-3-trunk-windows/ws/.repository\org\apache\maven\its\plugins\maven-it-plugin-packaging\2.1-SNAPSHOT\maven-it-plugin-packaging-2.1-SNAPSHOT.pom>
[INFO]                                                                         
[INFO] ------------------------------------------------------------------------
[INFO] Building Maven IT Plugin :: Parameter Implementation 2.1-SNAPSHOT
[INFO] ------------------------------------------------------------------------
[INFO] 
[INFO] --- maven-clean-plugin:2.4.1:clean (default-clean) @ maven-it-plugin-parameter-implementation
---
[INFO] Deleting F:\hudson\hudson-slave\workspace\core-integration-testing-maven-3-trunk-windows\core-integration-testing-trunk\core-it-support\core-it-plugins\maven-it-plugin-parameter-implementation\target
[INFO] 
[INFO] --- maven-plugin-plugin:2.8:descriptor (default-descriptor) @ maven-it-plugin-parameter-implementation
---
[INFO] Using 'UTF-8' encoding to read mojo metadata.
[INFO] Applying mojo extractor for language: java
[INFO] Mojo extractor for language: java found 0 mojo descriptors.
[INFO] Applying mojo extractor for language: bsh
[INFO] Mojo extractor for language: bsh found 0 mojo descriptors.
[INFO] ------------------------------------------------------------------------
[INFO] Reactor Summary:
[INFO] 
[INFO] Maven Core ITs .................................... SUCCESS [2.090s]
[INFO] Maven IT Support .................................. SUCCESS [0.036s]
[INFO] Maven IT :: Plugins ............................... SUCCESS [0.052s]
[INFO] Maven IT Plugin :: Active Collection .............. SUCCESS [2.557s]
[INFO] Maven IT Plugin :: Ant-Based ...................... SUCCESS [0.998s]
[INFO] Maven IT Plugin :: Artifact ....................... SUCCESS [1.151s]
[INFO] Maven IT Plugin :: Class Loader :: Dependency A ... SUCCESS [0.414s]
[INFO] Maven IT Plugin :: Class Loader :: Dependency B ... SUCCESS [0.455s]
[INFO] Maven IT Plugin :: Class Loader :: Dependency C ... SUCCESS [0.196s]
[INFO] Maven IT Plugin :: Class Loader ................... SUCCESS [1.527s]
[INFO] Maven IT Plugin :: Class Loader :: Aggregator ..... SUCCESS [0.023s]
[INFO] Maven IT Plugin :: Configuration .................. SUCCESS [0.946s]
[INFO] Maven IT Plugin :: Context Passing ................ SUCCESS [0.367s]
[INFO] Maven ITs :: Core Plugin Stubs .................... SUCCESS [0.028s]
[INFO] Maven IT Clean Plugin Stub ........................ SUCCESS [0.418s]
[INFO] Maven IT Compiler Plugin Stub ..................... SUCCESS [0.430s]
[INFO] Maven IT Deploy Plugin Stub ....................... SUCCESS [0.476s]
[INFO] Maven IT EAR Plugin Stub .......................... SUCCESS [0.425s]
[INFO] Maven IT EJB Plugin Stub .......................... SUCCESS [0.539s]
[INFO] Maven IT Install Plugin Stub ...................... SUCCESS [0.458s]
[INFO] Maven IT JAR Plugin Stub .......................... SUCCESS [0.490s]
[INFO] Maven IT Javadoc Plugin Stub ...................... SUCCESS [0.437s]
[INFO] Maven IT Plugin Plugin Stub ....................... SUCCESS [0.503s]
[INFO] Maven IT RAR Plugin Stub .......................... SUCCESS [0.454s]
[INFO] Maven IT Resources Plugin Stub .................... SUCCESS [0.480s]
[INFO] Maven IT Site Plugin Stub ......................... SUCCESS [0.483s]
[INFO] Maven IT Source Plugin Stub ....................... SUCCESS [0.408s]
[INFO] Maven IT Surefire Plugin Stub ..................... SUCCESS [0.478s]
[INFO] Maven IT WAR Plugin Stub .......................... SUCCESS [0.409s]
[INFO] Maven IT Plugin :: Dependency Collection .......... SUCCESS [0.914s]
[INFO] Maven IT Plugin :: Dependency Resolution .......... SUCCESS [0.629s]
[INFO] Maven IT Plugin :: Expression ..................... SUCCESS [1.106s]
[INFO] Maven IT Plugin :: Error Mojos .................... SUCCESS [0.781s]
[INFO] Maven IT Component ................................ SUCCESS [0.562s]
[INFO] Maven IT Plugin :: Extension Consumer ............. SUCCESS [0.419s]
[INFO] Maven IT Plugin :: Extension Provider ............. SUCCESS [0.377s]
[INFO] Maven IT Plugin :: Fork ........................... SUCCESS [0.530s]
[INFO] Maven IT Plugin :: Invalid Descriptor ............. SUCCESS [0.543s]
[INFO] Maven IT Plugin :: Log File ....................... SUCCESS [0.424s]
[INFO] Maven IT Plugin :: No Default Component ........... SUCCESS [0.419s]
[INFO] Maven IT Plugin :: No Project ..................... SUCCESS [0.704s]
[INFO] Maven IT Plugin :: Online ......................... SUCCESS [0.382s]
[INFO] Maven IT Plugin :: Optional Mojos ................. SUCCESS [0.358s]
[INFO] Maven IT Plugin :: Packaging ...................... SUCCESS [0.433s]
[INFO] Maven IT Plugin :: Parameter Implementation ....... FAILURE [0.021s]
[INFO] Maven IT Plugin :: Plugin Dependency .............. SKIPPED
[INFO] Maven IT Plugin :: Project ........................ SKIPPED
[INFO] Maven IT Helper Library ........................... SKIPPED
[INFO] Maven IT Plugin :: Project Interpolation .......... SKIPPED
[INFO] Maven IT Plugin :: Setter ......................... SKIPPED
[INFO] Maven IT Plugin :: Singleton Component ............ SKIPPED
[INFO] Maven IT Plugin :: Site ........................... SKIPPED
[INFO] Maven IT Plugin :: Toolchain ...................... SKIPPED
[INFO] Maven IT Plugin :: Touch .......................... SKIPPED
[INFO] Maven IT Plugin :: Uses Properties Plugin ......... SKIPPED
[INFO] Maven IT Plugin :: Uses Wagon Plugin .............. SKIPPED
[INFO] Maven IT Plugin :: This plugin should contain the mojos needed by all tests.  SKIPPED
[INFO] Maven IT Plugin :: Plexus Utils 1.1 ............... SKIPPED
[INFO] Maven IT Plugin :: Plexus Utils New ............... SKIPPED
[INFO] Maven IT Plugin :: Plexus Component API ........... SKIPPED
[INFO] Maven IT Plugin :: Log4J Client ................... SKIPPED
[INFO] maven-it-plugin-extension1 ........................ SKIPPED
[INFO] maven-it-plugin-extension2 ........................ SKIPPED
[INFO] Maven IT Toolchain ................................ SKIPPED
[INFO] Maven IT Wagon .................................... SKIPPED
[INFO] Maven IT Support Artifacts ........................ SKIPPED
[INFO] Maven IT Extension ................................ SKIPPED
[INFO] Maven ITs ......................................... SKIPPED
[INFO] ------------------------------------------------------------------------
[INFO] BUILD FAILURE
[INFO] ------------------------------------------------------------------------
[INFO] Total time: 28.196s
[INFO] Finished at: Mon Aug 01 15:06:29 BST 2011
[INFO] Final Memory: 31M/718M
[INFO] ------------------------------------------------------------------------
[ERROR] Failed to execute goal org.apache.maven.plugins:maven-plugin-plugin:2.8:descriptor
(default-descriptor) on project maven-it-plugin-parameter-implementation: Error extracting
plugin descriptor: 'No mojo definitions were found for plugin: org.apache.maven.its.plugins:maven-it-plugin-parameter-implementation.'
-> [Help 1]
[ERROR] 
[ERROR] To see the full stack trace of the errors, re-run Maven with the -e switch.
[ERROR] Re-run Maven using the -X switch to enable full debug logging.
[ERROR] 
[ERROR] For more information about the errors and possible solutions, please read the following
articles:
[ERROR] [Help 1] http://cwiki.apache.org/confluence/display/MAVEN/MojoExecutionException
[ERROR] 
[ERROR] After correcting the problems, you can resume the build with the command
[ERROR]   mvn <goals> -rf :maven-it-plugin-parameter-implementation
Recording test results


Mime
View raw message