maven-notifications mailing list archives

Site index · List index
Message view « Date » · « Thread »
Top « Date » · « Thread »
From Apache Jenkins Server <jenk...@builds.apache.org>
Subject Build failed in Jenkins: core-integration-testing-maven-3-trunk-windows #11
Date Mon, 01 Aug 2011 16:33:40 GMT
See <https://builds.apache.org/job/core-integration-testing-maven-3-trunk-windows/11/>

------------------------------------------
[...truncated 15858 lines...]
[INFO] --- maven-compiler-plugin:2.3.2:compile (default-compile) @ core-it-extension ---
[INFO] No sources to compile
[INFO] 
[INFO] --- maven-resources-plugin:2.5:testResources (default-testResources) @ core-it-extension
---
[debug] execute contextualize
[INFO] Using 'UTF-8' encoding to copy filtered resources.
[INFO] skip non existing resourceDirectory F:\hudson\hudson-slave\workspace\core-integration-testing-maven-3-trunk-windows\core-integration-testing-trunk\core-it-support\core-it-extension\src\test\resources
[INFO] Copying 3 resources
[INFO] 
[INFO] --- maven-compiler-plugin:2.3.2:testCompile (default-testCompile) @ core-it-extension
---
[INFO] No sources to compile
[INFO] 
[INFO] --- maven-surefire-plugin:2.9:test (default-test) @ core-it-extension ---
[INFO] Surefire report directory: F:\hudson\hudson-slave\workspace\core-integration-testing-maven-3-trunk-windows\core-integration-testing-trunk\core-it-support\core-it-extension\target\surefire-reports

-------------------------------------------------------
 T E S T S
-------------------------------------------------------

Results :

Tests run: 0, Failures: 0, Errors: 0, Skipped: 0

[INFO] 
[INFO] --- maven-jar-plugin:2.3.1:jar (default-jar) @ core-it-extension ---
[INFO] Building jar: F:\hudson\hudson-slave\workspace\core-integration-testing-maven-3-trunk-windows\core-integration-testing-trunk\core-it-support\core-it-extension\target\core-it-extension-2.1-SNAPSHOT.jar
[INFO] 
[INFO] --- maven-install-plugin:2.3.1:install (default-install) @ core-it-extension ---
[INFO] Installing F:\hudson\hudson-slave\workspace\core-integration-testing-maven-3-trunk-windows\core-integration-testing-trunk\core-it-support\core-it-extension\target\core-it-extension-2.1-SNAPSHOT.jar
to <https://builds.apache.org/job/core-integration-testing-maven-3-trunk-windows/ws/.repository\org\apache\maven\its\core-it-extension\2.1-SNAPSHOT\core-it-extension-2.1-SNAPSHOT.jar>
[INFO] Installing F:\hudson\hudson-slave\workspace\core-integration-testing-maven-3-trunk-windows\core-integration-testing-trunk\core-it-support\core-it-extension\pom.xml
to <https://builds.apache.org/job/core-integration-testing-maven-3-trunk-windows/ws/.repository\org\apache\maven\its\core-it-extension\2.1-SNAPSHOT\core-it-extension-2.1-SNAPSHOT.pom>
[INFO]                                                                         
[INFO] ------------------------------------------------------------------------
[INFO] Building Maven ITs 2.1-SNAPSHOT
[INFO] ------------------------------------------------------------------------
Downloading: http://repo1.maven.org/maven2/junit/junit/4.8.2/junit-4.8.2.pom
Downloaded: http://repo1.maven.org/maven2/junit/junit/4.8.2/junit-4.8.2.pom (2 KB at 4.7 KB/sec)
Downloading: http://repo1.maven.org/maven2/org/apache/maven/shared/maven-verifier/1.3/maven-verifier-1.3.pom
Downloaded: http://repo1.maven.org/maven2/org/apache/maven/shared/maven-verifier/1.3/maven-verifier-1.3.pom
(3 KB at 4.1 KB/sec)
Downloading: http://repo1.maven.org/maven2/org/mortbay/jetty/jetty/6.1.14/jetty-6.1.14.pom
Downloaded: http://repo1.maven.org/maven2/org/mortbay/jetty/jetty/6.1.14/jetty-6.1.14.pom
(5 KB at 10.2 KB/sec)
Downloading: http://repo1.maven.org/maven2/org/mortbay/jetty/project/6.1.14/project-6.1.14.pom
Downloaded: http://repo1.maven.org/maven2/org/mortbay/jetty/project/6.1.14/project-6.1.14.pom
(9 KB at 17.3 KB/sec)
Downloading: http://repo1.maven.org/maven2/org/mortbay/jetty/jetty-parent/7/jetty-parent-7.pom
Downloaded: http://repo1.maven.org/maven2/org/mortbay/jetty/jetty-parent/7/jetty-parent-7.pom
(13 KB at 27.2 KB/sec)
Downloading: http://repo1.maven.org/maven2/org/mortbay/jetty/jetty-util/6.1.14/jetty-util-6.1.14.pom
Downloaded: http://repo1.maven.org/maven2/org/mortbay/jetty/jetty-util/6.1.14/jetty-util-6.1.14.pom
(4 KB at 6.6 KB/sec)
Downloading: http://repo1.maven.org/maven2/org/mortbay/jetty/servlet-api-2.5/6.1.14/servlet-api-2.5-6.1.14.pom
Downloaded: http://repo1.maven.org/maven2/org/mortbay/jetty/servlet-api-2.5/6.1.14/servlet-api-2.5-6.1.14.pom
(4 KB at 7.2 KB/sec)
Downloading: http://repo1.maven.org/maven2/junit/junit/4.8.2/junit-4.8.2.jar
Downloading: http://repo1.maven.org/maven2/org/codehaus/plexus/plexus-utils/1.5.8/plexus-utils-1.5.8.jar
Downloading: http://repo1.maven.org/maven2/org/mortbay/jetty/jetty/6.1.14/jetty-6.1.14.jar
Downloading: http://repo1.maven.org/maven2/org/apache/maven/shared/maven-verifier/1.3/maven-verifier-1.3.jar
Downloading: http://repo1.maven.org/maven2/org/mortbay/jetty/jetty-util/6.1.14/jetty-util-6.1.14.jar
Downloaded: http://repo1.maven.org/maven2/junit/junit/4.8.2/junit-4.8.2.jar (232 KB at 155.9
KB/sec)
Downloading: http://repo1.maven.org/maven2/org/mortbay/jetty/servlet-api-2.5/6.1.14/servlet-api-2.5-6.1.14.jar
Downloaded: http://repo1.maven.org/maven2/org/codehaus/plexus/plexus-utils/1.5.8/plexus-utils-1.5.8.jar
(262 KB at 150.6 KB/sec)
Downloaded: http://repo1.maven.org/maven2/org/mortbay/jetty/jetty/6.1.14/jetty-6.1.14.jar
(505 KB at 253.6 KB/sec)
Downloaded: http://repo1.maven.org/maven2/org/mortbay/jetty/jetty-util/6.1.14/jetty-util-6.1.14.jar
(160 KB at 64.1 KB/sec)
Downloaded: http://repo1.maven.org/maven2/org/apache/maven/shared/maven-verifier/1.3/maven-verifier-1.3.jar
(88 KB at 32.0 KB/sec)
Downloaded: http://repo1.maven.org/maven2/org/mortbay/jetty/servlet-api-2.5/6.1.14/servlet-api-2.5-6.1.14.jar
(130 KB at 86.2 KB/sec)
[INFO] 
[INFO] --- maven-clean-plugin:2.4.1:clean (default-clean) @ core-it-suite ---
[INFO] 
[INFO] --- maven-remote-resources-plugin:1.2.1:process (default) @ core-it-suite ---
[INFO] 
[INFO] --- maven-resources-plugin:2.5:resources (default-resources) @ core-it-suite ---
[debug] execute contextualize
[INFO] Using 'UTF-8' encoding to copy filtered resources.
[INFO] skip non existing resourceDirectory F:\hudson\hudson-slave\workspace\core-integration-testing-maven-3-trunk-windows\core-integration-testing-trunk\core-it-suite\src\main\resources
[INFO] Copying 3 resources
[INFO] 
[INFO] --- maven-compiler-plugin:2.3.2:compile (default-compile) @ core-it-suite ---
[INFO] No sources to compile
[INFO] 
[INFO] --- maven-resources-plugin:2.5:testResources (default-testResources) @ core-it-suite
---
[debug] execute contextualize
[INFO] Using 'UTF-8' encoding to copy filtered resources.
[INFO] Copying 2653 resources
[INFO] Copying 2 resources
[INFO] Copying 3 resources
[INFO] 
[INFO] --- maven-compiler-plugin:2.3.2:testCompile (default-testCompile) @ core-it-suite ---
[INFO] Compiling 551 source files to F:\hudson\hudson-slave\workspace\core-integration-testing-maven-3-trunk-windows\core-integration-testing-trunk\core-it-suite\target\test-classes
[INFO] 
[INFO] --- maven-surefire-plugin:2.9:test (default-test) @ core-it-suite ---
[WARNING] useSystemClassloader setting has no effect when not forking
[INFO] Surefire report directory: F:\hudson\hudson-slave\workspace\core-integration-testing-maven-3-trunk-windows\core-integration-testing-trunk\core-it-suite\target\surefire-reports
Downloading: http://repo1.maven.org/maven2/org/apache/maven/surefire/surefire-junit4/2.9/surefire-junit4-2.9.pom
Downloaded: http://repo1.maven.org/maven2/org/apache/maven/surefire/surefire-junit4/2.9/surefire-junit4-2.9.pom
(3 KB at 7.2 KB/sec)
Downloading: http://repo1.maven.org/maven2/org/apache/maven/surefire/surefire-junit4/2.9/surefire-junit4-2.9.jar
Downloaded: http://repo1.maven.org/maven2/org/apache/maven/surefire/surefire-junit4/2.9/surefire-junit4-2.9.jar
(33 KB at 69.3 KB/sec)

-------------------------------------------------------
 T E S T S
-------------------------------------------------------
Running org.apache.maven.it.IntegrationTestSuite
Tests run: 1, Failures: 0, Errors: 1, Skipped: 0, Time elapsed: 0.211 sec <<< FAILURE!
initializationError(org.apache.maven.it.IntegrationTestSuite)  Time elapsed: 0.001 sec  <<<
ERROR!
org.apache.maven.it.VerificationException: Illegal maven output: String 'Maven version: '
not found in the following output:
The system cannot find the path specified.
	at org.apache.maven.it.Verifier.getMavenVersion(Verifier.java:1457)
	at org.apache.maven.it.IntegrationTestSuite.suite(IntegrationTestSuite.java:40)
	at sun.reflect.NativeMethodAccessorImpl.invoke0(Native Method)
	at sun.reflect.NativeMethodAccessorImpl.invoke(NativeMethodAccessorImpl.java:39)
	at sun.reflect.DelegatingMethodAccessorImpl.invoke(DelegatingMethodAccessorImpl.java:25)
	at java.lang.reflect.Method.invoke(Method.java:592)
	at org.junit.internal.runners.SuiteMethod.testFromSuiteMethod(SuiteMethod.java:34)
	at org.junit.internal.runners.SuiteMethod.<init>(SuiteMethod.java:23)
	at org.junit.internal.builders.SuiteMethodBuilder.runnerForClass(SuiteMethodBuilder.java:14)
	at org.junit.runners.model.RunnerBuilder.safeRunnerForClass(RunnerBuilder.java:57)
	at org.junit.internal.builders.AllDefaultPossibilitiesBuilder.runnerForClass(AllDefaultPossibilitiesBuilder.java:29)
	at org.junit.runners.model.RunnerBuilder.safeRunnerForClass(RunnerBuilder.java:57)
	at org.junit.internal.requests.ClassRequest.getRunner(ClassRequest.java:24)
	at org.apache.maven.surefire.junit4.JUnit4TestSet.execute(JUnit4TestSet.java:51)
	at org.apache.maven.surefire.junit4.JUnit4Provider.executeTestSet(JUnit4Provider.java:123)
	at org.apache.maven.surefire.junit4.JUnit4Provider.invoke(JUnit4Provider.java:104)
	at sun.reflect.NativeMethodAccessorImpl.invoke0(Native Method)
	at sun.reflect.NativeMethodAccessorImpl.invoke(NativeMethodAccessorImpl.java:39)
	at sun.reflect.DelegatingMethodAccessorImpl.invoke(DelegatingMethodAccessorImpl.java:25)
	at java.lang.reflect.Method.invoke(Method.java:592)
	at org.apache.maven.surefire.util.ReflectionUtils.invokeMethodWithArray(ReflectionUtils.java:164)
	at org.apache.maven.surefire.booter.ProviderFactory$ProviderProxy.invoke(ProviderFactory.java:110)
	at org.apache.maven.surefire.booter.SurefireStarter.invokeProvider(SurefireStarter.java:172)
	at org.apache.maven.surefire.booter.SurefireStarter.runSuitesInProcess(SurefireStarter.java:120)
	at org.apache.maven.plugin.surefire.AbstractSurefireMojo.executeProvider(AbstractSurefireMojo.java:194)
	at org.apache.maven.plugin.surefire.AbstractSurefireMojo.executeAllProviders(AbstractSurefireMojo.java:176)
	at org.apache.maven.plugin.surefire.AbstractSurefireMojo.executeAfterPreconditionsChecked(AbstractSurefireMojo.java:134)
	at org.apache.maven.plugin.surefire.AbstractSurefireMojo.execute(AbstractSurefireMojo.java:97)
	at org.apache.maven.plugin.DefaultBuildPluginManager.executeMojo(DefaultBuildPluginManager.java:101)
	at org.apache.maven.lifecycle.internal.MojoExecutor.execute(MojoExecutor.java:209)
	at org.apache.maven.lifecycle.internal.MojoExecutor.execute(MojoExecutor.java:153)
	at org.apache.maven.lifecycle.internal.MojoExecutor.execute(MojoExecutor.java:145)
	at org.apache.maven.lifecycle.internal.LifecycleModuleBuilder.buildProject(LifecycleModuleBuilder.java:84)
	at org.apache.maven.lifecycle.internal.LifecycleModuleBuilder.buildProject(LifecycleModuleBuilder.java:59)
	at org.apache.maven.lifecycle.internal.LifecycleStarter.singleThreadedBuild(LifecycleStarter.java:183)
	at org.apache.maven.lifecycle.internal.LifecycleStarter.execute(LifecycleStarter.java:161)
	at org.apache.maven.DefaultMaven.doExecute(DefaultMaven.java:319)
	at org.apache.maven.DefaultMaven.execute(DefaultMaven.java:156)
	at org.apache.maven.cli.MavenCli.execute(MavenCli.java:537)
	at org.apache.maven.cli.MavenCli.doMain(MavenCli.java:196)
	at org.apache.maven.cli.MavenCli.main(MavenCli.java:141)
	at sun.reflect.NativeMethodAccessorImpl.invoke0(Native Method)
	at sun.reflect.NativeMethodAccessorImpl.invoke(NativeMethodAccessorImpl.java:39)
	at sun.reflect.DelegatingMethodAccessorImpl.invoke(DelegatingMethodAccessorImpl.java:25)
	at java.lang.reflect.Method.invoke(Method.java:592)
	at org.codehaus.plexus.classworlds.launcher.Launcher.launchEnhanced(Launcher.java:290)
	at org.codehaus.plexus.classworlds.launcher.Launcher.launch(Launcher.java:230)
	at org.codehaus.plexus.classworlds.launcher.Launcher.mainWithExitCode(Launcher.java:409)
	at org.codehaus.plexus.classworlds.launcher.Launcher.main(Launcher.java:352)

Results :

Tests in error: 
  initializationError(org.apache.maven.it.IntegrationTestSuite): Illegal maven output: String
'Maven version: ' not found in the following output:

Tests run: 1, Failures: 0, Errors: 1, Skipped: 0

[INFO] ------------------------------------------------------------------------
[INFO] Reactor Summary:
[INFO] 
[INFO] Maven Core ITs .................................... SUCCESS [1:10.126s]
[INFO] Maven IT Support .................................. SUCCESS [0.030s]
[INFO] Maven IT :: Plugins ............................... SUCCESS [0.036s]
[INFO] Maven IT Plugin :: Active Collection .............. SUCCESS [1:15.918s]
[INFO] Maven IT Plugin :: Ant-Based ...................... SUCCESS [36.747s]
[INFO] Maven IT Plugin :: Artifact ....................... SUCCESS [4.817s]
[INFO] Maven IT Plugin :: Class Loader :: Dependency A ... SUCCESS [0.373s]
[INFO] Maven IT Plugin :: Class Loader :: Dependency B ... SUCCESS [0.548s]
[INFO] Maven IT Plugin :: Class Loader :: Dependency C ... SUCCESS [0.130s]
[INFO] Maven IT Plugin :: Class Loader ................... SUCCESS [3.691s]
[INFO] Maven IT Plugin :: Class Loader :: Aggregator ..... SUCCESS [0.022s]
[INFO] Maven IT Plugin :: Configuration .................. SUCCESS [1.479s]
[INFO] Maven IT Plugin :: Context Passing ................ SUCCESS [0.435s]
[INFO] Maven ITs :: Core Plugin Stubs .................... SUCCESS [0.029s]
[INFO] Maven IT Clean Plugin Stub ........................ SUCCESS [0.483s]
[INFO] Maven IT Compiler Plugin Stub ..................... SUCCESS [0.615s]
[INFO] Maven IT Deploy Plugin Stub ....................... SUCCESS [0.468s]
[INFO] Maven IT EAR Plugin Stub .......................... SUCCESS [0.562s]
[INFO] Maven IT EJB Plugin Stub .......................... SUCCESS [0.522s]
[INFO] Maven IT Install Plugin Stub ...................... SUCCESS [0.520s]
[INFO] Maven IT JAR Plugin Stub .......................... SUCCESS [0.508s]
[INFO] Maven IT Javadoc Plugin Stub ...................... SUCCESS [0.436s]
[INFO] Maven IT Plugin Plugin Stub ....................... SUCCESS [0.533s]
[INFO] Maven IT RAR Plugin Stub .......................... SUCCESS [0.443s]
[INFO] Maven IT Resources Plugin Stub .................... SUCCESS [0.507s]
[INFO] Maven IT Site Plugin Stub ......................... SUCCESS [0.562s]
[INFO] Maven IT Source Plugin Stub ....................... SUCCESS [0.487s]
[INFO] Maven IT Surefire Plugin Stub ..................... SUCCESS [0.505s]
[INFO] Maven IT WAR Plugin Stub .......................... SUCCESS [0.465s]
[INFO] Maven IT Plugin :: Dependency Collection .......... SUCCESS [7.858s]
[INFO] Maven IT Plugin :: Dependency Resolution .......... SUCCESS [0.737s]
[INFO] Maven IT Plugin :: Expression ..................... SUCCESS [1.148s]
[INFO] Maven IT Plugin :: Error Mojos .................... SUCCESS [14.185s]
[INFO] Maven IT Component ................................ SUCCESS [0.525s]
[INFO] Maven IT Plugin :: Extension Consumer ............. SUCCESS [0.478s]
[INFO] Maven IT Plugin :: Extension Provider ............. SUCCESS [0.468s]
[INFO] Maven IT Plugin :: Fork ........................... SUCCESS [0.561s]
[INFO] Maven IT Plugin :: Invalid Descriptor ............. SUCCESS [0.582s]
[INFO] Maven IT Plugin :: Log File ....................... SUCCESS [0.484s]
[INFO] Maven IT Plugin :: No Default Component ........... SUCCESS [0.458s]
[INFO] Maven IT Plugin :: No Project ..................... SUCCESS [0.755s]
[INFO] Maven IT Plugin :: Online ......................... SUCCESS [0.355s]
[INFO] Maven IT Plugin :: Optional Mojos ................. SUCCESS [2.250s]
[INFO] Maven IT Plugin :: Packaging ...................... SUCCESS [0.481s]
[INFO] Maven IT Plugin :: Parameter Implementation ....... SUCCESS [0.435s]
[INFO] Maven IT Plugin :: Plugin Dependency .............. SUCCESS [0.571s]
[INFO] Maven IT Plugin :: Project ........................ SUCCESS [0.460s]
[INFO] Maven IT Helper Library ........................... SUCCESS [3.632s]
[INFO] Maven IT Plugin :: Project Interpolation .......... SUCCESS [0.959s]
[INFO] Maven IT Plugin :: Setter ......................... SUCCESS [0.360s]
[INFO] Maven IT Plugin :: Singleton Component ............ SUCCESS [0.458s]
[INFO] Maven IT Plugin :: Site ........................... SUCCESS [2.362s]
[INFO] Maven IT Plugin :: Toolchain ...................... SUCCESS [36.070s]
[INFO] Maven IT Plugin :: Touch .......................... SUCCESS [2.559s]
[INFO] Maven IT Plugin :: Uses Properties Plugin ......... SUCCESS [0.357s]
[INFO] Maven IT Plugin :: Uses Wagon Plugin .............. SUCCESS [2.736s]
[INFO] Maven IT Plugin :: This plugin should contain the mojos needed by all tests.  SUCCESS
[0.368s]
[INFO] Maven IT Plugin :: Plexus Utils 1.1 ............... SUCCESS [0.618s]
[INFO] Maven IT Plugin :: Plexus Utils New ............... SUCCESS [0.635s]
[INFO] Maven IT Plugin :: Plexus Component API ........... SUCCESS [6.493s]
[INFO] Maven IT Plugin :: Log4J Client ................... SUCCESS [1.667s]
[INFO] maven-it-plugin-extension1 ........................ SUCCESS [2.679s]
[INFO] maven-it-plugin-extension2 ........................ SUCCESS [0.368s]
[INFO] Maven IT Toolchain ................................ SUCCESS [1.180s]
[INFO] Maven IT Wagon .................................... SUCCESS [10.186s]
[INFO] Maven IT Support Artifacts ........................ SUCCESS [10.852s]
[INFO] Maven IT Extension ................................ SUCCESS [0.268s]
[INFO] Maven ITs ......................................... FAILURE [1:36.424s]
[INFO] ------------------------------------------------------------------------
[INFO] BUILD FAILURE
[INFO] ------------------------------------------------------------------------
[INFO] Total time: 6:58.369s
[INFO] Finished at: Mon Aug 01 17:33:34 BST 2011
[INFO] Final Memory: 47M/711M
[INFO] ------------------------------------------------------------------------
[ERROR] Failed to execute goal org.apache.maven.plugins:maven-surefire-plugin:2.9:test (default-test)
on project core-it-suite: There are test failures.
[ERROR] 
[ERROR] Please refer to F:\hudson\hudson-slave\workspace\core-integration-testing-maven-3-trunk-windows\core-integration-testing-trunk\core-it-suite\target\surefire-reports
for the individual test results.
[ERROR] -> [Help 1]
[ERROR] 
[ERROR] To see the full stack trace of the errors, re-run Maven with the -e switch.
[ERROR] Re-run Maven using the -X switch to enable full debug logging.
[ERROR] 
[ERROR] For more information about the errors and possible solutions, please read the following
articles:
[ERROR] [Help 1] http://cwiki.apache.org/confluence/display/MAVEN/MojoFailureException
[ERROR] 
[ERROR] After correcting the problems, you can resume the build with the command
[ERROR]   mvn <goals> -rf :core-it-suite
Recording test results


Mime
View raw message