maven-notifications mailing list archives

Site index · List index
Message view « Date » · « Thread »
Top « Date » · « Thread »
From Apache Jenkins Server <jenk...@builds.apache.org>
Subject Build failed in Jenkins: maven-plugins #363
Date Mon, 01 Aug 2011 10:20:14 GMT
See <https://builds.apache.org/job/maven-plugins/363/changes>

Changes:

[olamy] [MCHECKSTYLE-162] Upgrade to checkstyle 5.4

[olamy] upgrade parent version remove m2e profile

------------------------------------------
[...truncated 5588 lines...]
Running org.apache.maven.plugin.javadoc.JavadocUtilTest
2011-08-01 10:19:57.049::INFO:  jetty-6.1.19
2011-08-01 10:19:57.051::INFO:  Started SocketConnector@vesta.apache.org:41916
2011-08-01 10:19:57.320::INFO:  jetty-6.1.19
2011-08-01 10:19:57.321::INFO:  Started SocketConnector@vesta.apache.org:38177
[ INFO] basic authentication scheme selected
[ INFO] No credentials available for BASIC 'Jetty Proxy Authorization'@vesta.apache.org:38177
2011-08-01 10:19:57.488::INFO:  jetty-6.1.19
2011-08-01 10:19:57.489::INFO:  Started SocketConnector@vesta.apache.org:43581
[ INFO] basic authentication scheme selected
[ INFO] basic authentication scheme selected
2011-08-01 10:19:57.757::INFO:  jetty-6.1.19
2011-08-01 10:19:57.758::INFO:  Started SocketConnector@vesta.apache.org:37823
[ INFO] basic authentication scheme selected
2011-08-01 10:20:00.830::WARN:  EXCEPTION on HttpExchange@14308998=GET//maven.apache.org:80/plugins/maven-javadoc-plugin/apidocs/package-list#6
org.mortbay.jetty.EofException
	at org.mortbay.jetty.HttpGenerator.flush(HttpGenerator.java:787)
	at org.mortbay.jetty.AbstractGenerator$Output.flush(AbstractGenerator.java:568)
	at org.mortbay.jetty.HttpConnection$Output.flush(HttpConnection.java:946)
	at org.mortbay.jetty.AbstractGenerator$Output.write(AbstractGenerator.java:652)
	at org.mortbay.jetty.AbstractGenerator$Output.write(AbstractGenerator.java:579)
	at org.mortbay.proxy.AsyncProxyServlet$1.onResponseContent(AsyncProxyServlet.java:183)
	at org.mortbay.jetty.client.HttpExchange$Listener.onResponseContent(HttpExchange.java:590)
	at org.mortbay.jetty.client.HttpConnection$Handler.content(HttpConnection.java:535)
	at org.mortbay.jetty.HttpParser.parseNext(HttpParser.java:747)
	at org.mortbay.jetty.HttpParser.parseAvailable(HttpParser.java:218)
	at org.mortbay.jetty.client.HttpConnection.handle(HttpConnection.java:269)
	at org.mortbay.io.nio.SelectChannelEndPoint.run(SelectChannelEndPoint.java:409)
	at org.mortbay.thread.QueuedThreadPool$PoolThread.run(QueuedThreadPool.java:520)
Caused by: java.net.SocketException: Broken pipe
	at java.net.SocketOutputStream.socketWrite0(Native Method)
	at java.net.SocketOutputStream.socketWrite(SocketOutputStream.java:92)
	at java.net.SocketOutputStream.write(SocketOutputStream.java:136)
	at org.mortbay.io.ByteArrayBuffer.writeTo(ByteArrayBuffer.java:368)
	at org.mortbay.io.bio.StreamEndPoint.flush(StreamEndPoint.java:122)
	at org.mortbay.io.bio.StreamEndPoint.flush(StreamEndPoint.java:154)
	at org.mortbay.jetty.HttpGenerator.flush(HttpGenerator.java:710)
	... 12 more
2011-08-01 10:20:01.767::WARN:  CONNECTION FAILED on HttpExchange@3021676=GET//maven.apache.org:80/plugins/maven-javadoc-plugin/apidocs/package-list#1
java.nio.channels.ClosedByInterruptException
	at java.nio.channels.spi.AbstractInterruptibleChannel.end(AbstractInterruptibleChannel.java:184)
	at sun.nio.ch.SocketChannelImpl.connect(SocketChannelImpl.java:476)
	at org.mortbay.jetty.client.SelectConnector.startConnection(SelectConnector.java:70)
	at org.mortbay.jetty.client.HttpDestination.startNewConnection(HttpDestination.java:243)
	at org.mortbay.jetty.client.HttpDestination.doSend(HttpDestination.java:474)
	at org.mortbay.jetty.client.HttpDestination.send(HttpDestination.java:420)
	at org.mortbay.jetty.client.HttpClient.send(HttpClient.java:142)
	at org.mortbay.proxy.AsyncProxyServlet.service(AsyncProxyServlet.java:266)
	at org.apache.maven.plugin.javadoc.ProxyServer$AuthAsyncProxyServlet.service(ProxyServer.java:228)
	at org.mortbay.jetty.servlet.ServletHolder.handle(ServletHolder.java:502)
	at org.mortbay.jetty.servlet.ServletHandler.handle(ServletHandler.java:389)
	at org.mortbay.jetty.handler.ContextHandler.handle(ContextHandler.java:765)
	at org.mortbay.jetty.handler.HandlerWrapper.handle(HandlerWrapper.java:152)
	at org.mortbay.jetty.Server.handle(Server.java:326)
	at org.mortbay.jetty.HttpConnection.handleRequest(HttpConnection.java:534)
	at org.mortbay.jetty.HttpConnection$RequestHandler.headerComplete(HttpConnection.java:864)
	at org.mortbay.jetty.HttpParser.parseNext(HttpParser.java:539)
	at org.mortbay.jetty.HttpParser.parseAvailable(HttpParser.java:212)
	at org.mortbay.jetty.HttpConnection.handle(HttpConnection.java:404)
	at org.mortbay.jetty.bio.SocketConnector$Connection.run(SocketConnector.java:228)
	at org.mortbay.thread.QueuedThreadPool$PoolThread.run(QueuedThreadPool.java:520)
2011-08-01 10:20:02.067::INFO:  jetty-6.1.19
2011-08-01 10:20:02.068::INFO:  Started SocketConnector@vesta.apache.org:43443
Tests run: 8, Failures: 0, Errors: 0, Skipped: 0, Time elapsed: 6.786 sec
Running org.apache.maven.plugin.javadoc.TestJavadocReportTest
Tests run: 1, Failures: 0, Errors: 0, Skipped: 0, Time elapsed: 1.092 sec

Results :

Tests run: 53, Failures: 0, Errors: 0, Skipped: 0

[JENKINS] Recording test results
[INFO] 
[INFO] --- maven-jar-plugin:2.3.1:jar (default-jar) @ maven-javadoc-plugin ---
[INFO] Building jar: <https://builds.apache.org/job/maven-plugins/ws/maven-javadoc-plugin/target/maven-javadoc-plugin-2.8.1-SNAPSHOT.jar>
[INFO] 
[INFO] --- maven-plugin-plugin:2.7:addPluginArtifactMetadata (default-addPluginArtifactMetadata)
@ maven-javadoc-plugin ---
[INFO] 
[INFO] --- maven-shade-plugin:1.2.1:shade (default) @ maven-javadoc-plugin ---
[INFO] Excluding org.apache.maven:maven-core:jar:2.0.9 from the shaded jar.
[INFO] Excluding org.apache.maven.wagon:wagon-file:jar:1.0-beta-2 from the shaded jar.
[INFO] Excluding org.apache.maven:maven-plugin-parameter-documenter:jar:2.0.9 from the shaded
jar.
[INFO] Excluding org.apache.maven.wagon:wagon-webdav:jar:1.0-beta-2 from the shaded jar.
[INFO] Excluding slide:slide-webdavlib:jar:2.1 from the shaded jar.
[INFO] Excluding jdom:jdom:jar:1.0 from the shaded jar.
[INFO] Excluding de.zeigermann.xml:xml-im-exporter:jar:1.1 from the shaded jar.
[INFO] Excluding org.apache.maven.wagon:wagon-http-lightweight:jar:1.0-beta-2 from the shaded
jar.
[INFO] Excluding org.apache.maven.wagon:wagon-http-shared:jar:1.0-beta-2 from the shaded jar.
[INFO] Excluding jtidy:jtidy:jar:4aug2000r7-dev from the shaded jar.
[INFO] Excluding xml-apis:xml-apis:jar:1.0.b2 from the shaded jar.
[INFO] Excluding org.apache.maven:maven-profile:jar:2.0.9 from the shaded jar.
[INFO] Excluding org.apache.maven:maven-repository-metadata:jar:2.0.9 from the shaded jar.
[INFO] Excluding org.apache.maven:maven-error-diagnostics:jar:2.0.9 from the shaded jar.
[INFO] Excluding commons-cli:commons-cli:jar:1.0 from the shaded jar.
[INFO] Excluding org.apache.maven.wagon:wagon-ssh-external:jar:1.0-beta-2 from the shaded
jar.
[INFO] Excluding org.apache.maven.wagon:wagon-ssh-common:jar:1.0-beta-2 from the shaded jar.
[INFO] Excluding org.apache.maven:maven-plugin-descriptor:jar:2.0.9 from the shaded jar.
[INFO] Excluding org.codehaus.plexus:plexus-interactivity-api:jar:1.0-alpha-4 from the shaded
jar.
[INFO] Excluding org.apache.maven:maven-monitor:jar:2.0.9 from the shaded jar.
[INFO] Excluding org.apache.maven.wagon:wagon-ssh:jar:1.0-beta-2 from the shaded jar.
[INFO] Excluding com.jcraft:jsch:jar:0.1.27 from the shaded jar.
[INFO] Excluding classworlds:classworlds:jar:1.1 from the shaded jar.
[INFO] Excluding org.apache.maven:maven-project:jar:2.0.9 from the shaded jar.
[INFO] Excluding org.apache.maven:maven-plugin-registry:jar:2.0.9 from the shaded jar.
[INFO] Excluding org.apache.maven:maven-model:jar:2.0.9 from the shaded jar.
[INFO] Excluding org.apache.maven:maven-settings:jar:2.0.9 from the shaded jar.
[INFO] Excluding org.apache.maven:maven-plugin-api:jar:2.0.9 from the shaded jar.
[INFO] Excluding org.apache.maven:maven-artifact:jar:2.0.9 from the shaded jar.
[INFO] Excluding org.apache.maven:maven-artifact-manager:jar:2.0.9 from the shaded jar.
[INFO] Excluding org.apache.maven.reporting:maven-reporting-api:jar:3.0 from the shaded jar.
[INFO] Excluding org.apache.maven:maven-archiver:jar:2.3 from the shaded jar.
[INFO] Excluding org.apache.maven.shared:maven-invoker:jar:2.0.9 from the shaded jar.
[INFO] Excluding org.apache.maven.shared:maven-common-artifact-filters:jar:1.3 from the shaded
jar.
[INFO] Excluding org.apache.maven.doxia:doxia-sink-api:jar:1.0 from the shaded jar.
[INFO] Excluding org.apache.maven.doxia:doxia-site-renderer:jar:1.0 from the shaded jar.
[INFO] Excluding org.apache.maven.doxia:doxia-core:jar:1.0 from the shaded jar.
[INFO] Excluding org.codehaus.plexus:plexus-i18n:jar:1.0-beta-7 from the shaded jar.
[INFO] Excluding org.codehaus.plexus:plexus-velocity:jar:1.1.7 from the shaded jar.
[INFO] Excluding org.apache.velocity:velocity:jar:1.5 from the shaded jar.
[INFO] Excluding oro:oro:jar:2.0.8 from the shaded jar.
[INFO] Excluding org.apache.maven.doxia:doxia-decoration-model:jar:1.0 from the shaded jar.
[INFO] Excluding commons-collections:commons-collections:jar:3.2 from the shaded jar.
[INFO] Excluding org.apache.maven.doxia:doxia-module-apt:jar:1.0 from the shaded jar.
[INFO] Excluding org.apache.maven.doxia:doxia-module-fml:jar:1.0 from the shaded jar.
[INFO] Excluding org.apache.maven.doxia:doxia-module-xdoc:jar:1.0 from the shaded jar.
[INFO] Excluding org.apache.maven.doxia:doxia-module-xhtml:jar:1.0 from the shaded jar.
[INFO] Including org.apache.maven.wagon:wagon-provider-api:jar:1.0-beta-6 in the shaded jar.
[INFO] Excluding commons-lang:commons-lang:jar:2.4 from the shaded jar.
[INFO] Excluding commons-httpclient:commons-httpclient:jar:3.1 from the shaded jar.
[INFO] Excluding commons-codec:commons-codec:jar:1.2 from the shaded jar.
[INFO] Excluding commons-logging:commons-logging:jar:1.1.1 from the shaded jar.
[INFO] Excluding log4j:log4j:jar:1.2.14 from the shaded jar.
[INFO] Excluding com.thoughtworks.qdox:qdox:jar:1.12 from the shaded jar.
[INFO] Excluding org.codehaus.plexus:plexus-container-default:jar:1.0-alpha-9 from the shaded
jar.
[INFO] Excluding org.codehaus.plexus:plexus-archiver:jar:1.0-alpha-9 from the shaded jar.
[INFO] Excluding org.codehaus.plexus:plexus-io:jar:1.0-alpha-1 from the shaded jar.
[INFO] Excluding org.apache.maven:maven-toolchain:jar:1.0 from the shaded jar.
[INFO] Excluding org.codehaus.plexus:plexus-utils:jar:1.5.8 from the shaded jar.
[INFO] Excluding org.mockito:mockito-core:jar:1.8.5 from the shaded jar.
[INFO] Excluding org.hamcrest:hamcrest-core:jar:1.1 from the shaded jar.
[INFO] Excluding org.objenesis:objenesis:jar:1.0 from the shaded jar.
[INFO] Replacing original artifact with shaded artifact.
[INFO] Replacing <https://builds.apache.org/job/maven-plugins/ws/maven-javadoc-plugin/target/maven-javadoc-plugin-2.8.1-SNAPSHOT.jar>
with <https://builds.apache.org/job/maven-plugins/ws/maven-javadoc-plugin/target/maven-javadoc-plugin-2.8.1-SNAPSHOT-shaded.jar>
[INFO] [INFO] Installing <https://builds.apache.org/job/maven-plugins/ws/maven-javadoc-plugin/target/maven-javadoc-plugin-2.8.1-SNAPSHOT.jar>
to /home/hudson/.m2/repository/org/apache/maven/plugins/maven-javadoc-plugin/2.8.1-SNAPSHOT/maven-javadoc-plugin-2.8.1-SNAPSHOT.jar
[INFO] Installing <https://builds.apache.org/job/maven-plugins/ws/maven-javadoc-plugin/pom.xml>
to /home/hudson/.m2/repository/org/apache/maven/plugins/maven-javadoc-plugin/2.8.1-SNAPSHOT/maven-javadoc-plugin-2.8.1-SNAPSHOT.pom

[INFO] --- maven-install-plugin:2.3.1:install (default-install) @ maven-javadoc-plugin ---
projectSucceeded org.apache.maven.plugins:maven-javadoc-plugin:2.8.1-SNAPSHOT
[JENKINS] Archiving <https://builds.apache.org/job/maven-plugins/ws/maven-javadoc-plugin/pom.xml>
to /home/hudson/hudson/jobs/maven-plugins/modules/org.apache.maven.plugins$maven-javadoc-plugin/builds/2011-08-01_10-10-23/archive/org.apache.maven.plugins/maven-javadoc-plugin/2.8.1-SNAPSHOT/maven-javadoc-plugin-2.8.1-SNAPSHOT.pom
[JENKINS] Archiving <https://builds.apache.org/job/maven-plugins/ws/maven-javadoc-plugin/target/maven-javadoc-plugin-2.8.1-SNAPSHOT.jar>
to /home/hudson/hudson/jobs/maven-plugins/modules/org.apache.maven.plugins$maven-javadoc-plugin/builds/2011-08-01_10-10-23/archive/org.apache.maven.plugins/maven-javadoc-plugin/2.8.1-SNAPSHOT/maven-javadoc-plugin-2.8.1-SNAPSHOT.jar
sessionEnded
[INFO] ------------------------------------------------------------------------
[INFO] Reactor Summary:
[INFO] 
[INFO] Maven Plugins ..................................... SUCCESS [12.425s]
[INFO] Maven ACR Plugin .................................. SUCCESS [16.245s]
[INFO] Maven Ant Plugin .................................. SUCCESS [31.773s]
[INFO] Maven AntRun Plugin ............................... SUCCESS [5.606s]
[INFO] Maven Eclipse Plugin .............................. SUCCESS [43.224s]
[INFO] Maven Assembly Plugin ............................. SUCCESS [36.077s]
[INFO] Maven Changelog Plugin ............................ SUCCESS [12.788s]
[INFO] Maven Changes Report Plugin ....................... SUCCESS [36.550s]
[INFO] Maven Checkstyle Plugin ........................... SUCCESS [44.167s]
[INFO] Maven Clean Plugin ................................ SUCCESS [25.667s]
[INFO] Maven Compiler Plugin ............................. SUCCESS [15.341s]
[INFO] Maven Dependency Plugin ........................... SUCCESS [1:11.039s]
[INFO] Maven Deploy Plugin ............................... SUCCESS [26.864s]
[INFO] Maven DOAP Plugin ................................. SUCCESS [36.751s]
[INFO] Maven Documentation Checker Plugin ................ SUCCESS [6.630s]
[INFO] Maven EAR Plugin .................................. SUCCESS [13.905s]
[INFO] Maven EJB Plugin .................................. SUCCESS [17.383s]
[INFO] Maven GPG Plugin .................................. SUCCESS [4.899s]
[INFO] Maven Help Plugin ................................. SUCCESS [13.421s]
[INFO] Maven IDEA Plugin ................................. SUCCESS [17.582s]
[INFO] Maven Install Plugin .............................. SUCCESS [11.947s]
[INFO] Maven JAR Plugin .................................. SUCCESS [8.751s]
[INFO] Maven Jarsigner Plugin ............................ SUCCESS [11.758s]
[INFO] Maven Javadoc Plugin .............................. SUCCESS [6:23.816s]
[INFO] Maven Linkcheck Plugin ............................ SUCCESS [10.516s]
[INFO] Maven One Plugin .................................. SUCCESS [9.679s]
[INFO] Maven Patch Plugin ................................ SUCCESS [8.996s]
[INFO] Maven PDF Plugin .................................. SUCCESS [23.041s]
[INFO] Maven PMD Plugin .................................. SUCCESS [20.897s]
[INFO] Maven RAR Plugin .................................. SUCCESS [20.321s]
[INFO] Maven Reactor Plugin .............................. SUCCESS [16.775s]
[INFO] Maven Repository Plugin ........................... SUCCESS [15.240s]
[INFO] Maven Resources Plugin ............................ SUCCESS [12.447s]
[INFO] Maven Shade Plugin ................................ SUCCESS [26.004s]
[INFO] Maven Site Plugin 3 ............................... FAILURE [6.262s]
[INFO] Maven Source Plugin ............................... SUCCESS [23.905s]
[INFO] Maven Stage Plugin ................................ SUCCESS [8.916s]
[INFO] Maven Toolchains Plugin ........................... SUCCESS [8.673s]
[INFO] Maven Verifier Plugin ............................. SUCCESS [9.733s]
[INFO] Maven WAR Plugin .................................. SUCCESS [21.409s]
[INFO] Maven Invoker Plugin .............................. SUCCESS [10.231s]
[INFO] Maven Project Info Reports Plugin ................. SUCCESS [44.567s]
[INFO] Maven Remote Resources Plugin ..................... SUCCESS [12.500s]
[INFO] Maven Plugins Aggregator .......................... SUCCESS [3.784s]
[INFO] ------------------------------------------------------------------------
[INFO] BUILD FAILURE
[INFO] ------------------------------------------------------------------------
[INFO] Total time: 9:30.586s (Wall Clock)
[INFO] Finished at: Mon Aug 01 10:20:08 UTC 2011
[INFO] Final Memory: 61M/662M
[INFO] ------------------------------------------------------------------------
maven builder waiting
mavenExecutionResult exceptions not empty
message : Failed to execute goal on project maven-site-plugin: Could not resolve dependencies
for project org.apache.maven.plugins:maven-site-plugin:maven-plugin:3.1-SNAPSHOT: Could not
find artifact org.apache.maven.reporting:maven-reporting-exec:jar:1.0.1 in central (http://repo1.maven.org/maven2)
cause : Could not resolve dependencies for project org.apache.maven.plugins:maven-site-plugin:maven-plugin:3.1-SNAPSHOT:
Could not find artifact org.apache.maven.reporting:maven-reporting-exec:jar:1.0.1 in central
(http://repo1.maven.org/maven2)
Stack trace : 
org.apache.maven.lifecycle.LifecycleExecutionException: Failed to execute goal on project
maven-site-plugin: Could not resolve dependencies for project org.apache.maven.plugins:maven-site-plugin:maven-plugin:3.1-SNAPSHOT:
Could not find artifact org.apache.maven.reporting:maven-reporting-exec:jar:1.0.1 in central
(http://repo1.maven.org/maven2)
	at org.apache.maven.lifecycle.internal.LifecycleDependencyResolver.getDependencies(LifecycleDependencyResolver.java:196)
	at org.apache.maven.lifecycle.internal.LifecycleDependencyResolver.resolveProjectDependencies(LifecycleDependencyResolver.java:108)
	at org.apache.maven.lifecycle.internal.MojoExecutor.ensureDependenciesAreResolved(MojoExecutor.java:258)
	at org.apache.maven.lifecycle.internal.MojoExecutor.execute(MojoExecutor.java:201)
	at org.apache.maven.lifecycle.internal.MojoExecutor.execute(MojoExecutor.java:153)
	at org.apache.maven.lifecycle.internal.MojoExecutor.execute(MojoExecutor.java:145)
	at org.apache.maven.lifecycle.internal.LifecycleModuleBuilder.buildProject(LifecycleModuleBuilder.java:84)
	at org.apache.maven.lifecycle.internal.LifecycleThreadedBuilder$1.call(LifecycleThreadedBuilder.java:167)
	at org.apache.maven.lifecycle.internal.LifecycleThreadedBuilder$1.call(LifecycleThreadedBuilder.java:164)
	at java.util.concurrent.FutureTask$Sync.innerRun(FutureTask.java:269)
	at java.util.concurrent.FutureTask.run(FutureTask.java:123)
	at java.util.concurrent.ThreadPoolExecutor$Worker.runTask(ThreadPoolExecutor.java:651)
	at java.util.concurrent.ThreadPoolExecutor$Worker.run(ThreadPoolExecutor.java:676)
	at java.lang.Thread.run(Thread.java:595)
Caused by: org.apache.maven.project.DependencyResolutionException: Could not resolve dependencies
for project org.apache.maven.plugins:maven-site-plugin:maven-plugin:3.1-SNAPSHOT: Could not
find artifact org.apache.maven.reporting:maven-reporting-exec:jar:1.0.1 in central (http://repo1.maven.org/maven2)
	at org.apache.maven.project.DefaultProjectDependenciesResolver.resolve(DefaultProjectDependenciesResolver.java:170)
	at org.apache.maven.lifecycle.internal.LifecycleDependencyResolver.getDependencies(LifecycleDependencyResolver.java:171)
	... 13 more
Caused by: org.sonatype.aether.resolution.DependencyResolutionException: Could not find artifact
org.apache.maven.reporting:maven-reporting-exec:jar:1.0.1 in central (http://repo1.maven.org/maven2)
	at org.sonatype.aether.impl.internal.DefaultRepositorySystem.resolveDependencies(DefaultRepositorySystem.java:412)
	at org.apache.maven.project.DefaultProjectDependenciesResolver.resolve(DefaultProjectDependenciesResolver.java:164)
	... 14 more
Caused by: org.sonatype.aether.resolution.ArtifactResolutionException: Could not find artifact
org.apache.maven.reporting:maven-reporting-exec:jar:1.0.1 in central (http://repo1.maven.org/maven2)
	at org.sonatype.aether.impl.internal.DefaultArtifactResolver.resolve(DefaultArtifactResolver.java:541)
	at org.sonatype.aether.impl.internal.DefaultArtifactResolver.resolveArtifacts(DefaultArtifactResolver.java:220)
	at org.sonatype.aether.impl.internal.DefaultRepositorySystem.resolveDependencies(DefaultRepositorySystem.java:395)
	... 15 more
Caused by: org.sonatype.aether.transfer.ArtifactNotFoundException: Could not find artifact
org.apache.maven.reporting:maven-reporting-exec:jar:1.0.1 in central (http://repo1.maven.org/maven2)
	at org.sonatype.aether.connector.wagon.WagonRepositoryConnector$4.wrap(WagonRepositoryConnector.java:945)
	at org.sonatype.aether.connector.wagon.WagonRepositoryConnector$4.wrap(WagonRepositoryConnector.java:940)
	at org.sonatype.aether.connector.wagon.WagonRepositoryConnector$GetTask.flush(WagonRepositoryConnector.java:695)
	at org.sonatype.aether.connector.wagon.WagonRepositoryConnector$GetTask.flush(WagonRepositoryConnector.java:689)
	at org.sonatype.aether.connector.wagon.WagonRepositoryConnector.get(WagonRepositoryConnector.java:445)
	at org.sonatype.aether.impl.internal.DefaultArtifactResolver.resolve(DefaultArtifactResolver.java:460)
	... 17 more
Sending e-mails to: notifications@maven.apache.org
Sending e-mails to: notifications@maven.apache.org
channel stopped


Mime
View raw message