maven-notifications mailing list archives

Site index · List index
Message view « Date » · « Thread »
Top « Date » · « Thread »
From Apache Jenkins Server <jenk...@builds.apache.org>
Subject Build failed in Jenkins: core-integration-testing-maven-3-trunk-jdk-1.6 #7
Date Mon, 01 Aug 2011 14:22:15 GMT
See <https://builds.apache.org/job/core-integration-testing-maven-3-trunk-jdk-1.6/7/changes>

Changes:

[brett] only take the canonical file on the input path, so we resolve any symlinks (/private/tmp
on Mac OS X for /tmp, and similar for storage location of some CI installs), without invalidating
the test by modifying the paths either from the properties or from getRoot()

------------------------------------------
[...truncated 4440 lines...]
mng2103PluginExecutionInheritance(it).......................OK (1.3 s)
mng2098VersionRangeSatisfiedFromWrongRepo(it)...............OK (1.3 s)
mng2068ReactorRelativeParents(itInheritedIdFields)..........OK (1.0 s)
mng2068ReactorRelativeParents(itExplicitIdFields)...........OK (1.1 s)
mng2068ReactorRelativeParents(itComplex)....................OK (1.0 s)
mng2054PluginExecutionInheritance(itMNG2054)................OK (1.1 s)
mng2052InterpolateWithSettingsProfileProperties(itMNG2052)..OK (1.2 s)
mng2045testJarDependenciesBrokenInReactor(itMNG2045)........OK (1.4 s)
mng2006ChildPathAwareUrlInheritance(itMNG2006)..............OK (1.1 s)
mng1999DefaultReportsInheritance(itInheritSuppression)......SKIPPED - version 3.0.4-SNAPSHOT
not in range (2.0.9,2.1.0-M1),(2.1.0-M1,3.0-alpha-1)
mng1999DefaultReportsInheritance(itOverrideSuppression).....SKIPPED - version 3.0.4-SNAPSHOT
not in range (2.0.9,2.1.0-M1),(2.1.0-M1,3.0-alpha-1)
mng1995InterpolateBooleanModelElements(itMNG1995)...........OK (1.2 s)
mng1992SystemPropOverridesPomProp(itMNG1992)................OK (1.1 s)
mng1957JdkActivationWithVersionRange(itMNG1957).............OK (1.1 s)
mng1908LegacySnapshotUpdate(itMNG1908)......................SKIPPED - version 3.0.4-SNAPSHOT
not in range [2.0,3.0-alpha-3)
mng1895ScopeConflictResolution(itDirectVsIndirect)..........OK (1.4 s)
mng1895ScopeConflictResolution(itCompileVsRuntime)..........OK (1.3 s)
mng1895ScopeConflictResolution(itCompileVsTest).............OK (1.3 s)
mng1895ScopeConflictResolution(itCompileVsProvided).........OK (1.4 s)
mng1895ScopeConflictResolution(itRuntimeVsTest).............OK (1.3 s)
mng1895ScopeConflictResolution(itRuntimeVsProvided).........OK (1.3 s)
mng1895ScopeConflictResolution(itProvidedVsTest)............OK (1.3 s)
mng1830ShowVersion(Version).................................OK (1.0 s)
mng1803PomValidationErrorIncludesLineNumber(it).............OK (1.0 s)
mng1751ForcedMetadataUpdateDuringDeployment(it).............OK (2.7 s)
mng1703PluginMgmtDepInheritance(itMNG1703)..................OK (1.5 s)
mng1701DuplicatePlugin(it)..................................OK (1.1 s)
mng1493NonStandardModulePomNames(itMNG1493).................OK (1.0 s)
mng1491ReactorArtifactIdCollision(itMNG1491)................OK (1.0 s)
mng1415QuotedSystemProperties(itMNG1415)....................OK (1.2 s)
mng1412DependenciesOrder(itMNG1412).........................OK (1.3 s)
mng1349ChecksumFormats(itMNG1349)...........................OK (1.3 s)
mng1323AntrunDependencies(itMNG1323)........................OK (1.3 s)
mng1233WarDepWithProvidedScope(itMNG1233)...................OK (1.3 s)
mng1144MultipleDefaultGoals(it).............................OK (1.2 s)
mng1142VersionRangeIntersection(itAB).......................OK (1.3 s)
mng1142VersionRangeIntersection(itBA).......................OK (1.3 s)
mng1088ReactorPluginResolution(itMNG1088)...................OK (1.2 s)
mng1073AggregatorForksReactor(itForkLifecycle)..............OK (1.2 s)
mng1073AggregatorForksReactor(itForkGoal)...................OK (1.3 s)
mng1052PluginMngtConfig(itMNG1052)..........................OK (1.2 s)
mng1021EqualAttachmentBuildNumber(itMNG1021)................OK (1.3 s)
mng0985NonExecutedPluginMngtGoals(itMNG0985)................OK (1.0 s)
mng0956ComponentInjectionViaProjectLevelPluginDep(itMNG0956)..OK (1.2 s)
mng0947OptionalDependency(it)...............................OK (1.3 s)
mng0870ReactorAwarePluginDiscovery(itMNG0870)...............OK (1.3 s)
mng0866EvaluateDefaultValue(itMNG866).......................OK (1.2 s)
mng0848SystemPropOverridesDefaultValue(itMNG848)............OK (1.2 s)
mng0836PluginParentResolution(itMNG836).....................OK (1.2 s)
mng0823MojoContextPassing(itMNG0823)........................OK (1.3 s)
mng0820ConflictResolution(itMNG0820)........................OK (1.3 s)
mng0818WarDepsNotTransitive(itMNG0818)......................OK (1.3 s)
mng0814ExplicitProfileActivation(itMNG814)..................OK (1.2 s)
mng0786ProfileAwareReactor(itMNG0786).......................OK (1.1 s)
mng0781PluginConfigVsExecConfig(itMNG0781)..................OK (1.2 s)
mng0773SettingsProfileReactorPollution(itMNG773)............OK (1.0 s)
mng0768OfflineMode(itMNG768)................................OK (3.8 s)
mng0761MissingSnapshotDistRepo(itMNG761)....................OK (1.3 s)
mng0731LegacyRepoLayout(itMNG731)...........................SKIPPED - version 3.0.4-SNAPSHOT
not in range [2.0,3.0-alpha-3)
mng0680ParentBasedir(itMNG680)..............................FAILURE (1.2 s)
mng0674PluginParameterAlias(itLifecycle)....................OK (1.4 s)
mng0674PluginParameterAlias(itCli)..........................OK (1.2 s)
mng0666IgnoreLegacyPom(itMNG666)............................OK (1.2 s)
mng0557UserSettingsCliOption(itMNG557)......................OK (1.2 s)
mng0553SettingsAuthzEncryption(itBasic).....................OK (1.8 s)
mng0553SettingsAuthzEncryption(itRelocation)................OK (1.9 s)
mng0553SettingsAuthzEncryption(itEncryption)................OK (2.8 s)
mng0522InheritedPluginMgmtConfig(itMNG522)..................OK (1.3 s)
mng0507ArtifactRelocation(itMNG507).........................OK (1.8 s)
mng0505VersionRange(itMNG505)...............................OK (1.4 s)
mng0496IgnoreUnknownPluginParameters(itMNG496)..............OK (1.1 s)
mng0479OverrideCentralRepo(itModel).........................OK (2.3 s)
mng0479OverrideCentralRepo(itResolution)....................OK (4.3 s)
mng0471CustomLifecycle(itMNG471)............................OK (1.2 s)
mng0469ReportConfig(itReportConfigOverridesBuildDefaults)...SKIPPED - version 3.0.4-SNAPSHOT
not in range [2.0.0,3.0-alpha-1)
mng0469ReportConfig(itBuildConfigDominantDuringBuild).......OK (1.2 s)
mng0469ReportConfig(itBuildConfigIrrelevantForReports)......OK (1.1 s)
mng0461TolerateMissingDependencyPom(it).....................OK (1.2 s)
mng0449PluginVersionResolution(itLifecycleInvocation).......OK (1.2 s)
mng0449PluginVersionResolution(itCliInvocation).............OK (1.2 s)
mng0377PluginLookupFromPrefix(itMNG377).....................OK (1.4 s)
mng0294MergeGlobalAndUserSettings(itMNG294).................OK (1.2 s)
mng0282NonReactorExecWhenProjectIndependent(itMNG282).......OK (1.2 s)
mng0249ResolveDepsFromReactor(itMNG0249)....................OK (1.3 s)
mng0187CollectedProjects(it)................................OK (1.2 s)
mng0095ReactorFailureBehavior(itFailFast)...................OK (1.2 s)
mng0095ReactorFailureBehavior(itFailNever)..................OK (1.2 s)
mng0095ReactorFailureBehavior(itFailAtEnd)..................OK (1.4 s)
0145ReactorWithIncludesExcludes(itDefaultIncludesExcludes)..SKIPPED - version 3.0.4-SNAPSHOT
not in range [2.0,3.0-alpha-1)
0145ReactorWithIncludesExcludes(itCustomIncludes)...........SKIPPED - version 3.0.4-SNAPSHOT
not in range [2.0,3.0-alpha-1)
0145ReactorWithIncludesExcludes(itCustomExcludes)...........SKIPPED - version 3.0.4-SNAPSHOT
not in range [2.0,3.0-alpha-1)
0144LifecycleExecutionOrder(it0144).........................OK (1.6 s)
0143TransitiveDependencyScopes(itCompileScope)..............OK (1.3 s)
0143TransitiveDependencyScopes(itProvidedScope).............OK (1.2 s)
0143TransitiveDependencyScopes(itRuntimeScope)..............OK (1.2 s)
0143TransitiveDependencyScopes(itTestScope).................OK (1.2 s)
0142DirectDependencyScopes(it0142)..........................OK (1.3 s)
0140InterpolationWithPomPrefix(it0140)......................OK (1.2 s)
0139InterpolationWithProjectPrefix(it0139)..................OK (1.2 s)
0138PluginLifecycle(it0138).................................OK (1.5 s)
0137EarLifecycle(it0137)....................................OK (1.4 s)
0136RarLifecycle(it0136)....................................OK (1.3 s)
0135EjbLifecycle(it0135)....................................OK (1.3 s)
0134WarLifecycle(it0134)....................................OK (1.4 s)
0133JarLifecycle(it0133)....................................OK (1.6 s)
0132PomLifecycle(it0132)....................................OK (1.2 s)
0131SiteLifecycle(it0131)...................................OK (1.2 s)
0130CleanLifecycle(it0130)..................................OK (1.2 s)
0113ServerAuthzAvailableToWagonMgrInPlugin(it0113)..........OK (1.3 s)
0090EnvVarInterpolation(it0090).............................OK (1.2 s)
0087PluginRealmWithProjectLevelDeps(it0087).................OK (1.2 s)
0086PluginRealm(it0086).....................................OK (1.1 s)
0085TransitiveSystemScope(it0085)...........................OK (1.2 s)
0072InterpolationWithDottedProperty(it0072).................OK (1.2 s)
0071PluginConfigWithDottedProperty(it0071)..................OK (1.2 s)
0064MojoConfigViaSetters(it0064)............................OK (1.1 s)
0063SystemScopeDependency(it0063)...........................OK (1.2 s)
0056MultipleGoalExecutions(it0056)..........................OK (1.1 s)
0052ReleaseProfile(it0052)..................................OK (1.3 s)
0051ReleaseProfile(it0051)..................................OK (1.3 s)
0041ArtifactTypeFromPluginExtension(it0041).................OK (1.7 s)
0040PackagingFromPluginExtension(it0040)....................OK (1.4 s)
0039ReleasePomInReactor(it0039).............................SKIPPED - version 3.0.4-SNAPSHOT
not in range [2.0,3.0-alpha-1)
0038AlternatePomFileDifferentDir(it0038)....................OK (1.2 s)
0037AlternatePomFileSameDir(it0037).........................OK (1.2 s)
0036ReleasePom(it0036)......................................SKIPPED - version 3.0.4-SNAPSHOT
not in range (2.0,3.0-alpha-1)
0032MavenPrerequisite(it0032)...............................OK (1.0 s)
0030DepPomDepMngtInheritance(it0030)........................OK (3.0 s)
0025MultipleExecutionLevelConfigs(it0025)...................OK (1.3 s)
0024MultipleGoalExecutions(it0024)..........................OK (1.2 s)
0023SettingsProfile(it0023).................................OK (1.2 s)
0021PomProfile(it0021)......................................OK (1.2 s)
0019PluginVersionMngtBySuperPom(it0019).....................OK (1.4 s)
0018DependencyManagement(it0018)............................OK (1.3 s)
0012PomInterpolation(it0012)................................OK (1.3 s)
0011DefaultVersionByDependencyManagement(it0011)............OK (1.3 s)
0010DependencyClosureResolution(it0010).....................OK (1.3 s)
0009GoalConfiguration(it0009)...............................OK (1.3 s)
0008SimplePlugin(it0008)....................................OK (1.3 s)
Tests run: 699, Failures: 11, Errors: 0, Skipped: 0, Time elapsed: 1,000.273 sec <<<
FAILURE!

Results :

Failed tests:   testitMNG3904(org.apache.maven.it.MavenITmng3904NestedBuildDirInterpolationTest):
expected:<<https://builds.apache.org/job/core-integration-testing-maven-3-trunk-jdk-1.6/ws/core-integration-testing-trunk/core-it-suite/target/test-classes/mng-3904/target/classes/dir0>>
but was:</x1/jenkins/jenkins-slave/workspace/core-integration-testing-maven-3-trunk-jdk-1.6/core-integration-testing-trunk/core-it-suite/target/test-classes/mng-3904/target/classes/dir0>
  testitMNG3877(org.apache.maven.it.MavenITmng3877BasedirAlignedModelTest): expected:<<https://builds.apache.org/job/core-integration-testing-maven-3-trunk-jdk-1.6/ws/core-integration-testing-trunk/core-it-suite/target/test-classes/mng-3877/target>>
but was:</x1/jenkins/jenkins-slave/workspace/core-integration-testing-maven-3-trunk-jdk-1.6/core-integration-testing-trunk/core-it-suite/target/test-classes/mng-3877/target>
  testitMNG3864(org.apache.maven.it.MavenITmng3864PerExecPluginConfigTest): expected:<<https://builds.apache.org/job/core-integration-testing-maven-3-trunk-jdk-1.6/ws/core-integration-testing-trunk/core-it-suite/target/test-classes/mng-3864/pom.xml>>
but was:</x1/jenkins/jenkins-slave/workspace/core-integration-testing-maven-3-trunk-jdk-1.6/core-integration-testing-trunk/core-it-suite/target/test-classes/mng-3864/pom.xml>
  testitMNG3843(org.apache.maven.it.MavenITmng3843PomInheritanceTest): expected:<<https://builds.apache.org/job/core-integration-testing-maven-3-trunk-jdk-1.6/ws/core-integration-testing-trunk/core-it-suite/target/test-classes/mng-3843/test-1/src/main/java>>
but was:</x1/jenkins/jenkins-slave/workspace/core-integration-testing-maven-3-trunk-jdk-1.6/core-integration-testing-trunk/core-it-suite/target/test-classes/mng-3843/test-1/src/main/java>
  testitMNG3827(org.apache.maven.it.MavenITmng3827PluginConfigTest): expected:<<https://builds.apache.org/job/core-integration-testing-maven-3-trunk-jdk-1.6/ws/core-integration-testing-trunk/core-it-suite/target/test-classes/mng-3827/pom.xml>>
but was:</x1/jenkins/jenkins-slave/workspace/core-integration-testing-maven-3-trunk-jdk-1.6/core-integration-testing-trunk/core-it-suite/target/test-classes/mng-3827/pom.xml>
  testitMNG3760(org.apache.maven.it.MavenITmng3760BaseUriPropertyTest): null expected:<file:/[home]/jenkins/jenkins-sla...>
but was:<file:/[x1]/jenkins/jenkins-sla...>
  testitMNG3760SystemPropertyOverride(org.apache.maven.it.MavenITmng3760BaseUriPropertyTest):
null expected:<file:/[home]/jenkins/jenkins-sla...> but was:<file:/[x1]/jenkins/jenkins-sla...>
  testitMNG3747(org.apache.maven.it.MavenITmng3747PrefixedPathExpressionTest): null expected:<path
is: /[home]/jenkins/jenkins-sla...> but was:<path is: /[x1]/jenkins/jenkins-sla...>
  testitMNG3475(org.apache.maven.it.MavenITmng3475BaseAlignedDirTest): expected:<<https://builds.apache.org/job/core-integration-testing-maven-3-trunk-jdk-1.6/ws/core-integration-testing-trunk/core-it-suite/target/test-classes/mng-3475/target>>
but was:</x1/jenkins/jenkins-slave/workspace/core-integration-testing-maven-3-trunk-jdk-1.6/core-integration-testing-trunk/core-it-suite/target/test-classes/mng-3475/target>
  testitMNG2201(org.apache.maven.it.MavenITmng2201PluginConfigInterpolationTest): expected:<<https://builds.apache.org/job/core-integration-testing-maven-3-trunk-jdk-1.6/ws/core-integration-testing-trunk/core-it-suite/target/test-classes/mng-2201/target>>
but was:</x1/jenkins/jenkins-slave/workspace/core-integration-testing-maven-3-trunk-jdk-1.6/core-integration-testing-trunk/core-it-suite/target/test-classes/mng-2201/target>
  testitMNG680(org.apache.maven.it.MavenITmng0680ParentBasedirTest): expected:<<https://builds.apache.org/job/core-integration-testing-maven-3-trunk-jdk-1.6/ws/core-integration-testing-trunk/core-it-suite/target/test-classes/mng-0680/subproject>>
but was:</x1/jenkins/jenkins-slave/workspace/core-integration-testing-maven-3-trunk-jdk-1.6/core-integration-testing-trunk/core-it-suite/target/test-classes/mng-0680/subproject>

Tests run: 699, Failures: 11, Errors: 0, Skipped: 0

[INFO] ------------------------------------------------------------------------
[INFO] Reactor Summary:
[INFO] 
[INFO] Maven Core ITs .................................... SUCCESS [1.004s]
[INFO] Maven IT Support .................................. SUCCESS [0.018s]
[INFO] Maven IT :: Plugins ............................... SUCCESS [0.016s]
[INFO] Maven IT Plugin :: Active Collection .............. SUCCESS [1.933s]
[INFO] Maven IT Plugin :: Ant-Based ...................... SUCCESS [0.687s]
[INFO] Maven IT Plugin :: Artifact ....................... SUCCESS [1.120s]
[INFO] Maven IT Plugin :: Class Loader :: Dependency A ... SUCCESS [0.575s]
[INFO] Maven IT Plugin :: Class Loader :: Dependency B ... SUCCESS [0.643s]
[INFO] Maven IT Plugin :: Class Loader :: Dependency C ... SUCCESS [0.203s]
[INFO] Maven IT Plugin :: Class Loader ................... SUCCESS [1.285s]
[INFO] Maven IT Plugin :: Class Loader :: Aggregator ..... SUCCESS [0.023s]
[INFO] Maven IT Plugin :: Configuration .................. SUCCESS [1.094s]
[INFO] Maven IT Plugin :: Context Passing ................ SUCCESS [0.538s]
[INFO] Maven ITs :: Core Plugin Stubs .................... SUCCESS [0.012s]
[INFO] Maven IT Clean Plugin Stub ........................ SUCCESS [0.615s]
[INFO] Maven IT Compiler Plugin Stub ..................... SUCCESS [0.635s]
[INFO] Maven IT Deploy Plugin Stub ....................... SUCCESS [0.573s]
[INFO] Maven IT EAR Plugin Stub .......................... SUCCESS [0.526s]
[INFO] Maven IT EJB Plugin Stub .......................... SUCCESS [0.633s]
[INFO] Maven IT Install Plugin Stub ...................... SUCCESS [0.509s]
[INFO] Maven IT JAR Plugin Stub .......................... SUCCESS [0.492s]
[INFO] Maven IT Javadoc Plugin Stub ...................... SUCCESS [0.491s]
[INFO] Maven IT Plugin Plugin Stub ....................... SUCCESS [0.526s]
[INFO] Maven IT RAR Plugin Stub .......................... SUCCESS [0.615s]
[INFO] Maven IT Resources Plugin Stub .................... SUCCESS [0.617s]
[INFO] Maven IT Site Plugin Stub ......................... SUCCESS [0.692s]
[INFO] Maven IT Source Plugin Stub ....................... SUCCESS [0.614s]
[INFO] Maven IT Surefire Plugin Stub ..................... SUCCESS [0.642s]
[INFO] Maven IT WAR Plugin Stub .......................... SUCCESS [0.546s]
[INFO] Maven IT Plugin :: Dependency Collection .......... SUCCESS [1.077s]
[INFO] Maven IT Plugin :: Dependency Resolution .......... SUCCESS [0.748s]
[INFO] Maven IT Plugin :: Expression ..................... SUCCESS [1.305s]
[INFO] Maven IT Plugin :: Error Mojos .................... SUCCESS [0.730s]
[INFO] Maven IT Component ................................ SUCCESS [1.698s]
[INFO] Maven IT Plugin :: Extension Consumer ............. SUCCESS [0.588s]
[INFO] Maven IT Plugin :: Extension Provider ............. SUCCESS [0.729s]
[INFO] Maven IT Plugin :: Fork ........................... SUCCESS [0.695s]
[INFO] Maven IT Plugin :: Invalid Descriptor ............. SUCCESS [0.675s]
[INFO] Maven IT Plugin :: Log File ....................... SUCCESS [0.532s]
[INFO] Maven IT Plugin :: No Default Component ........... SUCCESS [0.553s]
[INFO] Maven IT Plugin :: No Project ..................... SUCCESS [0.610s]
[INFO] Maven IT Plugin :: Online ......................... SUCCESS [0.582s]
[INFO] Maven IT Plugin :: Optional Mojos ................. SUCCESS [0.618s]
[INFO] Maven IT Plugin :: Packaging ...................... SUCCESS [0.491s]
[INFO] Maven IT Plugin :: Parameter Implementation ....... SUCCESS [0.727s]
[INFO] Maven IT Plugin :: Plugin Dependency .............. SUCCESS [0.690s]
[INFO] Maven IT Plugin :: Project ........................ SUCCESS [1.042s]
[INFO] Maven IT Helper Library ........................... SUCCESS [1.657s]
[INFO] Maven IT Plugin :: Project Interpolation .......... SUCCESS [0.919s]
[INFO] Maven IT Plugin :: Setter ......................... SUCCESS [0.713s]
[INFO] Maven IT Plugin :: Singleton Component ............ SUCCESS [0.799s]
[INFO] Maven IT Plugin :: Site ........................... SUCCESS [0.833s]
[INFO] Maven IT Plugin :: Toolchain ...................... SUCCESS [2.469s]
[INFO] Maven IT Plugin :: Touch .......................... SUCCESS [0.813s]
[INFO] Maven IT Plugin :: Uses Properties Plugin ......... SUCCESS [0.527s]
[INFO] Maven IT Plugin :: Uses Wagon Plugin .............. SUCCESS [0.946s]
[INFO] Maven IT Plugin :: This plugin should contain the mojos needed by all tests.  SUCCESS
[0.548s]
[INFO] Maven IT Plugin :: Plexus Utils 1.1 ............... SUCCESS [0.758s]
[INFO] Maven IT Plugin :: Plexus Utils New ............... SUCCESS [0.988s]
[INFO] Maven IT Plugin :: Plexus Component API ........... SUCCESS [0.838s]
[INFO] Maven IT Plugin :: Log4J Client ................... SUCCESS [0.720s]
[INFO] maven-it-plugin-extension1 ........................ SUCCESS [0.555s]
[INFO] maven-it-plugin-extension2 ........................ SUCCESS [0.450s]
[INFO] Maven IT Toolchain ................................ SUCCESS [1.131s]
[INFO] Maven IT Wagon .................................... SUCCESS [1.139s]
[INFO] Maven IT Support Artifacts ........................ SUCCESS [0.743s]
[INFO] Maven IT Extension ................................ SUCCESS [0.460s]
[INFO] Maven ITs ......................................... FAILURE [17:15.807s]
[INFO] ------------------------------------------------------------------------
[INFO] BUILD FAILURE
[INFO] ------------------------------------------------------------------------
[INFO] Total time: 18:07.073s
[INFO] Finished at: Mon Aug 01 14:12:12 UTC 2011
[INFO] Final Memory: 75M/752M
[INFO] ------------------------------------------------------------------------
[ERROR] Failed to execute goal org.apache.maven.plugins:maven-surefire-plugin:2.9:test (default-test)
on project core-it-suite: There are test failures.
[ERROR] 
[ERROR] Please refer to <https://builds.apache.org/job/core-integration-testing-maven-3-trunk-jdk-1.6/ws/core-integration-testing-trunk/core-it-suite/target/surefire-reports>
for the individual test results.
[ERROR] -> [Help 1]
[ERROR] 
[ERROR] To see the full stack trace of the errors, re-run Maven with the -e switch.
[ERROR] Re-run Maven using the -X switch to enable full debug logging.
[ERROR] 
[ERROR] For more information about the errors and possible solutions, please read the following
articles:
[ERROR] [Help 1] http://cwiki.apache.org/confluence/display/MAVEN/MojoFailureException
[ERROR] 
[ERROR] After correcting the problems, you can resume the build with the command
[ERROR]   mvn <goals> -rf :core-it-suite
Recording test results


Mime
View raw message