maven-notifications mailing list archives

Site index · List index
Message view « Date » · « Thread »
Top « Date » · « Thread »
From Apache Jenkins Server <jenk...@builds.apache.org>
Subject Build failed in Jenkins: maven-site-plugin-3.x » JDK 1.5 (latest),Solaris #133
Date Mon, 01 Aug 2011 10:11:07 GMT
See <https://builds.apache.org/job/maven-site-plugin-3.x/./jdk=JDK%201.5%20(latest),label=Solaris/133/changes>

Changes:

[hboutemy] improved documentation:
o added the error message if unsupported protocol is used
o fixed XML snippet indentation

[dennisl] [maven-release-plugin] prepare for next development iteration

[dennisl] [maven-release-plugin] prepare release maven-site-plugin-3.0

[dennisl] o Use released (staged) version of maven-reporting-exec.

[hboutemy] code simplification

[hboutemy] improved error message when site deploy protocol is unavailable
Submitted by: Lukas Theussl (yes, we found a solution matching our complementary expectations)

[hboutemy] make the IT fail if the assert is wrong since invoker.properties already skips
the IT for Maven < 2.2.2

------------------------------------------
[...truncated 1200 lines...]
A         src/it/MSITE-550/pom.xml
A         src/it/MSITE-354
AU        src/it/MSITE-354/verify.bsh
AU        src/it/MSITE-354/goals.txt
AU        src/it/MSITE-354/pom.xml
A         src/it/site-inheritance
A         src/it/site-inheritance/verify.bsh
A         src/it/site-inheritance/aggregator
A         src/it/site-inheritance/aggregator/pom.xml
A         src/it/site-inheritance/inheriting_child
A         src/it/site-inheritance/inheriting_child/src
A         src/it/site-inheritance/inheriting_child/src/site
A         src/it/site-inheritance/inheriting_child/src/site/site.xml
A         src/it/site-inheritance/inheriting_child/src/site/apt
A         src/it/site-inheritance/inheriting_child/src/site/apt/index.apt
A         src/it/site-inheritance/inheriting_child/pom.xml
A         src/it/site-inheritance/module
A         src/it/site-inheritance/module/src
A         src/it/site-inheritance/module/src/site
A         src/it/site-inheritance/module/src/site/site.xml
A         src/it/site-inheritance/module/src/site/apt
A         src/it/site-inheritance/module/src/site/apt/index.apt
A         src/it/site-inheritance/module/pom.xml
A         src/it/site-inheritance/invoker.properties
A         src/it/site-inheritance/parent
A         src/it/site-inheritance/parent/src
A         src/it/site-inheritance/parent/src/site
A         src/it/site-inheritance/parent/src/site/site.xml
A         src/it/site-inheritance/parent/src/site/apt
A         src/it/site-inheritance/parent/src/site/apt/index.apt
A         src/it/site-inheritance/parent/pom.xml
A         src/it/site-inheritance/child_and_module
A         src/it/site-inheritance/child_and_module/src
A         src/it/site-inheritance/child_and_module/src/site
A         src/it/site-inheritance/child_and_module/src/site/site.xml
A         src/it/site-inheritance/child_and_module/src/site/apt
A         src/it/site-inheritance/child_and_module/src/site/apt/index.apt
A         src/it/site-inheritance/child_and_module/pom.xml
A         src/it/site-inheritance/pom.xml
A         src/it/site-inheritance/sub_module
A         src/it/site-inheritance/sub_module/src
A         src/it/site-inheritance/sub_module/src/site
A         src/it/site-inheritance/sub_module/src/site/site.xml
A         src/it/site-inheritance/sub_module/src/site/apt
A         src/it/site-inheritance/sub_module/src/site/apt/index.apt
A         src/it/site-inheritance/sub_module/pom.xml
A         src/it/surefire-report
A         src/it/surefire-report/src
A         src/it/surefire-report/src/test
A         src/it/surefire-report/src/test/java
A         src/it/surefire-report/src/test/java/org
A         src/it/surefire-report/src/test/java/org/apache
A         src/it/surefire-report/src/test/java/org/apache/maven
A         src/it/surefire-report/src/test/java/org/apache/maven/plugins
A         src/it/surefire-report/src/test/java/org/apache/maven/plugins/site
A         src/it/surefire-report/src/test/java/org/apache/maven/plugins/site/its
AU        src/it/surefire-report/src/test/java/org/apache/maven/plugins/site/its/AppTest.java
A         src/it/surefire-report/src/main
A         src/it/surefire-report/src/main/java
A         src/it/surefire-report/src/main/java/org
A         src/it/surefire-report/src/main/java/org/apache
A         src/it/surefire-report/src/main/java/org/apache/maven
A         src/it/surefire-report/src/main/java/org/apache/maven/plugins
A         src/it/surefire-report/src/main/java/org/apache/maven/plugins/site
A         src/it/surefire-report/src/main/java/org/apache/maven/plugins/site/its
AU        src/it/surefire-report/src/main/java/org/apache/maven/plugins/site/its/App.java
A         src/it/surefire-report/verify.groovy
AU        src/it/surefire-report/pom.xml
A         src/it/MSITE-537
A         src/it/MSITE-537/verify.bsh
A         src/it/MSITE-537/invoker.properties
A         src/it/MSITE-537/parent
A         src/it/MSITE-537/parent/pom.xml
A         src/it/MSITE-537/pom.xml
A         src/it/MSITE-456
A         src/it/MSITE-456/verify.bsh
A         src/it/MSITE-456/child
A         src/it/MSITE-456/child/pom.xml
A         src/it/MSITE-456/pom.xml
A         src/it/MSITE-159
A         src/it/MSITE-159/verify.bsh
A         src/it/MSITE-159/src
A         src/it/MSITE-159/src/site
A         src/it/MSITE-159/src/site/site.xml
A         src/it/MSITE-159/src/site/apt
A         src/it/MSITE-159/src/site/apt/index.apt
A         src/it/MSITE-159/invoker.properties
A         src/it/MSITE-159/pom.xml
A         src/it/MSITE-458
A         src/it/MSITE-458/verify.bsh
A         src/it/MSITE-458/first
A         src/it/MSITE-458/first/pom.xml
A         src/it/MSITE-458/src
A         src/it/MSITE-458/src/site
A         src/it/MSITE-458/src/site/site.xml
A         src/it/MSITE-458/src/site/apt
A         src/it/MSITE-458/src/site/apt/index.apt
A         src/it/MSITE-458/invoker.properties
A         src/it/MSITE-458/pom.xml
A         src/it/MSITE-458/second
A         src/it/MSITE-458/second/pom.xml
AU        src/it/settings.xml
A         src/it/site-stage-deploy
A         src/it/site-stage-deploy/verify.bsh
A         src/it/site-stage-deploy/plugins
A         src/it/site-stage-deploy/plugins/maven-rocks-plugin
A         src/it/site-stage-deploy/plugins/maven-rocks-plugin/pom.xml
A         src/it/site-stage-deploy/plugins/plugins
A         src/it/site-stage-deploy/plugins/plugins/pom.xml
A         src/it/site-stage-deploy/plugins/pom.xml
A         src/it/site-stage-deploy/invoker.properties
A         src/it/site-stage-deploy/pom.xml
A         src/it/site-stage-deploy/pom
A         src/it/site-stage-deploy/pom/pom.xml
A         src/it/empty-report-set
AU        src/it/empty-report-set/verify.bsh
AU        src/it/empty-report-set/pom.xml
A         src/it/MSITE-497
A         src/it/MSITE-497/apps
A         src/it/MSITE-497/apps/app
A         src/it/MSITE-497/apps/app/src
A         src/it/MSITE-497/apps/app/src/test
A         src/it/MSITE-497/apps/app/src/test/java
A         src/it/MSITE-497/apps/app/src/test/java/org
A         src/it/MSITE-497/apps/app/src/test/java/org/apache
A         src/it/MSITE-497/apps/app/src/test/java/org/apache/maven
AU        src/it/MSITE-497/apps/app/src/test/java/org/apache/maven/AppTest.java
A         src/it/MSITE-497/apps/app/src/main
A         src/it/MSITE-497/apps/app/src/main/java
A         src/it/MSITE-497/apps/app/src/main/java/org
A         src/it/MSITE-497/apps/app/src/main/java/org/apache
A         src/it/MSITE-497/apps/app/src/main/java/org/apache/maven
AU        src/it/MSITE-497/apps/app/src/main/java/org/apache/maven/App.java
AU        src/it/MSITE-497/apps/app/pom.xml
AU        src/it/MSITE-497/apps/pom.xml
A         src/it/MSITE-497/src
A         src/it/MSITE-497/src/site
AU        src/it/MSITE-497/src/site/site.xml
A         src/it/MSITE-497/src/site/apt
AU        src/it/MSITE-497/src/site/apt/index.apt
AU        src/it/MSITE-497/invoker.properties
AU        src/it/MSITE-497/pom.xml
A         src/it/report-changes-generation
AU        src/it/report-changes-generation/verify.bsh
A         src/it/report-changes-generation/src
A         src/it/report-changes-generation/src/changes
AU        src/it/report-changes-generation/src/changes/changes.xml
AU        src/it/report-changes-generation/pom.xml
A         src/it/site-jar
AU        src/it/site-jar/verify.bsh
AU        src/it/site-jar/goals.txt
A         src/it/site-jar/src
A         src/it/site-jar/src/main
A         src/it/site-jar/src/main/java
A         src/it/site-jar/src/main/java/foo
AU        src/it/site-jar/src/main/java/foo/App.java
A         src/it/site-jar/src/site
AU        src/it/site-jar/src/site/site.xml
A         src/it/site-jar/src/site/apt
AU        src/it/site-jar/src/site/apt/download.apt.vm
A         src/it/site-jar/src/site/xdoc
A         src/it/site-jar/src/site/xdoc/releases
AU        src/it/site-jar/src/site/xdoc/releases/release1.6.xml
AU        src/it/site-jar/src/site/xdoc/releases/release1.6.3.xml
AU        src/it/site-jar/src/site/xdoc/index.xml
AU        src/it/site-jar/pom.xml
AU        pom.xml
 U        .
At revision 1152724
[locks-and-latches] Checking to see if we really have the locks
[locks-and-latches] Have all the locks, build can start
[Solaris] $ /home/hudson/hudson-slave/tools/Maven_3.0.3/bin/mvn -Dlabel=Solaris "-Djdk=JDK
1.5 (latest)" clean verify -Prun-its -fae -B -U -e -V
Apache Maven 3.0.3 (r1075438; 2011-02-28 12:31:09-0500)
Maven home: /home/hudson/hudson-slave/tools/Maven_3.0.3
Java version: 1.5.0_22, vendor: Sun Microsystems Inc.
Java home: /zonestorage/hudson/home/hudson/tools/java/jdk1.5.0_22/jre
Default locale: en, platform encoding: ISO646-US
OS name: "sunos", version: "5.10", arch: "x86", family: "unix"
[INFO] Error stacktraces are turned on.
[INFO] Scanning for projects...
[INFO]                                                                         
[INFO] ------------------------------------------------------------------------
[INFO] Building Maven Site Plugin 3 3.1-SNAPSHOT
[INFO] ------------------------------------------------------------------------
Downloading: http://repo1.maven.org/maven2/org/apache/maven/reporting/maven-reporting-exec/1.0.1/maven-reporting-exec-1.0.1.pom
[WARNING] The POM for org.apache.maven.reporting:maven-reporting-exec:jar:1.0.1 is missing,
no dependency information available
Downloading: http://repository.apache.org/snapshots/org/apache/jackrabbit/jackrabbit-jcr-commons/1.5.1-SNAPSHOT/maven-metadata.xml
Downloading: http://repository.apache.org/snapshots/org/apache/jackrabbit/jackrabbit-jcr-commons/1.5.1-SNAPSHOT/maven-metadata.xml
Downloading: http://repo1.maven.org/maven2/org/apache/maven/reporting/maven-reporting-exec/1.0.1/maven-reporting-exec-1.0.1.jar
[INFO] ------------------------------------------------------------------------
[INFO] BUILD FAILURE
[INFO] ------------------------------------------------------------------------
[INFO] Total time: 6.864s
[INFO] Finished at: Mon Aug 01 06:11:06 EDT 2011
[INFO] Final Memory: 7M/162M
[INFO] ------------------------------------------------------------------------
[ERROR] Failed to execute goal on project maven-site-plugin: Could not resolve dependencies
for project org.apache.maven.plugins:maven-site-plugin:maven-plugin:3.1-SNAPSHOT: Could not
find artifact org.apache.maven.reporting:maven-reporting-exec:jar:1.0.1 in central (http://repo1.maven.org/maven2)
-> [Help 1]
org.apache.maven.lifecycle.LifecycleExecutionException: Failed to execute goal on project
maven-site-plugin: Could not resolve dependencies for project org.apache.maven.plugins:maven-site-plugin:maven-plugin:3.1-SNAPSHOT:
Could not find artifact org.apache.maven.reporting:maven-reporting-exec:jar:1.0.1 in central
(http://repo1.maven.org/maven2)
	at org.apache.maven.lifecycle.internal.LifecycleDependencyResolver.getDependencies(LifecycleDependencyResolver.java:196)
	at org.apache.maven.lifecycle.internal.LifecycleDependencyResolver.resolveProjectDependencies(LifecycleDependencyResolver.java:108)
	at org.apache.maven.lifecycle.internal.MojoExecutor.ensureDependenciesAreResolved(MojoExecutor.java:258)
	at org.apache.maven.lifecycle.internal.MojoExecutor.execute(MojoExecutor.java:201)
	at org.apache.maven.lifecycle.internal.MojoExecutor.execute(MojoExecutor.java:153)
	at org.apache.maven.lifecycle.internal.MojoExecutor.execute(MojoExecutor.java:145)
	at org.apache.maven.lifecycle.internal.LifecycleModuleBuilder.buildProject(LifecycleModuleBuilder.java:84)
	at org.apache.maven.lifecycle.internal.LifecycleModuleBuilder.buildProject(LifecycleModuleBuilder.java:59)
	at org.apache.maven.lifecycle.internal.LifecycleStarter.singleThreadedBuild(LifecycleStarter.java:183)
	at org.apache.maven.lifecycle.internal.LifecycleStarter.execute(LifecycleStarter.java:161)
	at org.apache.maven.DefaultMaven.doExecute(DefaultMaven.java:319)
	at org.apache.maven.DefaultMaven.execute(DefaultMaven.java:156)
	at org.apache.maven.cli.MavenCli.execute(MavenCli.java:537)
	at org.apache.maven.cli.MavenCli.doMain(MavenCli.java:196)
	at org.apache.maven.cli.MavenCli.main(MavenCli.java:141)
	at sun.reflect.NativeMethodAccessorImpl.invoke0(Native Method)
	at sun.reflect.NativeMethodAccessorImpl.invoke(NativeMethodAccessorImpl.java:39)
	at sun.reflect.DelegatingMethodAccessorImpl.invoke(DelegatingMethodAccessorImpl.java:25)
	at java.lang.reflect.Method.invoke(Method.java:592)
	at org.codehaus.plexus.classworlds.launcher.Launcher.launchEnhanced(Launcher.java:290)
	at org.codehaus.plexus.classworlds.launcher.Launcher.launch(Launcher.java:230)
	at org.codehaus.plexus.classworlds.launcher.Launcher.mainWithExitCode(Launcher.java:409)
	at org.codehaus.plexus.classworlds.launcher.Launcher.main(Launcher.java:352)
Caused by: org.apache.maven.project.DependencyResolutionException: Could not resolve dependencies
for project org.apache.maven.plugins:maven-site-plugin:maven-plugin:3.1-SNAPSHOT: Could not
find artifact org.apache.maven.reporting:maven-reporting-exec:jar:1.0.1 in central (http://repo1.maven.org/maven2)
	at org.apache.maven.project.DefaultProjectDependenciesResolver.resolve(DefaultProjectDependenciesResolver.java:170)
	at org.apache.maven.lifecycle.internal.LifecycleDependencyResolver.getDependencies(LifecycleDependencyResolver.java:171)
	... 22 more
Caused by: org.sonatype.aether.resolution.DependencyResolutionException: Could not find artifact
org.apache.maven.reporting:maven-reporting-exec:jar:1.0.1 in central (http://repo1.maven.org/maven2)
	at org.sonatype.aether.impl.internal.DefaultRepositorySystem.resolveDependencies(DefaultRepositorySystem.java:412)
	at org.apache.maven.project.DefaultProjectDependenciesResolver.resolve(DefaultProjectDependenciesResolver.java:164)
	... 23 more
Caused by: org.sonatype.aether.resolution.ArtifactResolutionException: Could not find artifact
org.apache.maven.reporting:maven-reporting-exec:jar:1.0.1 in central (http://repo1.maven.org/maven2)
	at org.sonatype.aether.impl.internal.DefaultArtifactResolver.resolve(DefaultArtifactResolver.java:541)
	at org.sonatype.aether.impl.internal.DefaultArtifactResolver.resolveArtifacts(DefaultArtifactResolver.java:220)
	at org.sonatype.aether.impl.internal.DefaultRepositorySystem.resolveDependencies(DefaultRepositorySystem.java:395)
	... 24 more
Caused by: org.sonatype.aether.transfer.ArtifactNotFoundException: Could not find artifact
org.apache.maven.reporting:maven-reporting-exec:jar:1.0.1 in central (http://repo1.maven.org/maven2)
	at org.sonatype.aether.connector.wagon.WagonRepositoryConnector$4.wrap(WagonRepositoryConnector.java:945)
	at org.sonatype.aether.connector.wagon.WagonRepositoryConnector$4.wrap(WagonRepositoryConnector.java:940)
	at org.sonatype.aether.connector.wagon.WagonRepositoryConnector$GetTask.flush(WagonRepositoryConnector.java:695)
	at org.sonatype.aether.connector.wagon.WagonRepositoryConnector$GetTask.flush(WagonRepositoryConnector.java:689)
	at org.sonatype.aether.connector.wagon.WagonRepositoryConnector.get(WagonRepositoryConnector.java:445)
	at org.sonatype.aether.impl.internal.DefaultArtifactResolver.resolve(DefaultArtifactResolver.java:460)
	... 26 more
[ERROR] 
[ERROR] Re-run Maven using the -X switch to enable full debug logging.
[ERROR] 
[ERROR] For more information about the errors and possible solutions, please read the following
articles:
[ERROR] [Help 1] http://cwiki.apache.org/confluence/display/MAVEN/DependencyResolutionException
[locks-and-latches] Releasing all the locks
[locks-and-latches] All the locks released


Mime
View raw message