maven-notifications mailing list archives

Site index · List index
Message view « Date » · « Thread »
Top « Date » · « Thread »
From Apache Jenkins Server <jenk...@builds.apache.org>
Subject Build failed in Jenkins: maven-plugins-ITs-3.x #127
Date Fri, 22 Jul 2011 22:02:46 GMT
See <https://builds.apache.org/job/maven-plugins-ITs-3.x/127/changes>

Changes:

[dennisl] Change the name.

------------------------------------------
[...truncated 8324 lines...]
[ERROR] 
[ERROR] Re-run Maven using the -X switch to enable full debug logging.
[ERROR] 
[ERROR] For more information about the errors and possible solutions, please read the following
articles:
[ERROR] [Help 1] http://cwiki.apache.org/confluence/display/MAVEN/PluginResolutionException

  test(org.apache.maven.plugin.resources.remote.it.IT_BadDependencyPoms): Exit code was non-zero:
1; command line and log = 
/home/hudson/hudson-slave/tools/Maven_3.0.3/bin/mvn -e --batch-mode -Dit.dir=<https://builds.apache.org/job/maven-plugins-ITs-3.x/ws/maven-remote-resources-plugin/target/test-classes/bad-dependency-poms>
-Dmaven.repo.local=<https://builds.apache.org/job/maven-plugins-ITs-3.x/ws/.repository>
org.apache.maven.plugins:maven-clean-plugin:clean generate-resources
[INFO] Error stacktraces are turned on.
[INFO] Scanning for projects...
[INFO]                                                                         
[INFO] ------------------------------------------------------------------------
[INFO] Building test 1.0
[INFO] ------------------------------------------------------------------------
[WARNING] The POM for org.apache.maven.plugins:maven-remote-resources-plugin:jar:1.3-SNAPSHOT
is missing, no dependency information available
[INFO] ------------------------------------------------------------------------
[INFO] BUILD FAILURE
[INFO] ------------------------------------------------------------------------
[INFO] Total time: 0.215s
[INFO] Finished at: Fri Jul 22 22:01:23 UTC 2011
[INFO] Final Memory: 2M/133M
[INFO] ------------------------------------------------------------------------
[ERROR] Plugin org.apache.maven.plugins:maven-remote-resources-plugin:1.3-SNAPSHOT or one
of its dependencies could not be resolved: Failed to read artifact descriptor for org.apache.maven.plugins:maven-remote-resources-plugin:jar:1.3-SNAPSHOT:
Could not find artifact org.apache.maven.plugins:maven-remote-resources-plugin:pom:1.3-SNAPSHOT
-> [Help 1]
org.apache.maven.plugin.PluginResolutionException: Plugin org.apache.maven.plugins:maven-remote-resources-plugin:1.3-SNAPSHOT
or one of its dependencies could not be resolved: Failed to read artifact descriptor for org.apache.maven.plugins:maven-remote-resources-plugin:jar:1.3-SNAPSHOT
	at org.apache.maven.plugin.internal.DefaultPluginDependenciesResolver.resolve(DefaultPluginDependenciesResolver.java:129)
	at org.apache.maven.plugin.internal.DefaultMavenPluginManager.getPluginDescriptor(DefaultMavenPluginManager.java:142)
	at org.apache.maven.plugin.internal.DefaultMavenPluginManager.getMojoDescriptor(DefaultMavenPluginManager.java:261)
	at org.apache.maven.plugin.DefaultBuildPluginManager.getMojoDescriptor(DefaultBuildPluginManager.java:185)
	at org.apache.maven.lifecycle.internal.DefaultLifecycleExecutionPlanCalculator.calculateLifecycleMappings(DefaultLifecycleExecutionPlanCalculator.java:280)
	at org.apache.maven.lifecycle.internal.DefaultLifecycleExecutionPlanCalculator.calculateMojoExecutions(DefaultLifecycleExecutionPlanCalculator.java:193)
	at org.apache.maven.lifecycle.internal.DefaultLifecycleExecutionPlanCalculator.calculateExecutionPlan(DefaultLifecycleExecutionPlanCalculator.java:112)
	at org.apache.maven.lifecycle.internal.DefaultLifecycleExecutionPlanCalculator.calculateExecutionPlan(DefaultLifecycleExecutionPlanCalculator.java:129)
	at org.apache.maven.lifecycle.internal.BuilderCommon.resolveBuildPlan(BuilderCommon.java:92)
	at org.apache.maven.lifecycle.internal.LifecycleModuleBuilder.buildProject(LifecycleModuleBuilder.java:81)
	at org.apache.maven.lifecycle.internal.LifecycleModuleBuilder.buildProject(LifecycleModuleBuilder.java:59)
	at org.apache.maven.lifecycle.internal.LifecycleStarter.singleThreadedBuild(LifecycleStarter.java:183)
	at org.apache.maven.lifecycle.internal.LifecycleStarter.execute(LifecycleStarter.java:161)
	at org.apache.maven.DefaultMaven.doExecute(DefaultMaven.java:319)
	at org.apache.maven.DefaultMaven.execute(DefaultMaven.java:156)
	at org.apache.maven.cli.MavenCli.execute(MavenCli.java:537)
	at org.apache.maven.cli.MavenCli.doMain(MavenCli.java:196)
	at org.apache.maven.cli.MavenCli.main(MavenCli.java:141)
	at sun.reflect.NativeMethodAccessorImpl.invoke0(Native Method)
	at sun.reflect.NativeMethodAccessorImpl.invoke(NativeMethodAccessorImpl.java:39)
	at sun.reflect.DelegatingMethodAccessorImpl.invoke(DelegatingMethodAccessorImpl.java:25)
	at java.lang.reflect.Method.invoke(Method.java:592)
	at org.codehaus.plexus.classworlds.launcher.Launcher.launchEnhanced(Launcher.java:290)
	at org.codehaus.plexus.classworlds.launcher.Launcher.launch(Launcher.java:230)
	at org.codehaus.plexus.classworlds.launcher.Launcher.mainWithExitCode(Launcher.java:409)
	at org.codehaus.plexus.classworlds.launcher.Launcher.main(Launcher.java:352)
Caused by: org.sonatype.aether.resolution.ArtifactDescriptorException: Failed to read artifact
descriptor for org.apache.maven.plugins:maven-remote-resources-plugin:jar:1.3-SNAPSHOT
	at org.apache.maven.repository.internal.DefaultArtifactDescriptorReader.loadPom(DefaultArtifactDescriptorReader.java:282)
	at org.apache.maven.repository.internal.DefaultArtifactDescriptorReader.readArtifactDescriptor(DefaultArtifactDescriptorReader.java:172)
	at org.sonatype.aether.impl.internal.DefaultRepositorySystem.readArtifactDescriptor(DefaultRepositorySystem.java:316)
	at org.apache.maven.plugin.internal.DefaultPluginDependenciesResolver.resolve(DefaultPluginDependenciesResolver.java:115)
	... 25 more
Caused by: org.sonatype.aether.resolution.ArtifactResolutionException: Could not find artifact
org.apache.maven.plugins:maven-remote-resources-plugin:pom:1.3-SNAPSHOT
	at org.sonatype.aether.impl.internal.DefaultArtifactResolver.resolve(DefaultArtifactResolver.java:541)
	at org.sonatype.aether.impl.internal.DefaultArtifactResolver.resolveArtifacts(DefaultArtifactResolver.java:220)
	at org.sonatype.aether.impl.internal.DefaultArtifactResolver.resolveArtifact(DefaultArtifactResolver.java:197)
	at org.apache.maven.repository.internal.DefaultArtifactDescriptorReader.loadPom(DefaultArtifactDescriptorReader.java:267)
	... 28 more
Caused by: org.sonatype.aether.transfer.ArtifactNotFoundException: Could not find artifact
org.apache.maven.plugins:maven-remote-resources-plugin:pom:1.3-SNAPSHOT
	at org.sonatype.aether.impl.internal.DefaultArtifactResolver.resolve(DefaultArtifactResolver.java:531)
	... 31 more
[ERROR] 
[ERROR] Re-run Maven using the -X switch to enable full debug logging.
[ERROR] 
[ERROR] For more information about the errors and possible solutions, please read the following
articles:
[ERROR] [Help 1] http://cwiki.apache.org/confluence/display/MAVEN/PluginResolutionException

  test(org.apache.maven.plugin.resources.remote.it.IT_GenerateFromBundle): Exit code was non-zero:
1; command line and log = 
/home/hudson/hudson-slave/tools/Maven_3.0.3/bin/mvn -e --batch-mode -Dmaven.repo.local=<https://builds.apache.org/job/maven-plugins-ITs-3.x/ws/.repository>
org.apache.maven.plugins:maven-clean-plugin:clean generate-resources
[INFO] Error stacktraces are turned on.
[INFO] Scanning for projects...
[INFO]                                                                         
[INFO] ------------------------------------------------------------------------
[INFO] Building generate-from-bundle 1.3-SNAPSHOT
[INFO] ------------------------------------------------------------------------
[WARNING] The POM for org.apache.maven.plugins:maven-remote-resources-plugin:jar:1.3-SNAPSHOT
is missing, no dependency information available
[INFO] ------------------------------------------------------------------------
[INFO] BUILD FAILURE
[INFO] ------------------------------------------------------------------------
[INFO] Total time: 0.206s
[INFO] Finished at: Fri Jul 22 22:01:24 UTC 2011
[INFO] Final Memory: 2M/133M
[INFO] ------------------------------------------------------------------------
[ERROR] Plugin org.apache.maven.plugins:maven-remote-resources-plugin:1.3-SNAPSHOT or one
of its dependencies could not be resolved: Failed to read artifact descriptor for org.apache.maven.plugins:maven-remote-resources-plugin:jar:1.3-SNAPSHOT:
Could not find artifact org.apache.maven.plugins:maven-remote-resources-plugin:pom:1.3-SNAPSHOT
-> [Help 1]
org.apache.maven.plugin.PluginResolutionException: Plugin org.apache.maven.plugins:maven-remote-resources-plugin:1.3-SNAPSHOT
or one of its dependencies could not be resolved: Failed to read artifact descriptor for org.apache.maven.plugins:maven-remote-resources-plugin:jar:1.3-SNAPSHOT
	at org.apache.maven.plugin.internal.DefaultPluginDependenciesResolver.resolve(DefaultPluginDependenciesResolver.java:129)
	at org.apache.maven.plugin.internal.DefaultMavenPluginManager.getPluginDescriptor(DefaultMavenPluginManager.java:142)
	at org.apache.maven.plugin.internal.DefaultMavenPluginManager.getMojoDescriptor(DefaultMavenPluginManager.java:261)
	at org.apache.maven.plugin.DefaultBuildPluginManager.getMojoDescriptor(DefaultBuildPluginManager.java:185)
	at org.apache.maven.lifecycle.internal.DefaultLifecycleExecutionPlanCalculator.calculateLifecycleMappings(DefaultLifecycleExecutionPlanCalculator.java:280)
	at org.apache.maven.lifecycle.internal.DefaultLifecycleExecutionPlanCalculator.calculateMojoExecutions(DefaultLifecycleExecutionPlanCalculator.java:193)
	at org.apache.maven.lifecycle.internal.DefaultLifecycleExecutionPlanCalculator.calculateExecutionPlan(DefaultLifecycleExecutionPlanCalculator.java:112)
	at org.apache.maven.lifecycle.internal.DefaultLifecycleExecutionPlanCalculator.calculateExecutionPlan(DefaultLifecycleExecutionPlanCalculator.java:129)
	at org.apache.maven.lifecycle.internal.BuilderCommon.resolveBuildPlan(BuilderCommon.java:92)
	at org.apache.maven.lifecycle.internal.LifecycleModuleBuilder.buildProject(LifecycleModuleBuilder.java:81)
	at org.apache.maven.lifecycle.internal.LifecycleModuleBuilder.buildProject(LifecycleModuleBuilder.java:59)
	at org.apache.maven.lifecycle.internal.LifecycleStarter.singleThreadedBuild(LifecycleStarter.java:183)
	at org.apache.maven.lifecycle.internal.LifecycleStarter.execute(LifecycleStarter.java:161)
	at org.apache.maven.DefaultMaven.doExecute(DefaultMaven.java:319)
	at org.apache.maven.DefaultMaven.execute(DefaultMaven.java:156)
	at org.apache.maven.cli.MavenCli.execute(MavenCli.java:537)
	at org.apache.maven.cli.MavenCli.doMain(MavenCli.java:196)
	at org.apache.maven.cli.MavenCli.main(MavenCli.java:141)
	at sun.reflect.NativeMethodAccessorImpl.invoke0(Native Method)
	at sun.reflect.NativeMethodAccessorImpl.invoke(NativeMethodAccessorImpl.java:39)
	at sun.reflect.DelegatingMethodAccessorImpl.invoke(DelegatingMethodAccessorImpl.java:25)
	at java.lang.reflect.Method.invoke(Method.java:592)
	at org.codehaus.plexus.classworlds.launcher.Launcher.launchEnhanced(Launcher.java:290)
	at org.codehaus.plexus.classworlds.launcher.Launcher.launch(Launcher.java:230)
	at org.codehaus.plexus.classworlds.launcher.Launcher.mainWithExitCode(Launcher.java:409)
	at org.codehaus.plexus.classworlds.launcher.Launcher.main(Launcher.java:352)
Caused by: org.sonatype.aether.resolution.ArtifactDescriptorException: Failed to read artifact
descriptor for org.apache.maven.plugins:maven-remote-resources-plugin:jar:1.3-SNAPSHOT
	at org.apache.maven.repository.internal.DefaultArtifactDescriptorReader.loadPom(DefaultArtifactDescriptorReader.java:282)
	at org.apache.maven.repository.internal.DefaultArtifactDescriptorReader.readArtifactDescriptor(DefaultArtifactDescriptorReader.java:172)
	at org.sonatype.aether.impl.internal.DefaultRepositorySystem.readArtifactDescriptor(DefaultRepositorySystem.java:316)
	at org.apache.maven.plugin.internal.DefaultPluginDependenciesResolver.resolve(DefaultPluginDependenciesResolver.java:115)
	... 25 more
Caused by: org.sonatype.aether.resolution.ArtifactResolutionException: Could not find artifact
org.apache.maven.plugins:maven-remote-resources-plugin:pom:1.3-SNAPSHOT
	at org.sonatype.aether.impl.internal.DefaultArtifactResolver.resolve(DefaultArtifactResolver.java:541)
	at org.sonatype.aether.impl.internal.DefaultArtifactResolver.resolveArtifacts(DefaultArtifactResolver.java:220)
	at org.sonatype.aether.impl.internal.DefaultArtifactResolver.resolveArtifact(DefaultArtifactResolver.java:197)
	at org.apache.maven.repository.internal.DefaultArtifactDescriptorReader.loadPom(DefaultArtifactDescriptorReader.java:267)
	... 28 more
Caused by: org.sonatype.aether.transfer.ArtifactNotFoundException: Could not find artifact
org.apache.maven.plugins:maven-remote-resources-plugin:pom:1.3-SNAPSHOT
	at org.sonatype.aether.impl.internal.DefaultArtifactResolver.resolve(DefaultArtifactResolver.java:531)
	... 31 more
[ERROR] 
[ERROR] Re-run Maven using the -X switch to enable full debug logging.
[ERROR] 
[ERROR] For more information about the errors and possible solutions, please read the following
articles:
[ERROR] [Help 1] http://cwiki.apache.org/confluence/display/MAVEN/PluginResolutionException


Tests run: 8, Failures: 0, Errors: 8, Skipped: 0

[INFO] ..SUCCESS (11.8 s)
[INFO] Building: skip-run/pom.xml
[INFO] ..SUCCESS (2.7 s)
[INFO] Building: pom-filtering-reactor/pom.xml
[INFO] ..SUCCESS (4.2 s)
[INFO] Building: local-repo-isolated/pom.xml
[INFO] ..SUCCESS (4.6 s)
[INFO] Building: invocation-multiple/pom.xml
[INFO] ..SUCCESS (18.8 s)
[INFO] Building: staging-pom/pom.xml
[INFO] ..SUCCESS (2.7 s)
[INFO] Building: script-global-vars/pom.xml
[INFO] ..SUCCESS (6.2 s)
[INFO] Building: integration-test-never-fails/pom.xml
[INFO] ..SUCCESS (3.9 s)
[INFO] Building: project-cloning/pom.xml
[INFO] ..SUCCESS (6.6 s)
[INFO] Building: pom-less-invocation/pom.xml
[INFO] ..SUCCESS (3.0 s)
[INFO] Building: local-repo-path/pom.xml
[INFO] ..SUCCESS (5.9 s)
[INFO] Building: invocation-offline/pom.xml
[INFO] ..SUCCESS (5.6 s)
[INFO] Building: settings-auto-exclude/pom.xml
[INFO] ..SUCCESS (4.0 s)
[INFO] Building: staging-reactor/pom.xml
[INFO] ..SUCCESS (4.9 s)
[INFO] Building: script-accessibility/pom.xml
[INFO] ..SUCCESS (6.4 s)
[INFO] -------------------------------------------------
[INFO] Build Summary:
[INFO]   Passed: 40, Failed: 0, Errors: 0, Skipped: 0
[INFO] -------------------------------------------------
[INFO] 
[INFO] --- maven-install-plugin:2.3.1:install (default-install) @ maven-invoker-plugin ---
[INFO] Installing <https://builds.apache.org/job/maven-plugins-ITs-3.x/ws/maven-invoker-plugin/target/maven-invoker-plugin-1.6-SNAPSHOT.jar>
to <https://builds.apache.org/job/maven-plugins-ITs-3.x/ws/.repository/org/apache/maven/plugins/maven-invoker-plugin/1.6-SNAPSHOT/maven-invoker-plugin-1.6-SNAPSHOT.jar>
[INFO] Installing <https://builds.apache.org/job/maven-plugins-ITs-3.x/ws/maven-invoker-plugin/pom.xml>
to <https://builds.apache.org/job/maven-plugins-ITs-3.x/ws/.repository/org/apache/maven/plugins/maven-invoker-plugin/1.6-SNAPSHOT/maven-invoker-plugin-1.6-SNAPSHOT.pom>
[INFO] ------------------------------------------------------------------------
[INFO] Reactor Summary:
[INFO] 
[INFO] Maven Plugins ..................................... SUCCESS [29.850s]
[INFO] Maven ACR Plugin .................................. SUCCESS [54.251s]
[INFO] Maven Ant Plugin .................................. SUCCESS [2:07.739s]
[INFO] Maven AntRun Plugin ............................... SUCCESS [1:02.937s]
[INFO] Maven Eclipse Plugin .............................. SUCCESS [12:39.033s]
[INFO] Maven Assembly Plugin ............................. SUCCESS [15:44.113s]
[INFO] Maven Changelog Plugin ............................ SUCCESS [1:17.589s]
[INFO] Maven Changes Report Plugin ....................... SUCCESS [1:33.899s]
[INFO] Maven Checkstyle Plugin ........................... SUCCESS [1:40.166s]
[INFO] Maven Clean Plugin ................................ SUCCESS [22.636s]
[INFO] Maven Compiler Plugin ............................. SUCCESS [28.672s]
[INFO] Maven Dependency Plugin ........................... SUCCESS [2:18.075s]
[INFO] Maven Deploy Plugin ............................... SUCCESS [1:42.674s]
[INFO] Maven DOAP Plugin ................................. SUCCESS [23.372s]
[INFO] Maven Documentation Checker Plugin ................ SUCCESS [8.230s]
[INFO] Maven EAR Plugin .................................. SUCCESS [3:40.807s]
[INFO] Maven EJB Plugin .................................. SUCCESS [30.818s]
[INFO] Maven GPG Plugin .................................. SUCCESS [32.857s]
[INFO] Maven Help Plugin ................................. SUCCESS [47.822s]
[INFO] Maven IDEA Plugin ................................. SUCCESS [7.348s]
[INFO] Maven Install Plugin .............................. SUCCESS [58.312s]
[INFO] Maven JAR Plugin .................................. SUCCESS [1:28.726s]
[INFO] Maven Jarsigner Plugin ............................ SUCCESS [43.169s]
[INFO] Maven Javadoc Plugin .............................. FAILURE [8:41.581s]
[INFO] Maven Linkcheck Plugin ............................ SUCCESS [2.956s]
[INFO] Maven One Plugin .................................. SUCCESS [2.642s]
[INFO] Maven Patch Plugin ................................ SUCCESS [15.512s]
[INFO] Maven PDF Plugin .................................. SUCCESS [33.966s]
[INFO] Maven PMD Plugin .................................. SUCCESS [56.070s]
[INFO] Maven RAR Plugin .................................. SUCCESS [10.411s]
[INFO] Maven Reactor Plugin .............................. SUCCESS [3.054s]
[INFO] Maven Repository Plugin ........................... FAILURE [23.583s]
[INFO] Maven Resources Plugin ............................ SUCCESS [1:11.134s]
[INFO] Maven Shade Plugin ................................ SUCCESS [2:40.152s]
[INFO] Maven Site Plugin 2 ............................... SUCCESS [3:20.072s]
[INFO] Maven Source Plugin ............................... SUCCESS [34.728s]
[INFO] Maven Stage Plugin ................................ SUCCESS [1.889s]
[INFO] Maven Toolchains Plugin ........................... SUCCESS [1.418s]
[INFO] Maven Verifier Plugin ............................. SUCCESS [9.453s]
[INFO] Maven WAR Plugin .................................. SUCCESS [1:20.803s]
[INFO] Maven Invoker Plugin .............................. SUCCESS [4:49.566s]
[INFO] Maven Project Info Reports Plugin ................. SUCCESS [2:36.945s]
[INFO] Maven Remote Resources Plugin ..................... FAILURE [34.284s]
[INFO] Maven Plugins Aggregator .......................... SUCCESS [0.046s]
[INFO] ------------------------------------------------------------------------
[INFO] BUILD FAILURE
[INFO] ------------------------------------------------------------------------
[INFO] Total time: 27:51.264s (Wall Clock)
[INFO] Finished at: Fri Jul 22 22:02:45 UTC 2011
[INFO] Final Memory: 62M/1000M
[INFO] ------------------------------------------------------------------------
[WARNING] The requested profile "apache.snapshots" could not be activated because it does
not exist.
[ERROR] Failed to execute goal org.apache.maven.plugins:maven-surefire-plugin:2.7.2:test (integration-tests)
on project maven-repository-plugin: There are test failures.
[ERROR] 
[ERROR] Please refer to <https://builds.apache.org/job/maven-plugins-ITs-3.x/ws/maven-repository-plugin/target/surefire-reports>
for the individual test results.
[ERROR] -> [Help 1]
[ERROR] Failed to execute goal org.apache.maven.plugins:maven-invoker-plugin:1.5:run (integration-test)
on project maven-javadoc-plugin: 1 build failed. -> [Help 1]
[ERROR] Failed to execute goal org.apache.maven.plugins:maven-surefire-plugin:2.7.2:test (integration-tests)
on project maven-remote-resources-plugin: There are test failures.
[ERROR] 
[ERROR] Please refer to <https://builds.apache.org/job/maven-plugins-ITs-3.x/ws/maven-remote-resources-plugin/target/surefire-reports>
for the individual test results.
[ERROR] -> [Help 1]
[ERROR] 
[ERROR] To see the full stack trace of the errors, re-run Maven with the -e switch.
[ERROR] Re-run Maven using the -X switch to enable full debug logging.
[ERROR] 
[ERROR] For more information about the errors and possible solutions, please read the following
articles:
[ERROR] [Help 1] http://cwiki.apache.org/confluence/display/MAVEN/MojoFailureException
[ERROR] 
[ERROR] After correcting the problems, you can resume the build with the command
[ERROR]   mvn <goals> -rf :maven-repository-plugin


Mime
View raw message