maven-notifications mailing list archives

Site index · List index
Message view « Date » · « Thread »
Top « Date » · « Thread »
From Apache Jenkins Server <jenk...@builds.apache.org>
Subject Build failed in Jenkins: maven-plugins-ITs-3.x #141
Date Wed, 27 Jul 2011 22:30:13 GMT
See <https://builds.apache.org/job/maven-plugins-ITs-3.x/141/changes>

Changes:

[rfscholte] Fix MECLIPSE-692: .project contains projects which were skipped during reactor
build
Introducing maven-invoker-plugin

------------------------------------------
[...truncated 9142 lines...]
	at org.apache.maven.cli.MavenCli.main(MavenCli.java:141)
	at sun.reflect.NativeMethodAccessorImpl.invoke0(Native Method)
	at sun.reflect.NativeMethodAccessorImpl.invoke(NativeMethodAccessorImpl.java:39)
	at sun.reflect.DelegatingMethodAccessorImpl.invoke(DelegatingMethodAccessorImpl.java:25)
	at java.lang.reflect.Method.invoke(Method.java:592)
	at org.codehaus.plexus.classworlds.launcher.Launcher.launchEnhanced(Launcher.java:290)
	at org.codehaus.plexus.classworlds.launcher.Launcher.launch(Launcher.java:230)
	at org.codehaus.plexus.classworlds.launcher.Launcher.mainWithExitCode(Launcher.java:409)
	at org.codehaus.plexus.classworlds.launcher.Launcher.main(Launcher.java:352)
Caused by: org.sonatype.aether.resolution.ArtifactDescriptorException: Failed to read artifact
descriptor for org.apache.maven.plugins:maven-remote-resources-plugin:jar:1.3-SNAPSHOT
	at org.apache.maven.repository.internal.DefaultArtifactDescriptorReader.loadPom(DefaultArtifactDescriptorReader.java:282)
	at org.apache.maven.repository.internal.DefaultArtifactDescriptorReader.readArtifactDescriptor(DefaultArtifactDescriptorReader.java:172)
	at org.sonatype.aether.impl.internal.DefaultRepositorySystem.readArtifactDescriptor(DefaultRepositorySystem.java:316)
	at org.apache.maven.plugin.internal.DefaultPluginDependenciesResolver.resolve(DefaultPluginDependenciesResolver.java:115)
	... 25 more
Caused by: org.sonatype.aether.resolution.ArtifactResolutionException: Could not find artifact
org.apache.maven.plugins:maven-remote-resources-plugin:pom:1.3-SNAPSHOT
	at org.sonatype.aether.impl.internal.DefaultArtifactResolver.resolve(DefaultArtifactResolver.java:541)
	at org.sonatype.aether.impl.internal.DefaultArtifactResolver.resolveArtifacts(DefaultArtifactResolver.java:220)
	at org.sonatype.aether.impl.internal.DefaultArtifactResolver.resolveArtifact(DefaultArtifactResolver.java:197)
	at org.apache.maven.repository.internal.DefaultArtifactDescriptorReader.loadPom(DefaultArtifactDescriptorReader.java:267)
	... 28 more
Caused by: org.sonatype.aether.transfer.ArtifactNotFoundException: Could not find artifact
org.apache.maven.plugins:maven-remote-resources-plugin:pom:1.3-SNAPSHOT
	at org.sonatype.aether.impl.internal.DefaultArtifactResolver.resolve(DefaultArtifactResolver.java:531)
	... 31 more
[ERROR] 
[ERROR] Re-run Maven using the -X switch to enable full debug logging.
[ERROR] 
[ERROR] For more information about the errors and possible solutions, please read the following
articles:
[ERROR] [Help 1] http://cwiki.apache.org/confluence/display/MAVEN/PluginResolutionException

  test(org.apache.maven.plugin.resources.remote.it.IT_FilterLocalOverride): Exit code was
non-zero: 1; command line and log = 
/home/jenkins/jenkins-slave/tools/Maven_3.0.3/bin/mvn -e --batch-mode -Dmaven.repo.local=<https://builds.apache.org/job/maven-plugins-ITs-3.x/ws/.repository>
org.apache.maven.plugins:maven-clean-plugin:clean generate-resources
[INFO] Error stacktraces are turned on.
[INFO] Scanning for projects...
[INFO]                                                                         
[INFO] ------------------------------------------------------------------------
[INFO] Building filter-local-override 1.3-SNAPSHOT
[INFO] ------------------------------------------------------------------------
[WARNING] The POM for org.apache.maven.plugins:maven-remote-resources-plugin:jar:1.3-SNAPSHOT
is missing, no dependency information available
[INFO] ------------------------------------------------------------------------
[INFO] BUILD FAILURE
[INFO] ------------------------------------------------------------------------
[INFO] Total time: 0.204s
[INFO] Finished at: Wed Jul 27 22:27:41 UTC 2011
[INFO] Final Memory: 2M/133M
[INFO] ------------------------------------------------------------------------
[ERROR] Plugin org.apache.maven.plugins:maven-remote-resources-plugin:1.3-SNAPSHOT or one
of its dependencies could not be resolved: Failed to read artifact descriptor for org.apache.maven.plugins:maven-remote-resources-plugin:jar:1.3-SNAPSHOT:
Could not find artifact org.apache.maven.plugins:maven-remote-resources-plugin:pom:1.3-SNAPSHOT
-> [Help 1]
org.apache.maven.plugin.PluginResolutionException: Plugin org.apache.maven.plugins:maven-remote-resources-plugin:1.3-SNAPSHOT
or one of its dependencies could not be resolved: Failed to read artifact descriptor for org.apache.maven.plugins:maven-remote-resources-plugin:jar:1.3-SNAPSHOT
	at org.apache.maven.plugin.internal.DefaultPluginDependenciesResolver.resolve(DefaultPluginDependenciesResolver.java:129)
	at org.apache.maven.plugin.internal.DefaultMavenPluginManager.getPluginDescriptor(DefaultMavenPluginManager.java:142)
	at org.apache.maven.plugin.internal.DefaultMavenPluginManager.getMojoDescriptor(DefaultMavenPluginManager.java:261)
	at org.apache.maven.plugin.DefaultBuildPluginManager.getMojoDescriptor(DefaultBuildPluginManager.java:185)
	at org.apache.maven.lifecycle.internal.DefaultLifecycleExecutionPlanCalculator.calculateLifecycleMappings(DefaultLifecycleExecutionPlanCalculator.java:280)
	at org.apache.maven.lifecycle.internal.DefaultLifecycleExecutionPlanCalculator.calculateMojoExecutions(DefaultLifecycleExecutionPlanCalculator.java:193)
	at org.apache.maven.lifecycle.internal.DefaultLifecycleExecutionPlanCalculator.calculateExecutionPlan(DefaultLifecycleExecutionPlanCalculator.java:112)
	at org.apache.maven.lifecycle.internal.DefaultLifecycleExecutionPlanCalculator.calculateExecutionPlan(DefaultLifecycleExecutionPlanCalculator.java:129)
	at org.apache.maven.lifecycle.internal.BuilderCommon.resolveBuildPlan(BuilderCommon.java:92)
	at org.apache.maven.lifecycle.internal.LifecycleModuleBuilder.buildProject(LifecycleModuleBuilder.java:81)
	at org.apache.maven.lifecycle.internal.LifecycleModuleBuilder.buildProject(LifecycleModuleBuilder.java:59)
	at org.apache.maven.lifecycle.internal.LifecycleStarter.singleThreadedBuild(LifecycleStarter.java:183)
	at org.apache.maven.lifecycle.internal.LifecycleStarter.execute(LifecycleStarter.java:161)
	at org.apache.maven.DefaultMaven.doExecute(DefaultMaven.java:319)
	at org.apache.maven.DefaultMaven.execute(DefaultMaven.java:156)
	at org.apache.maven.cli.MavenCli.execute(MavenCli.java:537)
	at org.apache.maven.cli.MavenCli.doMain(MavenCli.java:196)
	at org.apache.maven.cli.MavenCli.main(MavenCli.java:141)
	at sun.reflect.NativeMethodAccessorImpl.invoke0(Native Method)
	at sun.reflect.NativeMethodAccessorImpl.invoke(NativeMethodAccessorImpl.java:39)
	at sun.reflect.DelegatingMethodAccessorImpl.invoke(DelegatingMethodAccessorImpl.java:25)
	at java.lang.reflect.Method.invoke(Method.java:592)
	at org.codehaus.plexus.classworlds.launcher.Launcher.launchEnhanced(Launcher.java:290)
	at org.codehaus.plexus.classworlds.launcher.Launcher.launch(Launcher.java:230)
	at org.codehaus.plexus.classworlds.launcher.Launcher.mainWithExitCode(Launcher.java:409)
	at org.codehaus.plexus.classworlds.launcher.Launcher.main(Launcher.java:352)
Caused by: org.sonatype.aether.resolution.ArtifactDescriptorException: Failed to read artifact
descriptor for org.apache.maven.plugins:maven-remote-resources-plugin:jar:1.3-SNAPSHOT
	at org.apache.maven.repository.internal.DefaultArtifactDescriptorReader.loadPom(DefaultArtifactDescriptorReader.java:282)
	at org.apache.maven.repository.internal.DefaultArtifactDescriptorReader.readArtifactDescriptor(DefaultArtifactDescriptorReader.java:172)
	at org.sonatype.aether.impl.internal.DefaultRepositorySystem.readArtifactDescriptor(DefaultRepositorySystem.java:316)
	at org.apache.maven.plugin.internal.DefaultPluginDependenciesResolver.resolve(DefaultPluginDependenciesResolver.java:115)
	... 25 more
Caused by: org.sonatype.aether.resolution.ArtifactResolutionException: Could not find artifact
org.apache.maven.plugins:maven-remote-resources-plugin:pom:1.3-SNAPSHOT
	at org.sonatype.aether.impl.internal.DefaultArtifactResolver.resolve(DefaultArtifactResolver.java:541)
	at org.sonatype.aether.impl.internal.DefaultArtifactResolver.resolveArtifacts(DefaultArtifactResolver.java:220)
	at org.sonatype.aether.impl.internal.DefaultArtifactResolver.resolveArtifact(DefaultArtifactResolver.java:197)
	at org.apache.maven.repository.internal.DefaultArtifactDescriptorReader.loadPom(DefaultArtifactDescriptorReader.java:267)
	... 28 more
Caused by: org.sonatype.aether.transfer.ArtifactNotFoundException: Could not find artifact
org.apache.maven.plugins:maven-remote-resources-plugin:pom:1.3-SNAPSHOT
	at org.sonatype.aether.impl.internal.DefaultArtifactResolver.resolve(DefaultArtifactResolver.java:531)
	... 31 more
[ERROR] 
[ERROR] Re-run Maven using the -X switch to enable full debug logging.
[ERROR] 
[ERROR] For more information about the errors and possible solutions, please read the following
articles:
[ERROR] [Help 1] http://cwiki.apache.org/confluence/display/MAVEN/PluginResolutionException


Tests run: 8, Failures: 0, Errors: 8, Skipped: 0

[INFO]                                                                         
[INFO] ------------------------------------------------------------------------
[INFO] Building Maven Plugins Aggregator 1-SNAPSHOT
[INFO] ------------------------------------------------------------------------
[WARNING] *****************************************************************
[WARNING] * Your build is requesting parallel execution, but project      *
[WARNING] * contains the following plugin(s) that are not marked as       *
[WARNING] * @threadSafe to support parallel building.                     *
[WARNING] * While this /may/ work fine, please look for plugin updates    *
[WARNING] * and/or request plugins be made thread-safe.                   *
[WARNING] * If reporting an issue, report it against the plugin in        *
[WARNING] * question, not against maven-core                              *
[WARNING] *****************************************************************
[WARNING] The following plugins are not marked @threadSafe in Maven Plugins Aggregator:
[WARNING] org.apache.maven.plugins:maven-remote-resources-plugin:1.1
[WARNING] *****************************************************************
[INFO] 
[INFO] --- maven-clean-plugin:2.4.1:clean (default-clean) @ maven-plugins-aggregator ---
[INFO] Deleting <https://builds.apache.org/job/maven-plugins-ITs-3.x/ws/target>
[INFO] 
[INFO] --- maven-remote-resources-plugin:1.1:process (default) @ maven-plugins-aggregator
---
[INFO] 
[INFO] --- maven-install-plugin:2.3.1:install (default-install) @ maven-plugins-aggregator
---
[INFO] Installing <https://builds.apache.org/job/maven-plugins-ITs-3.x/ws/pom.xml> to
<https://builds.apache.org/job/maven-plugins-ITs-3.x/ws/.repository/org/apache/maven/plugins/maven-plugins-aggregator/1-SNAPSHOT/maven-plugins-aggregator-1-SNAPSHOT.pom>
[INFO] ..SUCCESS (4.2 s)
[INFO] Building: invoker-report/pom.xml
[INFO] ..SUCCESS (10.8 s)
[INFO] Building: fail-ignore-with-verify/pom.xml
[INFO] ..SUCCESS (23.6 s)
[INFO] Building: MSITE-322/pom.xml
[INFO] ..SUCCESS (4.2 s)
[INFO] Building: fail-postbuild/pom.xml
[INFO] ..SUCCESS (4.3 s)
[INFO] Building: selector-conditions/pom.xml
[INFO] ..SUCCESS (7.5 s)
[INFO] Building: MSITE-550/pom.xml
[INFO] ..SUCCESS (3.1 s)
[INFO] Building: MSITE-458/pom.xml
[INFO] ..SUCCESS (6.9 s)
[INFO] Building: invocation-multiple/pom.xml
[INFO] ..SUCCESS (9.9 s)
[INFO] Building: MSITE-312/pom.xml
[INFO] ..SUCCESS (4.6 s)
[INFO] Building: MSITE-507/pom.xml
[INFO] ..SUCCESS (19.7 s)
[INFO] Building: selector-scripts/pom.xml
[INFO] ..SUCCESS (5.6 s)
[INFO] Building: fail-build/pom.xml
[INFO] ..SUCCESS (4.2 s)
[INFO] Building: staging-pom/pom.xml
[INFO] ..SUCCESS (2.7 s)
[INFO] -------------------------------------------------
[INFO] Build Summary:
[INFO]   Passed: 40, Failed: 0, Errors: 0, Skipped: 0
[INFO] -------------------------------------------------
[INFO] 
[INFO] --- maven-install-plugin:2.3.1:install (default-install) @ maven-invoker-plugin ---
[INFO] Installing <https://builds.apache.org/job/maven-plugins-ITs-3.x/ws/maven-invoker-plugin/target/maven-invoker-plugin-1.6-SNAPSHOT.jar>
to <https://builds.apache.org/job/maven-plugins-ITs-3.x/ws/.repository/org/apache/maven/plugins/maven-invoker-plugin/1.6-SNAPSHOT/maven-invoker-plugin-1.6-SNAPSHOT.jar>
[INFO] Installing <https://builds.apache.org/job/maven-plugins-ITs-3.x/ws/maven-invoker-plugin/pom.xml>
to <https://builds.apache.org/job/maven-plugins-ITs-3.x/ws/.repository/org/apache/maven/plugins/maven-invoker-plugin/1.6-SNAPSHOT/maven-invoker-plugin-1.6-SNAPSHOT.pom>
[INFO] ..SUCCESS (92.7 s)
[INFO] Building: no-version/pom.xml
[INFO] ..SUCCESS (4.9 s)
[INFO] Building: MSITE-456/pom.xml
[INFO] ..SUCCESS (4.5 s)
[INFO] Building: surefire-report/pom.xml
[INFO] ..SUCCESS (6.6 s)
[INFO] -------------------------------------------------
[INFO] Build Summary:
[INFO]   Passed: 35, Failed: 0, Errors: 0, Skipped: 1
[INFO] -------------------------------------------------
[INFO] 
[INFO] --- maven-install-plugin:2.3.1:install (default-install) @ maven-site-plugin ---
[INFO] Installing <https://builds.apache.org/job/maven-plugins-ITs-3.x/ws/maven-site-plugin/target/maven-site-plugin-3.0-SNAPSHOT.jar>
to <https://builds.apache.org/job/maven-plugins-ITs-3.x/ws/.repository/org/apache/maven/plugins/maven-site-plugin/3.0-SNAPSHOT/maven-site-plugin-3.0-SNAPSHOT.jar>
[INFO] Installing <https://builds.apache.org/job/maven-plugins-ITs-3.x/ws/maven-site-plugin/dependency-reduced-pom.xml>
to <https://builds.apache.org/job/maven-plugins-ITs-3.x/ws/.repository/org/apache/maven/plugins/maven-site-plugin/3.0-SNAPSHOT/maven-site-plugin-3.0-SNAPSHOT.pom>
[INFO] ------------------------------------------------------------------------
[INFO] Reactor Summary:
[INFO] 
[INFO] Maven Plugins ..................................... SUCCESS [2.761s]
[INFO] Maven ACR Plugin .................................. SUCCESS [23.233s]
[INFO] Maven Ant Plugin .................................. SUCCESS [1:35.401s]
[INFO] Maven AntRun Plugin ............................... SUCCESS [58.983s]
[INFO] Maven Eclipse Plugin .............................. SUCCESS [12:45.144s]
[INFO] Maven Assembly Plugin ............................. SUCCESS [15:15.850s]
[INFO] Maven Changelog Plugin ............................ SUCCESS [1:01.087s]
[INFO] Maven Changes Report Plugin ....................... SUCCESS [1:07.364s]
[INFO] Maven Checkstyle Plugin ........................... SUCCESS [1:33.824s]
[INFO] Maven Clean Plugin ................................ SUCCESS [23.481s]
[INFO] Maven Compiler Plugin ............................. SUCCESS [24.845s]
[INFO] Maven Dependency Plugin ........................... SUCCESS [2:29.611s]
[INFO] Maven Deploy Plugin ............................... SUCCESS [1:49.855s]
[INFO] Maven DOAP Plugin ................................. SUCCESS [26.483s]
[INFO] Maven Documentation Checker Plugin ................ SUCCESS [7.180s]
[INFO] Maven EAR Plugin .................................. SUCCESS [4:02.944s]
[INFO] Maven EJB Plugin .................................. SUCCESS [28.926s]
[INFO] Maven GPG Plugin .................................. SUCCESS [30.244s]
[INFO] Maven Help Plugin ................................. SUCCESS [1:05.267s]
[INFO] Maven IDEA Plugin ................................. SUCCESS [7.424s]
[INFO] Maven Install Plugin .............................. SUCCESS [56.340s]
[INFO] Maven JAR Plugin .................................. SUCCESS [1:23.102s]
[INFO] Maven Jarsigner Plugin ............................ SUCCESS [35.978s]
[INFO] Maven Javadoc Plugin .............................. FAILURE [5:08.402s]
[INFO] Maven Linkcheck Plugin ............................ SUCCESS [1.970s]
[INFO] Maven One Plugin .................................. SUCCESS [1.794s]
[INFO] Maven Patch Plugin ................................ FAILURE [12.783s]
[INFO] Maven PDF Plugin .................................. SUCCESS [24.822s]
[INFO] Maven PMD Plugin .................................. SUCCESS [49.719s]
[INFO] Maven RAR Plugin .................................. SUCCESS [7.287s]
[INFO] Maven Reactor Plugin .............................. SUCCESS [2.156s]
[INFO] Maven Repository Plugin ........................... FAILURE [19.178s]
[INFO] Maven Resources Plugin ............................ SUCCESS [1:00.135s]
[INFO] Maven Shade Plugin ................................ SUCCESS [2:23.591s]
[INFO] Maven Site Plugin 3 ............................... SUCCESS [8:38.972s]
[INFO] Maven Source Plugin ............................... SUCCESS [32.843s]
[INFO] Maven Stage Plugin ................................ SUCCESS [1.514s]
[INFO] Maven Toolchains Plugin ........................... SUCCESS [1.253s]
[INFO] Maven Verifier Plugin ............................. SUCCESS [8.772s]
[INFO] Maven WAR Plugin .................................. SUCCESS [1:08.926s]
[INFO] Maven Invoker Plugin .............................. SUCCESS [4:19.224s]
[INFO] Maven Project Info Reports Plugin ................. SUCCESS [2:11.507s]
[INFO] Maven Remote Resources Plugin ..................... FAILURE [33.011s]
[INFO] Maven Plugins Aggregator .......................... SUCCESS [0.024s]
[INFO] ------------------------------------------------------------------------
[INFO] BUILD FAILURE
[INFO] ------------------------------------------------------------------------
[INFO] Total time: 27:15.756s (Wall Clock)
[INFO] Finished at: Wed Jul 27 22:30:12 UTC 2011
[INFO] Final Memory: 65M/1005M
[INFO] ------------------------------------------------------------------------
[WARNING] The requested profile "apache.snapshots" could not be activated because it does
not exist.
[ERROR] Failed to execute goal org.apache.maven.plugins:maven-invoker-plugin:1.5:run (integration-test)
on project maven-patch-plugin: 4 builds failed. -> [Help 1]
[ERROR] Failed to execute goal org.apache.maven.plugins:maven-surefire-plugin:2.7.2:test (integration-tests)
on project maven-repository-plugin: There are test failures.
[ERROR] 
[ERROR] Please refer to <https://builds.apache.org/job/maven-plugins-ITs-3.x/ws/maven-repository-plugin/target/surefire-reports>
for the individual test results.
[ERROR] -> [Help 1]
[ERROR] Failed to execute goal org.apache.maven.plugins:maven-surefire-plugin:2.7.2:test (default-test)
on project maven-javadoc-plugin: There are test failures.
[ERROR] 
[ERROR] Please refer to <https://builds.apache.org/job/maven-plugins-ITs-3.x/ws/maven-javadoc-plugin/target/surefire-reports>
for the individual test results.
[ERROR] -> [Help 1]
[ERROR] Failed to execute goal org.apache.maven.plugins:maven-surefire-plugin:2.7.2:test (integration-tests)
on project maven-remote-resources-plugin: There are test failures.
[ERROR] 
[ERROR] Please refer to <https://builds.apache.org/job/maven-plugins-ITs-3.x/ws/maven-remote-resources-plugin/target/surefire-reports>
for the individual test results.
[ERROR] -> [Help 1]
[ERROR] 
[ERROR] To see the full stack trace of the errors, re-run Maven with the -e switch.
[ERROR] Re-run Maven using the -X switch to enable full debug logging.
[ERROR] 
[ERROR] For more information about the errors and possible solutions, please read the following
articles:
[ERROR] [Help 1] http://cwiki.apache.org/confluence/display/MAVEN/MojoFailureException
[ERROR] 
[ERROR] After correcting the problems, you can resume the build with the command
[ERROR]   mvn <goals> -rf :maven-patch-plugin


Mime
View raw message