maven-notifications mailing list archives

Site index · List index
Message view « Date » · « Thread »
Top « Date » · « Thread »
From Apache Jenkins Server <jenk...@builds.apache.org>
Subject Build failed in Jenkins: maven-plugins-ITs-2.x #214
Date Thu, 30 Jun 2011 13:50:53 GMT
See <https://builds.apache.org/job/maven-plugins-ITs-2.x/214/changes>

Changes:

[bimargulies] [MASSEMBLY-562]: apply doc patch to refer to shade, while here fix some warnings
having to do with
the current APT format for link anchors.

------------------------------------------
[...truncated 6034 lines...]
Running org.apache.maven.plugin.war.WarOverlaysTest
[INFO] Building jar: <https://builds.apache.org/job/maven-plugins-ITs-2.x/ws/maven-war-plugin/target/test-overlays/overlay-full-1.war>
[INFO] Building jar: <https://builds.apache.org/job/maven-plugins-ITs-2.x/ws/maven-war-plugin/target/test-overlays/overlay-full-2.war>
[INFO] Building jar: <https://builds.apache.org/job/maven-plugins-ITs-2.x/ws/maven-war-plugin/target/test-overlays/overlay-full-3.war>
[INFO] Exploding webapp
[INFO] Assembling webapp [maven-war-plugin-test] in [<https://builds.apache.org/job/maven-plugins-ITs-2.x/ws/maven-war-plugin/target/test-classes/unit/waroverlays/no-overlay]>
[INFO] Processing war project
[INFO] Copying webapp resources [<https://builds.apache.org/job/maven-plugins-ITs-2.x/ws/maven-war-plugin/target/test-classes/unit/waroverlays/no-overlay-test-data/source]>
[INFO] Webapp assembled in [3 msecs]
[INFO] Building jar: <https://builds.apache.org/job/maven-plugins-ITs-2.x/ws/maven-war-plugin/target/test-overlays/overlay-one.war>
[INFO] Exploding webapp
[INFO] Assembling webapp [maven-war-plugin-test] in [<https://builds.apache.org/job/maven-plugins-ITs-2.x/ws/maven-war-plugin/target/test-classes/unit/waroverlays/default-overlay]>
[INFO] Processing war project
[INFO] Copying webapp resources [<https://builds.apache.org/job/maven-plugins-ITs-2.x/ws/maven-war-plugin/target/test-classes/unit/waroverlays/default-overlay-test-data/source]>
[INFO] Processing overlay [ id wartests:overlay-one]
[INFO] Webapp assembled in [6 msecs]
[INFO] Building jar: <https://builds.apache.org/job/maven-plugins-ITs-2.x/ws/maven-war-plugin/target/test-overlays/overlay-two.war>
[INFO] Exploding webapp
[INFO] Assembling webapp [maven-war-plugin-test] in [<https://builds.apache.org/job/maven-plugins-ITs-2.x/ws/maven-war-plugin/target/test-classes/unit/waroverlays/default-overlays]>
[INFO] Processing war project
[INFO] Copying webapp resources [<https://builds.apache.org/job/maven-plugins-ITs-2.x/ws/maven-war-plugin/target/test-classes/unit/waroverlays/default-overlays-test-data/source]>
[INFO] Processing overlay [ id wartests:overlay-one]
[INFO] Processing overlay [ id wartests:overlay-two]
[INFO] Webapp assembled in [10 msecs]
[INFO] Exploding webapp
[INFO] Assembling webapp [maven-war-plugin-test] in [<https://builds.apache.org/job/maven-plugins-ITs-2.x/ws/maven-war-plugin/target/test-classes/unit/waroverlays/scenario-one-default-settings]>
[INFO] Processing war project
[INFO] Copying webapp resources [<https://builds.apache.org/job/maven-plugins-ITs-2.x/ws/maven-war-plugin/target/test-classes/unit/waroverlays/scenario-one-default-settings-test-data/source]>
[INFO] Processing overlay [ id wartests:overlay-full-1]
[INFO] Processing overlay [ id wartests:overlay-full-2]
[INFO] Processing overlay [ id wartests:overlay-full-3]
[INFO] Webapp assembled in [32 msecs]
[INFO] Exploding webapp
[INFO] Assembling webapp [maven-war-plugin-test] in [<https://builds.apache.org/job/maven-plugins-ITs-2.x/ws/maven-war-plugin/target/test-classes/unit/waroverlays/scenario-one-overlay-settings]>
[INFO] Processing war project
[INFO] Copying webapp resources [<https://builds.apache.org/job/maven-plugins-ITs-2.x/ws/maven-war-plugin/target/test-classes/unit/waroverlays/scenario-one-overlay-settings-test-data/source]>
[INFO] Processing overlay [ id wartests:overlay-full-1]
[INFO] Processing overlay [ id wartests:overlay-full-2]
[INFO] Processing overlay [ id wartests:overlay-full-3]
[INFO] Webapp assembled in [31 msecs]
[INFO] Exploding webapp
[INFO] Assembling webapp [maven-war-plugin-test] in [<https://builds.apache.org/job/maven-plugins-ITs-2.x/ws/maven-war-plugin/target/test-classes/unit/waroverlays/scenario-one-full-settings]>
[INFO] Processing war project
[INFO] Copying webapp resources [<https://builds.apache.org/job/maven-plugins-ITs-2.x/ws/maven-war-plugin/target/test-classes/unit/waroverlays/scenario-one-full-settings-test-data/source]>
[INFO] Processing overlay [ id wartests:overlay-full-1]
[INFO] Processing overlay [ id wartests:overlay-full-2]
[INFO] Processing overlay [ id wartests:overlay-full-3]
[INFO] Webapp assembled in [31 msecs]
[INFO] Exploding webapp
[INFO] Assembling webapp [maven-war-plugin-test] in [<https://builds.apache.org/job/maven-plugins-ITs-2.x/ws/maven-war-plugin/target/test-classes/unit/waroverlays/overlays-includes-excludes-multiple-defs]>
[INFO] Processing overlay [ id wartests:overlay-full-3]
[INFO] Processing overlay [ id wartests:overlay-full-1]
[INFO] Processing overlay [ id wartests:overlay-full-3]
[INFO] Processing war project
[INFO] Copying webapp resources [<https://builds.apache.org/job/maven-plugins-ITs-2.x/ws/maven-war-plugin/target/test-classes/unit/waroverlays/overlays-includes-excludes-multiple-defs-test-data/source]>
[INFO] Processing overlay [ id wartests:overlay-full-2]
[INFO] Webapp assembled in [31 msecs]
[INFO] Exploding webapp
[INFO] Assembling webapp [maven-war-plugin-test] in [<https://builds.apache.org/job/maven-plugins-ITs-2.x/ws/maven-war-plugin/target/test-classes/unit/waroverlays/overlays-includes-excludes-multiple-defs2]>
[INFO] Processing overlay [ id wartests:overlay-full-3]
[INFO] Processing overlay [ id wartests:overlay-full-1]
[INFO] Processing overlay [ id wartests:overlay-full-3]
[INFO] Processing war project
[INFO] Copying webapp resources [<https://builds.apache.org/job/maven-plugins-ITs-2.x/ws/maven-war-plugin/target/test-classes/unit/waroverlays/overlays-includes-excludes-multiple-defs2-test-data/source]>
[INFO] Processing overlay [ id wartests:overlay-full-2]
[INFO] Webapp assembled in [30 msecs]
[INFO] Exploding webapp
[INFO] Assembling webapp [maven-war-plugin-test] in [<https://builds.apache.org/job/maven-plugins-ITs-2.x/ws/maven-war-plugin/target/test-classes/unit/waroverlays/cache-updated-overlay]>
[INFO] Processing war project
[INFO] Copying webapp resources [<https://builds.apache.org/job/maven-plugins-ITs-2.x/ws/maven-war-plugin/target/test-classes/unit/waroverlays/cache-updated-overlay-test-data/source]>
[INFO] Processing overlay [ id wartests:overlay-one]
[INFO] Processing overlay [ id wartests:overlay-two]
[INFO] Webapp assembled in [11 msecs]
[INFO] Exploding webapp
[INFO] Assembling webapp [maven-war-plugin-test] in [<https://builds.apache.org/job/maven-plugins-ITs-2.x/ws/maven-war-plugin/target/test-classes/unit/waroverlays/cache-updated-overlay]>
[INFO] Processing war project
[INFO] Copying webapp resources [<https://builds.apache.org/job/maven-plugins-ITs-2.x/ws/maven-war-plugin/target/test-classes/unit/waroverlays/cache-updated-overlay-test-data/source]>
[INFO] Processing overlay [ id wartests:overlay-two]
[INFO] File [index.jsp] belonged to overlay [wartests:overlay-one] so it will be overwritten.
[INFO] File [WEB-INF/web.xml] belonged to overlay [wartests:overlay-one] so it will be overwritten.
[INFO] Processing overlay [ id wartests:overlay-one]
[INFO] Webapp assembled in [7 msecs]
[INFO] Exploding webapp
[INFO] Assembling webapp [maven-war-plugin-test] in [<https://builds.apache.org/job/maven-plugins-ITs-2.x/ws/maven-war-plugin/target/test-classes/unit/waroverlays/cache-removed-overlay]>
[INFO] Processing war project
[INFO] Copying webapp resources [<https://builds.apache.org/job/maven-plugins-ITs-2.x/ws/maven-war-plugin/target/test-classes/unit/waroverlays/cache-removed-overlay-test-data/source]>
[INFO] Processing overlay [ id wartests:overlay-one]
[INFO] Processing overlay [ id wartests:overlay-two]
[INFO] Webapp assembled in [10 msecs]
[INFO] Exploding webapp
[INFO] Assembling webapp [maven-war-plugin-test] in [<https://builds.apache.org/job/maven-plugins-ITs-2.x/ws/maven-war-plugin/target/test-classes/unit/waroverlays/cache-removed-overlay]>
[WARNING] Dependency [Dependency {groupId=wartests, artifactId=overlay-one, version=0.0-Test,
type=war}] has been removed from the project. If it was included in the build as an overlay,
consider cleaning the target directory of the project (mvn clean)
[INFO] Processing war project
[INFO] Copying webapp resources [<https://builds.apache.org/job/maven-plugins-ITs-2.x/ws/maven-war-plugin/target/test-classes/unit/waroverlays/cache-removed-overlay-test-data/source]>
[INFO] Processing overlay [ id wartests:overlay-two]
[WARNING] File [index.jsp] belonged to overlay [wartests:overlay-one] which does not exist
anymore in the current project. It is recommended to invoke clean if the dependencies of the
project changed.
[WARNING] File [WEB-INF/web.xml] belonged to overlay [wartests:overlay-one] which does not
exist anymore in the current project. It is recommended to invoke clean if the dependencies
of the project changed.
[INFO] Webapp assembled in [4 msecs]
Tests run: 11, Failures: 0, Errors: 0, Skipped: 0, Time elapsed: 1.078 sec
Running org.apache.maven.plugin.war.WarManifestMojoTest
Tests run: 6, Failures: 0, Errors: 0, Skipped: 0, Time elapsed: 0.209 sec
Running org.apache.maven.plugin.war.WarExplodedMojoFilteringTest
[INFO] Exploding webapp
[INFO] Assembling webapp [maven-war-plugin-test] in [<https://builds.apache.org/job/maven-plugins-ITs-2.x/ws/maven-war-plugin/target/test-classes/unit/warexplodedmojo/test-dir/ExplodedWar_WithResourceFiltering]>
[INFO] Processing war project
[INFO] Copying webapp webResources [<https://builds.apache.org/job/maven-plugins-ITs-2.x/ws/maven-war-plugin/target/test-classes/unit/warexplodedmojo/test-dir/ExplodedWar_WithResourceFiltering-test-data/resources]>
to [<https://builds.apache.org/job/maven-plugins-ITs-2.x/ws/maven-war-plugin/target/test-classes/unit/warexplodedmojo/test-dir/ExplodedWar_WithResourceFiltering]>
[INFO] Copying webapp resources [<https://builds.apache.org/job/maven-plugins-ITs-2.x/ws/maven-war-plugin/target/test-classes/unit/warexplodedmojo/test-dir/ExplodedWar_WithResourceFiltering-test-data/source]>
[INFO] Webapp assembled in [35 msecs]
 line system_key_1=<https://builds.apache.org/job/maven-plugins-ITs-2.x/ws/maven-war-plugin>
 need <https://builds.apache.org/job/maven-plugins-ITs-2.x/ws/maven-war-plugin>
 line system_key_2=<https://builds.apache.org/job/maven-plugins-ITs-2.x/ws/maven-war-plugin>
[INFO] Exploding webapp
[INFO] Assembling webapp [maven-war-plugin-test] in [<https://builds.apache.org/job/maven-plugins-ITs-2.x/ws/maven-war-plugin/target/test-classes/unit/warexplodedmojo/test-dir/ExplodedWar_WithResourceFiltering]>
[INFO] Processing war project
[INFO] Copying webapp webResources [<https://builds.apache.org/job/maven-plugins-ITs-2.x/ws/maven-war-plugin/target/test-classes/unit/warexplodedmojo/test-dir/ExplodedWar_WithResourceFiltering-test-data/resources]>
to [<https://builds.apache.org/job/maven-plugins-ITs-2.x/ws/maven-war-plugin/target/test-classes/unit/warexplodedmojo/test-dir/ExplodedWar_WithResourceFiltering]>
[INFO] Copying webapp resources [<https://builds.apache.org/job/maven-plugins-ITs-2.x/ws/maven-war-plugin/target/test-classes/unit/warexplodedmojo/test-dir/ExplodedWar_WithResourceFiltering-test-data/source]>
[INFO] Webapp assembled in [3 msecs]
[INFO] Exploding webapp
[INFO] Assembling webapp [maven-war-plugin-test] in [<https://builds.apache.org/job/maven-plugins-ITs-2.x/ws/maven-war-plugin/target/test-classes/unit/warexplodedmojo/test-dir/ExplodedWar_WithResourceFiltering]>
[INFO] Processing war project
[INFO] Copying webapp webResources [<https://builds.apache.org/job/maven-plugins-ITs-2.x/ws/maven-war-plugin/target/test-classes/unit/warexplodedmojo/test-dir/ExplodedWar_WithResourceFiltering-test-data/resources]>
to [<https://builds.apache.org/job/maven-plugins-ITs-2.x/ws/maven-war-plugin/target/test-classes/unit/warexplodedmojo/test-dir/ExplodedWar_WithResourceFiltering]>
[INFO] Copying webapp resources [<https://builds.apache.org/job/maven-plugins-ITs-2.x/ws/maven-war-plugin/target/test-classes/unit/warexplodedmojo/test-dir/ExplodedWar_WithResourceFiltering-test-data/source]>
[INFO] Webapp assembled in [5 msecs]
Tests run: 1, Failures: 0, Errors: 0, Skipped: 0, Time elapsed: 0.08 sec

Results :

Tests run: 83, Failures: 0, Errors: 0, Skipped: 0

[INFO] [jar:jar {execution: default-jar}]
[INFO] Building jar: <https://builds.apache.org/job/maven-plugins-ITs-2.x/ws/maven-war-plugin/target/maven-war-plugin-2.2-SNAPSHOT.jar>
[INFO] [plugin:addPluginArtifactMetadata {execution: default-addPluginArtifactMetadata}]
[INFO] [invoker:install {execution: integration-test}]
[INFO] Installing <https://builds.apache.org/job/maven-plugins-ITs-2.x/ws/maven-war-plugin/pom.xml>
to <https://builds.apache.org/job/maven-plugins-ITs-2.x/ws/maven-war-plugin/target/local-repo/org/apache/maven/plugins/maven-war-plugin/2.2-SNAPSHOT/maven-war-plugin-2.2-SNAPSHOT.pom>
[INFO] Installing <https://builds.apache.org/job/maven-plugins-ITs-2.x/ws/maven-war-plugin/target/maven-war-plugin-2.2-SNAPSHOT.jar>
to <https://builds.apache.org/job/maven-plugins-ITs-2.x/ws/maven-war-plugin/target/local-repo/org/apache/maven/plugins/maven-war-plugin/2.2-SNAPSHOT/maven-war-plugin-2.2-SNAPSHOT.jar>
[INFO] [invoker:run {execution: integration-test}]
[INFO] Building: scoped-dependency-same-artifact/pom.xml
[INFO] ..SUCCESS (4.3 s)
[INFO] Building: MWAR-96/pom.xml
[INFO] ..SUCCESS (2.8 s)
[INFO] Building: simple-war-no-webxml/pom.xml
[INFO] ..SUCCESS (3.0 s)
[INFO] Building: MWAR-131/pom.xml
[INFO] ..SUCCESS (7.8 s)
[INFO] Building: MWAR-133/pom.xml
[INFO] ..SUCCESS (2.5 s)
[INFO] Building: MWAR-129/pom.xml
[INFO] ..SUCCESS (2.2 s)
[INFO] Building: MWAR-62/pom.xml
[INFO] ..SUCCESS (2.2 s)
[INFO] Building: default/pom.xml
[INFO] ..SUCCESS (3.2 s)
[INFO] Building: MWAR-143/pom.xml
[INFO] ..SUCCESS (7.7 s)
[INFO] Building: web-resources-filtering/pom.xml
[INFO] ..SUCCESS (3.8 s)
[INFO] Building: simple-war-project/pom.xml
[INFO] ..SUCCESS (3.0 s)
[INFO] Building: MWAR-139/pom.xml
[INFO] ..SUCCESS (3.0 s)
[INFO] ---------------------------------------
[INFO] Execution Summary:
[INFO]   Builds Passing: 12
[INFO]   Builds Failing: 0
[INFO]   Builds Skipped: 0
[INFO] ---------------------------------------
[INFO] [install:install {execution: default-install}]
[INFO] Installing <https://builds.apache.org/job/maven-plugins-ITs-2.x/ws/maven-war-plugin/target/maven-war-plugin-2.2-SNAPSHOT.jar>
to /home/hudson/.m2/repository/org/apache/maven/plugins/maven-war-plugin/2.2-SNAPSHOT/maven-war-plugin-2.2-SNAPSHOT.jar
[INFO] ------------------------------------------------------------------------
[INFO] Building Maven Plugins Aggregator
[INFO]    task-segment: [clean, install]
[INFO] ------------------------------------------------------------------------
[INFO] [clean:clean {execution: default-clean}]
[INFO] Deleting <https://builds.apache.org/job/maven-plugins-ITs-2.x/ws/target>
[INFO] [remote-resources:process {execution: default}]
[INFO] [site:attach-descriptor {execution: default-attach-descriptor}]
[INFO] [install:install {execution: default-install}]
[INFO] Installing <https://builds.apache.org/job/maven-plugins-ITs-2.x/ws/pom.xml> to
/home/hudson/.m2/repository/org/apache/maven/plugins/maven-plugins-aggregator/1-SNAPSHOT/maven-plugins-aggregator-1-SNAPSHOT.pom
[INFO] 
[INFO] 
[INFO] ------------------------------------------------------------------------
[INFO] Reactor Summary:
[INFO] ------------------------------------------------------------------------
[INFO] Maven Plugins ......................................... SUCCESS [7.381s]
[INFO] Maven ACR Plugin ...................................... SUCCESS [24.627s]
[INFO] Maven Ant Plugin ...................................... SUCCESS [2:07.186s]
[INFO] Maven AntRun Plugin ................................... SUCCESS [46.913s]
[INFO] Maven Eclipse Plugin .................................. FAILED [9:58.409s]
[INFO] Maven Changelog Plugin ................................ SUCCESS [22.188s]
[INFO] Maven Compiler Plugin ................................. SUCCESS [19.470s]
[INFO] Maven Changes Report Plugin ........................... SUCCESS [50.683s]
[INFO] Maven Checkstyle Plugin ............................... SUCCESS [1:14.613s]
[INFO] Maven Clean Plugin .................................... SUCCESS [13.511s]
[INFO] Maven Dependency Plugin ............................... SUCCESS [2:32.251s]
[INFO] Maven Deploy Plugin ................................... SUCCESS [57.236s]
[INFO] Maven DOAP Plugin ..................................... SUCCESS [18.672s]
[INFO] Maven Documentation Checker Plugin .................... SUCCESS [5.897s]
[INFO] Maven EAR Plugin ...................................... FAILED [18.068s]
[INFO] Maven EJB Plugin ...................................... SUCCESS [25.209s]
[INFO] Maven GPG Plugin ...................................... SUCCESS [16.054s]
[INFO] Maven Help Plugin ..................................... SUCCESS [32.630s]
[INFO] Maven IDEA Plugin ..................................... SUCCESS [8.052s]
[INFO] Maven Install Plugin .................................. SUCCESS [35.364s]
[INFO] Maven JAR Plugin ...................................... SUCCESS [1:05.825s]
[INFO] Maven Jarsigner Plugin ................................ SUCCESS [23.721s]
[INFO] Maven Shade Plugin .................................... SUCCESS [1:39.159s]
[INFO] Maven Javadoc Plugin .................................. SUCCESS [8:08.315s]
[INFO] Maven Linkcheck Plugin ................................ SUCCESS [1.728s]
[INFO] Maven One Plugin ...................................... SUCCESS [1.546s]
[INFO] Maven Patch Plugin .................................... SUCCESS [10.304s]
[INFO] Maven PDF Plugin ...................................... SUCCESS [32.504s]
[INFO] Maven PMD Plugin ...................................... SUCCESS [21.585s]
[INFO] Maven RAR Plugin ...................................... SUCCESS [5.937s]
[INFO] Maven Reactor Plugin .................................. SUCCESS [1.934s]
[INFO] Maven Repository Plugin ............................... FAILED [4:51.986s]
[INFO] Maven Resources Plugin ................................ SUCCESS [46.097s]
[INFO] Maven Site Plugin ..................................... SUCCESS [3:39.683s]
[INFO] Maven Source Plugin ................................... SUCCESS [28.274s]
[INFO] Maven Stage Plugin .................................... SUCCESS [1.607s]
[INFO] Maven Toolchains Plugin ............................... SUCCESS [1.257s]
[INFO] Maven Verifier Plugin ................................. SUCCESS [7.268s]
[INFO] Maven WAR Plugin ...................................... SUCCESS [1:02.504s]
[INFO] Maven Plugins Aggregator .............................. SUCCESS [0.117s]
[INFO] ------------------------------------------------------------------------
[INFO] Error for project: Maven Eclipse Plugin (during install)
[INFO] ------------------------------------------------------------------------
[INFO] There are test failures.

Please refer to <https://builds.apache.org/job/maven-plugins-ITs-2.x/ws/maven-eclipse-plugin/target/surefire-reports>
for the individual test results.
[INFO] ------------------------------------------------------------------------
[INFO] Error for project: Maven EAR Plugin (during install)
[INFO] ------------------------------------------------------------------------
[INFO] : org.apache.maven.plugin.invoker.InvokerSession@ecb953
1 build failed.
[INFO] ------------------------------------------------------------------------
[INFO] Error for project: Maven Repository Plugin (during install)
[INFO] ------------------------------------------------------------------------
[INFO] There are test failures.

Please refer to <https://builds.apache.org/job/maven-plugins-ITs-2.x/ws/maven-repository-plugin/target/surefire-reports>
for the individual test results.
[INFO] ------------------------------------------------------------------------
[INFO] For more information, run Maven with the -e switch
[INFO] ------------------------------------------------------------------------
[INFO] BUILD ERRORS
[INFO] ------------------------------------------------------------------------
[INFO] Total time: 46 minutes 7 seconds
[INFO] Finished at: Thu Jun 30 13:50:51 UTC 2011
[INFO] Final Memory: 68M/410M
[INFO] ------------------------------------------------------------------------


Mime
View raw message