maven-notifications mailing list archives

Site index · List index
Message view « Date » · « Thread »
Top « Date » · « Thread »
From "GRiD .ORG" <bui...@lists.sonatype.com>
Subject Build failed in Hudson: maven-plugins-ITs » java-5x,ubuntu #657
Date Tue, 05 Apr 2011 07:36:02 GMT
See <https://grid.sonatype.org/ci/job/maven-plugins-ITs/./jdk=java-5x,label=ubuntu/657/changes>

Changes:

[Lukas Theussl] [MSITE-573] make default stagingRepositoryId match site id

------------------------------------------
[...truncated 27350 lines...]
[INFO] Mojo extractor for language: bsh found 0 mojo descriptors.
[INFO] 
[INFO] --- maven-remote-resources-plugin:1.1:process (default) @ maven-remote-resources-plugin
---
[INFO] 
[INFO] --- maven-resources-plugin:2.4.3:resources (default-resources) @ maven-remote-resources-plugin
---
[INFO] Using 'UTF-8' encoding to copy filtered resources.
[INFO] Copying 1 resource
[INFO] Copying 3 resources
[INFO] 
[INFO] --- maven-compiler-plugin:2.3.2:compile (default-compile) @ maven-remote-resources-plugin
---
[INFO] Compiling 11 source files to /opt/grid/slave/workspace/maven-plugins-ITs/jdk/java-5x/label/ubuntu/trunk/maven-remote-resources-plugin/target/classes
[INFO] 
[INFO] --- maven-resources-plugin:2.4.3:testResources (default-testResources) @ maven-remote-resources-plugin
---
[INFO] Using 'UTF-8' encoding to copy filtered resources.
[INFO] Copying 7 resources
[INFO] Copying 42 resources
[INFO] Copying 1 resource
[INFO] Copying 3 resources
[INFO] 
[INFO] --- maven-compiler-plugin:2.3.2:testCompile (default-testCompile) @ maven-remote-resources-plugin
---
[INFO] Compiling 17 source files to /opt/grid/slave/workspace/maven-plugins-ITs/jdk/java-5x/label/ubuntu/trunk/maven-remote-resources-plugin/target/test-classes
[INFO] 
[INFO] --- maven-surefire-plugin:2.7.2:test (default-test) @ maven-remote-resources-plugin
---
[INFO] Surefire report directory: /opt/grid/slave/workspace/maven-plugins-ITs/jdk/java-5x/label/ubuntu/trunk/maven-remote-resources-plugin/target/surefire-reports

-------------------------------------------------------
 T E S T S
-------------------------------------------------------
Running org.apache.maven.plugin.resources.remote.RemoteResourcesMojoTest
Tests run: 8, Failures: 0, Errors: 0, Skipped: 0, Time elapsed: 2.089 sec

Results :

Tests run: 8, Failures: 0, Errors: 0, Skipped: 0

[INFO] 
[INFO] --- maven-jar-plugin:2.3.1:jar (default-jar) @ maven-remote-resources-plugin ---
[INFO] Building jar: /opt/grid/slave/workspace/maven-plugins-ITs/jdk/java-5x/label/ubuntu/trunk/maven-remote-resources-plugin/target/maven-remote-resources-plugin-1.3-SNAPSHOT.jar
[INFO] 
[INFO] --- maven-plugin-plugin:2.7:addPluginArtifactMetadata (default-addPluginArtifactMetadata)
@ maven-remote-resources-plugin ---
[INFO] 
[INFO] --- maven-invoker-plugin:1.5:install (install-descriptor) @ maven-remote-resources-plugin
---
[INFO] Installing /opt/grid/slave/workspace/maven-plugins-ITs/jdk/java-5x/label/ubuntu/trunk/maven-remote-resources-plugin/pom.xml
to /opt/grid/slave/workspace/maven-plugins-ITs/jdk/java-5x/label/ubuntu/trunk/maven-remote-resources-plugin/target/it-repo/org/apache/maven/plugins/maven-remote-resources-plugin/1.3-SNAPSHOT/maven-remote-resources-plugin-1.3-SNAPSHOT.pom
[INFO] Installing /opt/grid/slave/workspace/maven-plugins-ITs/jdk/java-5x/label/ubuntu/trunk/maven-remote-resources-plugin/target/maven-remote-resources-plugin-1.3-SNAPSHOT.jar
to /opt/grid/slave/workspace/maven-plugins-ITs/jdk/java-5x/label/ubuntu/trunk/maven-remote-resources-plugin/target/it-repo/org/apache/maven/plugins/maven-remote-resources-plugin/1.3-SNAPSHOT/maven-remote-resources-plugin-1.3-SNAPSHOT.jar
[INFO] 
[INFO] --- maven-surefire-plugin:2.7.2:test (integration-tests) @ maven-remote-resources-plugin
---
[INFO] Surefire report directory: /opt/grid/slave/workspace/maven-plugins-ITs/jdk/java-5x/label/ubuntu/trunk/maven-remote-resources-plugin/target/surefire-reports

-------------------------------------------------------
 T E S T S
-------------------------------------------------------
Running org.apache.maven.plugin.resources.remote.it.IT_GenerateFromOverride
Tests run: 1, Failures: 0, Errors: 0, Skipped: 0, Time elapsed: 13.484 sec
Running org.apache.maven.plugin.resources.remote.it.IT_FilterLocalOverride
Tests run: 1, Failures: 0, Errors: 0, Skipped: 0, Time elapsed: 4.537 sec
Running org.apache.maven.plugin.resources.remote.it.IT_CustomFilterDelimiter
Tests run: 1, Failures: 0, Errors: 0, Skipped: 0, Time elapsed: 3.974 sec
Running org.apache.maven.plugin.resources.remote.it.IT_GetDependencyProjects
Tests run: 1, Failures: 0, Errors: 0, Skipped: 0, Time elapsed: 16.4 sec
Running org.apache.maven.plugin.resources.remote.it.IT_GenerateFromBundle
Tests run: 1, Failures: 0, Errors: 0, Skipped: 0, Time elapsed: 4.569 sec
Running org.apache.maven.plugin.resources.remote.it.IT_BadDependencyPoms
Tests run: 1, Failures: 0, Errors: 0, Skipped: 0, Time elapsed: 10.21 sec
Running org.apache.maven.plugin.resources.remote.it.IT_SupplementalArtifact
Tests run: 1, Failures: 0, Errors: 0, Skipped: 0, Time elapsed: 11.19 sec
Running org.apache.maven.plugin.resources.remote.it.IT_RunOnlyAtExecutionRoot
Tests run: 1, Failures: 0, Errors: 0, Skipped: 0, Time elapsed: 13.515 sec

Results :

Tests run: 8, Failures: 0, Errors: 0, Skipped: 0

[INFO] 
[INFO] --- maven-install-plugin:2.3.1:install (default-install) @ maven-remote-resources-plugin
---
[INFO] Installing /opt/grid/slave/workspace/maven-plugins-ITs/jdk/java-5x/label/ubuntu/trunk/maven-remote-resources-plugin/target/maven-remote-resources-plugin-1.3-SNAPSHOT.jar
to <https://grid.sonatype.org/ci/job/maven-plugins-ITs/./jdk=java-5x,label=ubuntu/ws/.repository/org/apache/maven/plugins/maven-remote-resources-plugin/1.3-SNAPSHOT/maven-remote-resources-plugin-1.3-SNAPSHOT.jar>
[INFO] Installing /opt/grid/slave/workspace/maven-plugins-ITs/jdk/java-5x/label/ubuntu/trunk/maven-remote-resources-plugin/pom.xml
to <https://grid.sonatype.org/ci/job/maven-plugins-ITs/./jdk=java-5x,label=ubuntu/ws/.repository/org/apache/maven/plugins/maven-remote-resources-plugin/1.3-SNAPSHOT/maven-remote-resources-plugin-1.3-SNAPSHOT.pom>
[INFO] 
[INFO] --- maven-deploy-plugin:2.5:deploy (default-deploy) @ maven-remote-resources-plugin
---
Downloading: http://repository.sonatype.org:8081/content/repositories/maven.snapshots/org/apache/maven/plugins/maven-remote-resources-plugin/1.3-SNAPSHOT/maven-metadata.xml
Downloaded: http://repository.sonatype.org:8081/content/repositories/maven.snapshots/org/apache/maven/plugins/maven-remote-resources-plugin/1.3-SNAPSHOT/maven-metadata.xml
(800 B at 6.7 KB/sec)
Uploading: http://repository.sonatype.org:8081/content/repositories/maven.snapshots/org/apache/maven/plugins/maven-remote-resources-plugin/1.3-SNAPSHOT/maven-remote-resources-plugin-1.3-20110405.073558-36.jar
Uploaded: http://repository.sonatype.org:8081/content/repositories/maven.snapshots/org/apache/maven/plugins/maven-remote-resources-plugin/1.3-SNAPSHOT/maven-remote-resources-plugin-1.3-20110405.073558-36.jar
(63 KB at 292.6 KB/sec)
Uploading: http://repository.sonatype.org:8081/content/repositories/maven.snapshots/org/apache/maven/plugins/maven-remote-resources-plugin/1.3-SNAPSHOT/maven-remote-resources-plugin-1.3-20110405.073558-36.pom
Uploaded: http://repository.sonatype.org:8081/content/repositories/maven.snapshots/org/apache/maven/plugins/maven-remote-resources-plugin/1.3-SNAPSHOT/maven-remote-resources-plugin-1.3-20110405.073558-36.pom
(13 KB at 60.0 KB/sec)
Downloading: http://repository.sonatype.org:8081/content/repositories/maven.snapshots/org/apache/maven/plugins/maven-remote-resources-plugin/maven-metadata.xml
Downloaded: http://repository.sonatype.org:8081/content/repositories/maven.snapshots/org/apache/maven/plugins/maven-remote-resources-plugin/maven-metadata.xml
(447 B at 2.9 KB/sec)
Downloading: http://repository.sonatype.org:8081/content/repositories/maven.snapshots/org/apache/maven/plugins/maven-metadata.xml
Downloaded: http://repository.sonatype.org:8081/content/repositories/maven.snapshots/org/apache/maven/plugins/maven-metadata.xml
(8 KB at 83.5 KB/sec)
Uploading: http://repository.sonatype.org:8081/content/repositories/maven.snapshots/org/apache/maven/plugins/maven-remote-resources-plugin/1.3-SNAPSHOT/maven-metadata.xml
Uploaded: http://repository.sonatype.org:8081/content/repositories/maven.snapshots/org/apache/maven/plugins/maven-remote-resources-plugin/1.3-SNAPSHOT/maven-metadata.xml
(800 B at 4.3 KB/sec)
Uploading: http://repository.sonatype.org:8081/content/repositories/maven.snapshots/org/apache/maven/plugins/maven-remote-resources-plugin/maven-metadata.xml
Uploaded: http://repository.sonatype.org:8081/content/repositories/maven.snapshots/org/apache/maven/plugins/maven-remote-resources-plugin/maven-metadata.xml
(447 B at 1.3 KB/sec)
Uploading: http://repository.sonatype.org:8081/content/repositories/maven.snapshots/org/apache/maven/plugins/maven-metadata.xml
Uploaded: http://repository.sonatype.org:8081/content/repositories/maven.snapshots/org/apache/maven/plugins/maven-metadata.xml
(8 KB at 33.9 KB/sec)
[INFO]                                                                         
[INFO] ------------------------------------------------------------------------
[INFO] Building Maven Plugins Aggregator 1-SNAPSHOT
[INFO] ------------------------------------------------------------------------
[INFO] 
[INFO] --- maven-clean-plugin:2.4.1:clean (default-clean) @ maven-plugins-aggregator ---
[INFO] 
[INFO] --- maven-remote-resources-plugin:1.1:process (default) @ maven-plugins-aggregator
---
[INFO] 
[INFO] --- maven-install-plugin:2.3.1:install (default-install) @ maven-plugins-aggregator
---
[INFO] Installing /opt/grid/slave/workspace/maven-plugins-ITs/jdk/java-5x/label/ubuntu/trunk/pom.xml
to <https://grid.sonatype.org/ci/job/maven-plugins-ITs/./jdk=java-5x,label=ubuntu/ws/.repository/org/apache/maven/plugins/maven-plugins-aggregator/1-SNAPSHOT/maven-plugins-aggregator-1-SNAPSHOT.pom>
[INFO] 
[INFO] --- maven-deploy-plugin:2.5:deploy (default-deploy) @ maven-plugins-aggregator ---
Downloading: http://repository.sonatype.org:8081/content/repositories/maven.snapshots/org/apache/maven/plugins/maven-plugins-aggregator/1-SNAPSHOT/maven-metadata.xml
Downloaded: http://repository.sonatype.org:8081/content/repositories/maven.snapshots/org/apache/maven/plugins/maven-plugins-aggregator/1-SNAPSHOT/maven-metadata.xml
(621 B at 3.7 KB/sec)
Uploading: http://repository.sonatype.org:8081/content/repositories/maven.snapshots/org/apache/maven/plugins/maven-plugins-aggregator/1-SNAPSHOT/maven-plugins-aggregator-1-20110405.073559-209.pom
Uploaded: http://repository.sonatype.org:8081/content/repositories/maven.snapshots/org/apache/maven/plugins/maven-plugins-aggregator/1-SNAPSHOT/maven-plugins-aggregator-1-20110405.073559-209.pom
(4 KB at 17.4 KB/sec)
Downloading: http://repository.sonatype.org:8081/content/repositories/maven.snapshots/org/apache/maven/plugins/maven-plugins-aggregator/maven-metadata.xml
Downloaded: http://repository.sonatype.org:8081/content/repositories/maven.snapshots/org/apache/maven/plugins/maven-plugins-aggregator/maven-metadata.xml
(304 B at 1.3 KB/sec)
Uploading: http://repository.sonatype.org:8081/content/repositories/maven.snapshots/org/apache/maven/plugins/maven-plugins-aggregator/1-SNAPSHOT/maven-metadata.xml
Uploaded: http://repository.sonatype.org:8081/content/repositories/maven.snapshots/org/apache/maven/plugins/maven-plugins-aggregator/1-SNAPSHOT/maven-metadata.xml
(621 B at 2.3 KB/sec)
Uploading: http://repository.sonatype.org:8081/content/repositories/maven.snapshots/org/apache/maven/plugins/maven-plugins-aggregator/maven-metadata.xml
Uploaded: http://repository.sonatype.org:8081/content/repositories/maven.snapshots/org/apache/maven/plugins/maven-plugins-aggregator/maven-metadata.xml
(304 B at 0.8 KB/sec)
[INFO] ------------------------------------------------------------------------
[INFO] Reactor Summary:
[INFO] 
[INFO] Maven Plugins ..................................... SUCCESS [51.457s]
[INFO] Maven ACR Plugin .................................. SUCCESS [56.297s]
[INFO] Maven Ant Plugin .................................. SUCCESS [3:39.142s]
[INFO] Maven AntRun Plugin ............................... SUCCESS [1:56.541s]
[INFO] Maven Eclipse Plugin .............................. SUCCESS [12:43.043s]
[INFO] Maven Changelog Plugin ............................ SUCCESS [1:20.398s]
[INFO] Maven Changes Report Plugin ....................... SUCCESS [2:12.552s]
[INFO] Maven Checkstyle Plugin ........................... SUCCESS [3:34.263s]
[INFO] Maven Clean Plugin ................................ SUCCESS [33.139s]
[INFO] Maven Compiler Plugin ............................. SUCCESS [36.014s]
[INFO] Maven Dependency Plugin ........................... SUCCESS [5:30.043s]
[INFO] Maven Deploy Plugin ............................... SUCCESS [2:51.685s]
[INFO] Maven DOAP Plugin ................................. SUCCESS [37.745s]
[INFO] Maven Documentation Checker Plugin ................ SUCCESS [11.373s]
[INFO] Maven EAR Plugin .................................. FAILURE [6:50.923s]
[INFO] Maven EJB Plugin .................................. SUCCESS [1:03.676s]
[INFO] Maven GPG Plugin .................................. SUCCESS [1:08.711s]
[INFO] Maven Help Plugin ................................. SUCCESS [1:25.841s]
[INFO] Maven IDEA Plugin ................................. SUCCESS [21.044s]
[INFO] Maven Install Plugin .............................. SUCCESS [1:43.641s]
[INFO] Maven JAR Plugin .................................. SUCCESS [2:33.720s]
[INFO] Maven Jarsigner Plugin ............................ SUCCESS [1:19.833s]
[INFO] Maven Javadoc Plugin .............................. SUCCESS [10:12.284s]
[INFO] Maven Linkcheck Plugin ............................ SUCCESS [5.971s]
[INFO] Maven One Plugin .................................. SUCCESS [5.360s]
[INFO] Maven Patch Plugin ................................ SUCCESS [20.245s]
[INFO] Maven PDF Plugin .................................. SUCCESS [52.233s]
[INFO] Maven PMD Plugin .................................. SUCCESS [1:37.499s]
[INFO] Maven RAR Plugin .................................. SUCCESS [14.107s]
[INFO] Maven Reactor Plugin .............................. SUCCESS [7.648s]
[INFO] Maven Repository Plugin ........................... FAILURE [38.192s]
[INFO] Maven Resources Plugin ............................ SUCCESS [1:39.656s]
[INFO] Maven Shade Plugin ................................ SUCCESS [3:20.838s]
[INFO] Maven Site Plugin ................................. SUCCESS [1:34.591s]
[INFO] Maven Source Plugin ............................... SUCCESS [1:09.911s]
[INFO] Maven Stage Plugin ................................ SUCCESS [4.737s]
[INFO] Maven Toolchains Plugin ........................... SUCCESS [3.889s]
[INFO] Maven Verifier Plugin ............................. SUCCESS [17.305s]
[INFO] Maven WAR Plugin .................................. SUCCESS [2:05.765s]
[INFO] Maven Invoker Plugin .............................. SUCCESS [6:47.954s]
[INFO] Maven Project Info Reports Plugin ................. SUCCESS [2:55.678s]
[INFO] Maven Remote Resources Plugin ..................... SUCCESS [1:28.995s]
[INFO] Maven Plugins Aggregator .......................... SUCCESS [1.310s]
[INFO] ------------------------------------------------------------------------
[INFO] BUILD FAILURE
[INFO] ------------------------------------------------------------------------
[INFO] Total time: 1:29:50.813s
[INFO] Finished at: Tue Apr 05 02:36:01 CDT 2011
[INFO] Final Memory: 77M/166M
[INFO] ------------------------------------------------------------------------
[ERROR] Failed to execute goal org.apache.maven.plugins:maven-surefire-plugin:2.7.2:test (default)
on project maven-ear-plugin: There are test failures.
[ERROR] 
[ERROR] Please refer to /opt/grid/slave/workspace/maven-plugins-ITs/jdk/java-5x/label/ubuntu/trunk/maven-ear-plugin/target/surefire-reports
for the individual test results.
[ERROR] -> [Help 1]
org.apache.maven.lifecycle.LifecycleExecutionException: Failed to execute goal org.apache.maven.plugins:maven-surefire-plugin:2.7.2:test
(default) on project maven-ear-plugin: There are test failures.

Please refer to /opt/grid/slave/workspace/maven-plugins-ITs/jdk/java-5x/label/ubuntu/trunk/maven-ear-plugin/target/surefire-reports
for the individual test results.
	at org.apache.maven.lifecycle.internal.MojoExecutor.execute(MojoExecutor.java:213)
	at org.apache.maven.lifecycle.internal.MojoExecutor.execute(MojoExecutor.java:153)
	at org.apache.maven.lifecycle.internal.MojoExecutor.execute(MojoExecutor.java:145)
	at org.apache.maven.lifecycle.internal.LifecycleModuleBuilder.buildProject(LifecycleModuleBuilder.java:84)
	at org.apache.maven.lifecycle.internal.LifecycleModuleBuilder.buildProject(LifecycleModuleBuilder.java:59)
	at org.apache.maven.lifecycle.internal.LifecycleStarter.singleThreadedBuild(LifecycleStarter.java:183)
	at org.apache.maven.lifecycle.internal.LifecycleStarter.execute(LifecycleStarter.java:161)
	at org.apache.maven.DefaultMaven.doExecute(DefaultMaven.java:319)
	at org.apache.maven.DefaultMaven.execute(DefaultMaven.java:156)
	at org.apache.maven.cli.MavenCli.execute(MavenCli.java:537)
	at org.apache.maven.cli.MavenCli.doMain(MavenCli.java:196)
	at org.apache.maven.cli.MavenCli.main(MavenCli.java:141)
	at sun.reflect.NativeMethodAccessorImpl.invoke0(Native Method)
	at sun.reflect.NativeMethodAccessorImpl.invoke(NativeMethodAccessorImpl.java:39)
	at sun.reflect.DelegatingMethodAccessorImpl.invoke(DelegatingMethodAccessorImpl.java:25)
	at java.lang.reflect.Method.invoke(Method.java:592)
	at org.codehaus.plexus.classworlds.launcher.Launcher.launchEnhanced(Launcher.java:290)
	at org.codehaus.plexus.classworlds.launcher.Launcher.launch(Launcher.java:230)
	at org.codehaus.plexus.classworlds.launcher.Launcher.mainWithExitCode(Launcher.java:409)
	at org.codehaus.plexus.classworlds.launcher.Launcher.main(Launcher.java:352)
Caused by: org.apache.maven.plugin.MojoFailureException: There are test failures.

Please refer to /opt/grid/slave/workspace/maven-plugins-ITs/jdk/java-5x/label/ubuntu/trunk/maven-ear-plugin/target/surefire-reports
for the individual test results.
	at org.apache.maven.plugin.surefire.SurefireHelper.reportExecution(SurefireHelper.java:74)
	at org.apache.maven.plugin.surefire.SurefirePlugin.execute(SurefirePlugin.java:642)
	at org.apache.maven.plugin.DefaultBuildPluginManager.executeMojo(DefaultBuildPluginManager.java:101)
	at org.apache.maven.lifecycle.internal.MojoExecutor.execute(MojoExecutor.java:209)
	... 19 more
[ERROR] Failed to execute goal org.apache.maven.plugins:maven-surefire-plugin:2.7.2:test (integration-tests)
on project maven-repository-plugin: There are test failures.
[ERROR] 
[ERROR] Please refer to /opt/grid/slave/workspace/maven-plugins-ITs/jdk/java-5x/label/ubuntu/trunk/maven-repository-plugin/target/surefire-reports
for the individual test results.
[ERROR] -> [Help 1]
org.apache.maven.lifecycle.LifecycleExecutionException: Failed to execute goal org.apache.maven.plugins:maven-surefire-plugin:2.7.2:test
(integration-tests) on project maven-repository-plugin: There are test failures.

Please refer to /opt/grid/slave/workspace/maven-plugins-ITs/jdk/java-5x/label/ubuntu/trunk/maven-repository-plugin/target/surefire-reports
for the individual test results.
	at org.apache.maven.lifecycle.internal.MojoExecutor.execute(MojoExecutor.java:213)
	at org.apache.maven.lifecycle.internal.MojoExecutor.execute(MojoExecutor.java:153)
	at org.apache.maven.lifecycle.internal.MojoExecutor.execute(MojoExecutor.java:145)
	at org.apache.maven.lifecycle.internal.LifecycleModuleBuilder.buildProject(LifecycleModuleBuilder.java:84)
	at org.apache.maven.lifecycle.internal.LifecycleModuleBuilder.buildProject(LifecycleModuleBuilder.java:59)
	at org.apache.maven.lifecycle.internal.LifecycleStarter.singleThreadedBuild(LifecycleStarter.java:183)
	at org.apache.maven.lifecycle.internal.LifecycleStarter.execute(LifecycleStarter.java:161)
	at org.apache.maven.DefaultMaven.doExecute(DefaultMaven.java:319)
	at org.apache.maven.DefaultMaven.execute(DefaultMaven.java:156)
	at org.apache.maven.cli.MavenCli.execute(MavenCli.java:537)
	at org.apache.maven.cli.MavenCli.doMain(MavenCli.java:196)
	at org.apache.maven.cli.MavenCli.main(MavenCli.java:141)
	at sun.reflect.NativeMethodAccessorImpl.invoke0(Native Method)
	at sun.reflect.NativeMethodAccessorImpl.invoke(NativeMethodAccessorImpl.java:39)
	at sun.reflect.DelegatingMethodAccessorImpl.invoke(DelegatingMethodAccessorImpl.java:25)
	at java.lang.reflect.Method.invoke(Method.java:592)
	at org.codehaus.plexus.classworlds.launcher.Launcher.launchEnhanced(Launcher.java:290)
	at org.codehaus.plexus.classworlds.launcher.Launcher.launch(Launcher.java:230)
	at org.codehaus.plexus.classworlds.launcher.Launcher.mainWithExitCode(Launcher.java:409)
	at org.codehaus.plexus.classworlds.launcher.Launcher.main(Launcher.java:352)
Caused by: org.apache.maven.plugin.MojoFailureException: There are test failures.

Please refer to /opt/grid/slave/workspace/maven-plugins-ITs/jdk/java-5x/label/ubuntu/trunk/maven-repository-plugin/target/surefire-reports
for the individual test results.
	at org.apache.maven.plugin.surefire.SurefireHelper.reportExecution(SurefireHelper.java:74)
	at org.apache.maven.plugin.surefire.SurefirePlugin.execute(SurefirePlugin.java:642)
	at org.apache.maven.plugin.DefaultBuildPluginManager.executeMojo(DefaultBuildPluginManager.java:101)
	at org.apache.maven.lifecycle.internal.MojoExecutor.execute(MojoExecutor.java:209)
	... 19 more
[ERROR] 
[ERROR] Re-run Maven using the -X switch to enable full debug logging.
[ERROR] 
[ERROR] For more information about the errors and possible solutions, please read the following
articles:
[ERROR] [Help 1] http://cwiki.apache.org/confluence/display/MAVEN/MojoFailureException
[ERROR] 
[ERROR] After correcting the problems, you can resume the build with the command
[ERROR]   mvn <goals> -rf :maven-ear-plugin
Failed to send e-mail to snicoll because no e-mail address is known, and no default e-mail
domain is configured


Mime
View raw message