maven-notifications mailing list archives

Site index · List index
Message view « Date » · « Thread »
Top « Date » · « Thread »
From "GRiD .ORG" <bui...@lists.sonatype.com>
Subject Build failed in Hudson: maven-plugins-ITs » java-5x,windows #657
Date Tue, 05 Apr 2011 07:14:32 GMT
See <https://grid.sonatype.org/ci/job/maven-plugins-ITs/./jdk=java-5x,label=windows/657/changes>

Changes:

[Lukas Theussl] [MSITE-573] make default stagingRepositoryId match site id

------------------------------------------
[...truncated 7575 lines...]
[INFO] outputDirectory: X:\slave\workspace\maven-plugins-ITs\jdk\java-5x\label\windows\trunk\maven-remote-resources-plugin\target\generated-sources\modello
[INFO] Working on model: src/main/mdo/remote-resources.mdo
[INFO] Generating current version: 1.1.0
[INFO] 
[INFO] --- modello-maven-plugin:1.4.1:java (remote-resources) @ maven-remote-resources-plugin
---
[INFO] outputDirectory: X:\slave\workspace\maven-plugins-ITs\jdk\java-5x\label\windows\trunk\maven-remote-resources-plugin\target\generated-sources\modello
[INFO] Working on model: src/main/mdo/remote-resources.mdo
[INFO] Generating current version: 1.1.0
[INFO] 
[INFO] --- modello-maven-plugin:1.4.1:xpp3-reader (remote-resources) @ maven-remote-resources-plugin
---
[INFO] outputDirectory: X:\slave\workspace\maven-plugins-ITs\jdk\java-5x\label\windows\trunk\maven-remote-resources-plugin\target\generated-sources\modello
[INFO] Working on model: src/main/mdo/remote-resources.mdo
[INFO] Generating current version: 1.1.0
[INFO] 
[INFO] --- modello-maven-plugin:1.4.1:xpp3-writer (supplemental-models) @ maven-remote-resources-plugin
---
[INFO] outputDirectory: X:\slave\workspace\maven-plugins-ITs\jdk\java-5x\label\windows\trunk\maven-remote-resources-plugin\target\generated-sources\modello
[INFO] Working on model: src/main/mdo/supplemental-model.mdo
[INFO] Generating current version: 1.0.0
[INFO] 
[INFO] --- modello-maven-plugin:1.4.1:java (supplemental-models) @ maven-remote-resources-plugin
---
[INFO] outputDirectory: X:\slave\workspace\maven-plugins-ITs\jdk\java-5x\label\windows\trunk\maven-remote-resources-plugin\target\generated-sources\modello
[INFO] Working on model: src/main/mdo/supplemental-model.mdo
[INFO] Generating current version: 1.0.0
[INFO] 
[INFO] --- modello-maven-plugin:1.4.1:xpp3-reader (supplemental-models) @ maven-remote-resources-plugin
---
[INFO] outputDirectory: X:\slave\workspace\maven-plugins-ITs\jdk\java-5x\label\windows\trunk\maven-remote-resources-plugin\target\generated-sources\modello
[INFO] Working on model: src/main/mdo/supplemental-model.mdo
[INFO] Generating current version: 1.0.0
[INFO] 
[INFO] --- maven-plugin-plugin:2.7:descriptor (default-descriptor) @ maven-remote-resources-plugin
---
[INFO] Using 'UTF-8' encoding to read mojo metadata.
[INFO] Applying mojo extractor for language: java
[INFO] Mojo extractor for language: java found 3 mojo descriptors.
[INFO] Applying mojo extractor for language: bsh
[INFO] Mojo extractor for language: bsh found 0 mojo descriptors.
[INFO] 
[INFO] --- maven-remote-resources-plugin:1.1:process (default) @ maven-remote-resources-plugin
---
[INFO] 
[INFO] --- maven-resources-plugin:2.4.3:resources (default-resources) @ maven-remote-resources-plugin
---
[INFO] Using 'UTF-8' encoding to copy filtered resources.
[INFO] Copying 1 resource
[INFO] Copying 3 resources
[INFO] 
[INFO] --- maven-compiler-plugin:2.3.2:compile (default-compile) @ maven-remote-resources-plugin
---
[INFO] Compiling 11 source files to X:\slave\workspace\maven-plugins-ITs\jdk\java-5x\label\windows\trunk\maven-remote-resources-plugin\target\classes
[INFO] 
[INFO] --- maven-resources-plugin:2.4.3:testResources (default-testResources) @ maven-remote-resources-plugin
---
[INFO] Using 'UTF-8' encoding to copy filtered resources.
[INFO] Copying 7 resources
[INFO] Copying 42 resources
[INFO] Copying 1 resource
[INFO] Copying 3 resources
[INFO] 
[INFO] --- maven-compiler-plugin:2.3.2:testCompile (default-testCompile) @ maven-remote-resources-plugin
---
[INFO] Compiling 17 source files to X:\slave\workspace\maven-plugins-ITs\jdk\java-5x\label\windows\trunk\maven-remote-resources-plugin\target\test-classes
[INFO] 
[INFO] --- maven-surefire-plugin:2.7.2:test (default-test) @ maven-remote-resources-plugin
---
[INFO] Surefire report directory: X:\slave\workspace\maven-plugins-ITs\jdk\java-5x\label\windows\trunk\maven-remote-resources-plugin\target\surefire-reports

-------------------------------------------------------
 T E S T S
-------------------------------------------------------
Running org.apache.maven.plugin.resources.remote.RemoteResourcesMojoTest
Tests run: 8, Failures: 0, Errors: 0, Skipped: 0, Time elapsed: 1.644 sec

Results :

Tests run: 8, Failures: 0, Errors: 0, Skipped: 0

[INFO] 
[INFO] --- maven-jar-plugin:2.3.1:jar (default-jar) @ maven-remote-resources-plugin ---
[INFO] Building jar: X:\slave\workspace\maven-plugins-ITs\jdk\java-5x\label\windows\trunk\maven-remote-resources-plugin\target\maven-remote-resources-plugin-1.3-SNAPSHOT.jar
[INFO] 
[INFO] --- maven-plugin-plugin:2.7:addPluginArtifactMetadata (default-addPluginArtifactMetadata)
@ maven-remote-resources-plugin ---
[INFO] 
[INFO] --- maven-invoker-plugin:1.5:install (install-descriptor) @ maven-remote-resources-plugin
---
[INFO] Installing X:\slave\workspace\maven-plugins-ITs\jdk\java-5x\label\windows\trunk\maven-remote-resources-plugin\pom.xml
to X:\slave\workspace\maven-plugins-ITs\jdk\java-5x\label\windows\trunk\maven-remote-resources-plugin\target\it-repo\org\apache\maven\plugins\maven-remote-resources-plugin\1.3-SNAPSHOT\maven-remote-resources-plugin-1.3-SNAPSHOT.pom
[INFO] Installing X:\slave\workspace\maven-plugins-ITs\jdk\java-5x\label\windows\trunk\maven-remote-resources-plugin\target\maven-remote-resources-plugin-1.3-SNAPSHOT.jar
to X:\slave\workspace\maven-plugins-ITs\jdk\java-5x\label\windows\trunk\maven-remote-resources-plugin\target\it-repo\org\apache\maven\plugins\maven-remote-resources-plugin\1.3-SNAPSHOT\maven-remote-resources-plugin-1.3-SNAPSHOT.jar
[INFO] 
[INFO] --- maven-surefire-plugin:2.7.2:test (integration-tests) @ maven-remote-resources-plugin
---
[INFO] Surefire report directory: X:\slave\workspace\maven-plugins-ITs\jdk\java-5x\label\windows\trunk\maven-remote-resources-plugin\target\surefire-reports

-------------------------------------------------------
 T E S T S
-------------------------------------------------------
Running org.apache.maven.plugin.resources.remote.it.IT_BadDependencyPoms
Tests run: 1, Failures: 0, Errors: 0, Skipped: 0, Time elapsed: 21.619 sec
Running org.apache.maven.plugin.resources.remote.it.IT_CustomFilterDelimiter
Tests run: 1, Failures: 0, Errors: 0, Skipped: 0, Time elapsed: 4.32 sec
Running org.apache.maven.plugin.resources.remote.it.IT_FilterLocalOverride
Tests run: 1, Failures: 0, Errors: 0, Skipped: 0, Time elapsed: 4.148 sec
Running org.apache.maven.plugin.resources.remote.it.IT_GenerateFromBundle
Tests run: 1, Failures: 0, Errors: 0, Skipped: 0, Time elapsed: 3.968 sec
Running org.apache.maven.plugin.resources.remote.it.IT_GenerateFromOverride
Tests run: 1, Failures: 0, Errors: 0, Skipped: 0, Time elapsed: 4.217 sec
Running org.apache.maven.plugin.resources.remote.it.IT_GetDependencyProjects
Tests run: 1, Failures: 0, Errors: 0, Skipped: 0, Time elapsed: 12.265 sec
Running org.apache.maven.plugin.resources.remote.it.IT_RunOnlyAtExecutionRoot
Tests run: 1, Failures: 0, Errors: 0, Skipped: 0, Time elapsed: 12.689 sec
Running org.apache.maven.plugin.resources.remote.it.IT_SupplementalArtifact
Tests run: 1, Failures: 0, Errors: 0, Skipped: 0, Time elapsed: 9.977 sec

Results :

Tests run: 8, Failures: 0, Errors: 0, Skipped: 0

[INFO] 
[INFO] --- maven-install-plugin:2.3.1:install (default-install) @ maven-remote-resources-plugin
---
[INFO] Installing X:\slave\workspace\maven-plugins-ITs\jdk\java-5x\label\windows\trunk\maven-remote-resources-plugin\target\maven-remote-resources-plugin-1.3-SNAPSHOT.jar
to x:\slave\workspace\maven-plugins-ITs\jdk\java-5x\label\windows\.repository\org\apache\maven\plugins\maven-remote-resources-plugin\1.3-SNAPSHOT\maven-remote-resources-plugin-1.3-SNAPSHOT.jar
[INFO] Installing X:\slave\workspace\maven-plugins-ITs\jdk\java-5x\label\windows\trunk\maven-remote-resources-plugin\pom.xml
to x:\slave\workspace\maven-plugins-ITs\jdk\java-5x\label\windows\.repository\org\apache\maven\plugins\maven-remote-resources-plugin\1.3-SNAPSHOT\maven-remote-resources-plugin-1.3-SNAPSHOT.pom
[INFO] 
[INFO] --- maven-deploy-plugin:2.5:deploy (default-deploy) @ maven-remote-resources-plugin
---
Downloading: file:/opt/repos/deploy-junk/org/apache/maven/plugins/maven-remote-resources-plugin/1.3-SNAPSHOT/maven-metadata.xml
Downloaded: file:/opt/repos/deploy-junk/org/apache/maven/plugins/maven-remote-resources-plugin/1.3-SNAPSHOT/maven-metadata.xml
(800 B at 18.2 KB/sec)
Uploading: file:/opt/repos/deploy-junk/org/apache/maven/plugins/maven-remote-resources-plugin/1.3-SNAPSHOT/maven-remote-resources-plugin-1.3-20110405.071430-36.jar
Uploaded: file:/opt/repos/deploy-junk/org/apache/maven/plugins/maven-remote-resources-plugin/1.3-SNAPSHOT/maven-remote-resources-plugin-1.3-20110405.071430-36.jar
(63 KB at 1749.8 KB/sec)
Uploading: file:/opt/repos/deploy-junk/org/apache/maven/plugins/maven-remote-resources-plugin/1.3-SNAPSHOT/maven-remote-resources-plugin-1.3-20110405.071430-36.pom
Uploaded: file:/opt/repos/deploy-junk/org/apache/maven/plugins/maven-remote-resources-plugin/1.3-SNAPSHOT/maven-remote-resources-plugin-1.3-20110405.071430-36.pom
(13 KB at 734.4 KB/sec)
Downloading: file:/opt/repos/deploy-junk/org/apache/maven/plugins/maven-remote-resources-plugin/maven-metadata.xml
Downloaded: file:/opt/repos/deploy-junk/org/apache/maven/plugins/maven-remote-resources-plugin/maven-metadata.xml
(383 B at 19.7 KB/sec)
Downloading: file:/opt/repos/deploy-junk/org/apache/maven/plugins/maven-metadata.xml
Downloaded: file:/opt/repos/deploy-junk/org/apache/maven/plugins/maven-metadata.xml (7 KB
at 1746.3 KB/sec)
Uploading: file:/opt/repos/deploy-junk/org/apache/maven/plugins/maven-remote-resources-plugin/1.3-SNAPSHOT/maven-metadata.xml
Uploaded: file:/opt/repos/deploy-junk/org/apache/maven/plugins/maven-remote-resources-plugin/1.3-SNAPSHOT/maven-metadata.xml
(800 B at 260.4 KB/sec)
Uploading: file:/opt/repos/deploy-junk/org/apache/maven/plugins/maven-remote-resources-plugin/maven-metadata.xml
Uploaded: file:/opt/repos/deploy-junk/org/apache/maven/plugins/maven-remote-resources-plugin/maven-metadata.xml
(383 B at 124.7 KB/sec)
Uploading: file:/opt/repos/deploy-junk/org/apache/maven/plugins/maven-metadata.xml
Uploaded: file:/opt/repos/deploy-junk/org/apache/maven/plugins/maven-metadata.xml (7 KB at
2328.5 KB/sec)
[INFO]                                                                         
[INFO] ------------------------------------------------------------------------
[INFO] Building Maven Plugins Aggregator 1-SNAPSHOT
[INFO] ------------------------------------------------------------------------
[INFO] 
[INFO] --- maven-clean-plugin:2.4.1:clean (default-clean) @ maven-plugins-aggregator ---
[INFO] Deleting x:\slave\workspace\maven-plugins-ITs\jdk\java-5x\label\windows\trunk\target
[INFO] 
[INFO] --- maven-remote-resources-plugin:1.1:process (default) @ maven-plugins-aggregator
---
[INFO] 
[INFO] --- maven-install-plugin:2.3.1:install (default-install) @ maven-plugins-aggregator
---
[INFO] Installing x:\slave\workspace\maven-plugins-ITs\jdk\java-5x\label\windows\trunk\pom.xml
to x:\slave\workspace\maven-plugins-ITs\jdk\java-5x\label\windows\.repository\org\apache\maven\plugins\maven-plugins-aggregator\1-SNAPSHOT\maven-plugins-aggregator-1-SNAPSHOT.pom
[INFO] 
[INFO] --- maven-deploy-plugin:2.5:deploy (default-deploy) @ maven-plugins-aggregator ---
Downloading: file:/opt/repos/deploy-junk/org/apache/maven/plugins/maven-plugins-aggregator/1-SNAPSHOT/maven-metadata.xml
Downloaded: file:/opt/repos/deploy-junk/org/apache/maven/plugins/maven-plugins-aggregator/1-SNAPSHOT/maven-metadata.xml
(619 B at 18.9 KB/sec)
Uploading: file:/opt/repos/deploy-junk/org/apache/maven/plugins/maven-plugins-aggregator/1-SNAPSHOT/maven-plugins-aggregator-1-20110405.071430-59.pom
Uploaded: file:/opt/repos/deploy-junk/org/apache/maven/plugins/maven-plugins-aggregator/1-SNAPSHOT/maven-plugins-aggregator-1-20110405.071430-59.pom
(5 KB at 157.7 KB/sec)
Downloading: file:/opt/repos/deploy-junk/org/apache/maven/plugins/maven-plugins-aggregator/maven-metadata.xml
Downloaded: file:/opt/repos/deploy-junk/org/apache/maven/plugins/maven-plugins-aggregator/maven-metadata.xml
(304 B at 59.4 KB/sec)
Uploading: file:/opt/repos/deploy-junk/org/apache/maven/plugins/maven-plugins-aggregator/1-SNAPSHOT/maven-metadata.xml
Uploaded: file:/opt/repos/deploy-junk/org/apache/maven/plugins/maven-plugins-aggregator/1-SNAPSHOT/maven-metadata.xml
(619 B at 201.5 KB/sec)
Uploading: file:/opt/repos/deploy-junk/org/apache/maven/plugins/maven-plugins-aggregator/maven-metadata.xml
Uploaded: file:/opt/repos/deploy-junk/org/apache/maven/plugins/maven-plugins-aggregator/maven-metadata.xml
(304 B at 99.0 KB/sec)
[INFO] ------------------------------------------------------------------------
[INFO] Reactor Summary:
[INFO] 
[INFO] Maven Plugins ..................................... SUCCESS [19.396s]
[INFO] Maven ACR Plugin .................................. SUCCESS [38.353s]
[INFO] Maven Ant Plugin .................................. SUCCESS [2:20.056s]
[INFO] Maven AntRun Plugin ............................... SUCCESS [1:27.740s]
[INFO] Maven Eclipse Plugin .............................. SUCCESS [9:48.151s]
[INFO] Maven Changelog Plugin ............................ SUCCESS [55.403s]
[INFO] Maven Changes Report Plugin ....................... SUCCESS [1:34.281s]
[INFO] Maven Checkstyle Plugin ........................... SUCCESS [1:48.442s]
[INFO] Maven Clean Plugin ................................ SUCCESS [26.264s]
[INFO] Maven Compiler Plugin ............................. SUCCESS [33.091s]
[INFO] Maven Dependency Plugin ........................... SUCCESS [2:44.349s]
[INFO] Maven Deploy Plugin ............................... SUCCESS [1:58.321s]
[INFO] Maven DOAP Plugin ................................. SUCCESS [29.644s]
[INFO] Maven Documentation Checker Plugin ................ SUCCESS [8.284s]
[INFO] Maven EAR Plugin .................................. FAILURE [4:36.849s]
[INFO] Maven EJB Plugin .................................. SUCCESS [47.540s]
[INFO] Maven GPG Plugin .................................. SUCCESS [36.195s]
[INFO] Maven Help Plugin ................................. SUCCESS [1:15.516s]
[INFO] Maven IDEA Plugin ................................. SUCCESS [14.723s]
[INFO] Maven Install Plugin .............................. SUCCESS [1:12.383s]
[INFO] Maven JAR Plugin .................................. SUCCESS [2:13.631s]
[INFO] Maven Jarsigner Plugin ............................ SUCCESS [54.645s]
[INFO] Maven Javadoc Plugin .............................. SUCCESS [9:11.016s]
[INFO] Maven Linkcheck Plugin ............................ SUCCESS [3.982s]
[INFO] Maven One Plugin .................................. SUCCESS [3.053s]
[INFO] Maven Patch Plugin ................................ SUCCESS [20.782s]
[INFO] Maven PDF Plugin .................................. SUCCESS [40.187s]
[INFO] Maven PMD Plugin .................................. SUCCESS [1:04.952s]
[INFO] Maven RAR Plugin .................................. SUCCESS [11.287s]
[INFO] Maven Reactor Plugin .............................. SUCCESS [4.627s]
[INFO] Maven Repository Plugin ........................... SUCCESS [32.151s]
[INFO] Maven Resources Plugin ............................ SUCCESS [1:11.254s]
[INFO] Maven Shade Plugin ................................ SUCCESS [2:42.817s]
[INFO] Maven Site Plugin ................................. SUCCESS [1:18.560s]
[INFO] Maven Source Plugin ............................... SUCCESS [52.796s]
[INFO] Maven Stage Plugin ................................ SUCCESS [2.537s]
[INFO] Maven Toolchains Plugin ........................... SUCCESS [3.128s]
[INFO] Maven Verifier Plugin ............................. SUCCESS [16.128s]
[INFO] Maven WAR Plugin .................................. SUCCESS [1:40.944s]
[INFO] Maven Invoker Plugin .............................. SUCCESS [5:40.831s]
[INFO] Maven Project Info Reports Plugin ................. SUCCESS [3:19.309s]
[INFO] Maven Remote Resources Plugin ..................... SUCCESS [1:23.395s]
[INFO] Maven Plugins Aggregator .......................... SUCCESS [0.119s]
[INFO] ------------------------------------------------------------------------
[INFO] BUILD FAILURE
[INFO] ------------------------------------------------------------------------
[INFO] Total time: 1:07:48.838s
[INFO] Finished at: Tue Apr 05 00:14:30 PDT 2011
[INFO] Final Memory: 47M/87M
[INFO] ------------------------------------------------------------------------
[ERROR] Failed to execute goal org.apache.maven.plugins:maven-surefire-plugin:2.7.2:test (default)
on project maven-ear-plugin: There are test failures.
[ERROR] 
[ERROR] Please refer to X:\slave\workspace\maven-plugins-ITs\jdk\java-5x\label\windows\trunk\maven-ear-plugin\target\surefire-reports
for the individual test results.
[ERROR] -> [Help 1]
org.apache.maven.lifecycle.LifecycleExecutionException: Failed to execute goal org.apache.maven.plugins:maven-surefire-plugin:2.7.2:test
(default) on project maven-ear-plugin: There are test failures.

Please refer to X:\slave\workspace\maven-plugins-ITs\jdk\java-5x\label\windows\trunk\maven-ear-plugin\target\surefire-reports
for the individual test results.
	at org.apache.maven.lifecycle.internal.MojoExecutor.execute(MojoExecutor.java:213)
	at org.apache.maven.lifecycle.internal.MojoExecutor.execute(MojoExecutor.java:153)
	at org.apache.maven.lifecycle.internal.MojoExecutor.execute(MojoExecutor.java:145)
	at org.apache.maven.lifecycle.internal.LifecycleModuleBuilder.buildProject(LifecycleModuleBuilder.java:84)
	at org.apache.maven.lifecycle.internal.LifecycleModuleBuilder.buildProject(LifecycleModuleBuilder.java:59)
	at org.apache.maven.lifecycle.internal.LifecycleStarter.singleThreadedBuild(LifecycleStarter.java:183)
	at org.apache.maven.lifecycle.internal.LifecycleStarter.execute(LifecycleStarter.java:161)
	at org.apache.maven.DefaultMaven.doExecute(DefaultMaven.java:319)
	at org.apache.maven.DefaultMaven.execute(DefaultMaven.java:156)
	at org.apache.maven.cli.MavenCli.execute(MavenCli.java:537)
	at org.apache.maven.cli.MavenCli.doMain(MavenCli.java:196)
	at org.apache.maven.cli.MavenCli.main(MavenCli.java:141)
	at sun.reflect.NativeMethodAccessorImpl.invoke0(Native Method)
	at sun.reflect.NativeMethodAccessorImpl.invoke(NativeMethodAccessorImpl.java:39)
	at sun.reflect.DelegatingMethodAccessorImpl.invoke(DelegatingMethodAccessorImpl.java:25)
	at java.lang.reflect.Method.invoke(Method.java:592)
	at org.codehaus.plexus.classworlds.launcher.Launcher.launchEnhanced(Launcher.java:290)
	at org.codehaus.plexus.classworlds.launcher.Launcher.launch(Launcher.java:230)
	at org.codehaus.plexus.classworlds.launcher.Launcher.mainWithExitCode(Launcher.java:409)
	at org.codehaus.plexus.classworlds.launcher.Launcher.main(Launcher.java:352)
Caused by: org.apache.maven.plugin.MojoFailureException: There are test failures.

Please refer to X:\slave\workspace\maven-plugins-ITs\jdk\java-5x\label\windows\trunk\maven-ear-plugin\target\surefire-reports
for the individual test results.
	at org.apache.maven.plugin.surefire.SurefireHelper.reportExecution(SurefireHelper.java:74)
	at org.apache.maven.plugin.surefire.SurefirePlugin.execute(SurefirePlugin.java:642)
	at org.apache.maven.plugin.DefaultBuildPluginManager.executeMojo(DefaultBuildPluginManager.java:101)
	at org.apache.maven.lifecycle.internal.MojoExecutor.execute(MojoExecutor.java:209)
	... 19 more
[ERROR] 
[ERROR] Re-run Maven using the -X switch to enable full debug logging.
[ERROR] 
[ERROR] For more information about the errors and possible solutions, please read the following
articles:
[ERROR] [Help 1] http://cwiki.apache.org/confluence/display/MAVEN/MojoFailureException
[ERROR] 
[ERROR] After correcting the problems, you can resume the build with the command
[ERROR]   mvn <goals> -rf :maven-ear-plugin
Failed to send e-mail to snicoll because no e-mail address is known, and no default e-mail
domain is configured


Mime
View raw message