maven-notifications mailing list archives

Site index · List index
Message view « Date » · « Thread »
Top « Date » · « Thread »
From "GRiD .ORG" <bui...@lists.sonatype.com>
Subject Build failed in Hudson: maven-plugins-UTs » java-5x,ubuntu #1038
Date Wed, 20 Apr 2011 23:21:49 GMT
See <https://grid.sonatype.org/ci/job/maven-plugins-UTs/./jdk=java-5x,label=ubuntu/1038/changes>

Changes:

[Dennis Lundberg] [MCHANGES-231] Changes plugin doesn't use maven proxy settings

[Dennis Lundberg] [MCHANGES-236] Configured outputEncoding not used for writing changes-report.html
file
Submitted by: Oliver Schmitz-Hennemann
Reviewed by: Dennis Lundberg

- Patch applied with modifications

------------------------------------------
[...truncated 3826 lines...]
[INFO] Webapp assembled in [4 msecs]
[INFO] Building war: /opt/grid/slave/workspace/maven-plugins-UTs/jdk/java-5x/label/ubuntu/trunk/maven-war-plugin/target/test-classes/unit/warmojotest/SimpleWarWithMetaInfContent-output/simple.war
[INFO] WEB-INF/web.xml already added, skipping
[INFO] Packaging webapp
[INFO] Assembling webapp [maven-war-plugin-test] in [/opt/grid/slave/workspace/maven-plugins-UTs/jdk/java-5x/label/ubuntu/trunk/maven-war-plugin/target/test-classes/unit/warmojotest/SimpleWarWithContainerConfig]
[INFO] Processing war project
[INFO] Copying webapp resources [/opt/grid/slave/workspace/maven-plugins-UTs/jdk/java-5x/label/ubuntu/trunk/maven-war-plugin/target/test-classes/unit/warmojotest/SimpleWarWithContainerConfig-test-data/source]
[INFO] Webapp assembled in [4 msecs]
[INFO] Building war: /opt/grid/slave/workspace/maven-plugins-UTs/jdk/java-5x/label/ubuntu/trunk/maven-war-plugin/target/test-classes/unit/warmojotest/SimpleWarWithContainerConfig-output/simple.war
[INFO] WEB-INF/web.xml already added, skipping
[INFO] Packaging webapp
[INFO] Assembling webapp [maven-war-plugin-test] in [/opt/grid/slave/workspace/maven-plugins-UTs/jdk/java-5x/label/ubuntu/trunk/maven-war-plugin/target/test-classes/unit/warmojotest/SimpleWarMissingWebXmlFalse]
[INFO] Processing war project
[INFO] Copying webapp resources [/opt/grid/slave/workspace/maven-plugins-UTs/jdk/java-5x/label/ubuntu/trunk/maven-war-plugin/target/test-classes/unit/warmojotest/SimpleWarMissingWebXmlFalse-test-data/source]
[INFO] Webapp assembled in [4 msecs]
[INFO] Building war: /opt/grid/slave/workspace/maven-plugins-UTs/jdk/java-5x/label/ubuntu/trunk/maven-war-plugin/target/test-classes/unit/warmojotest/SimpleWarMissingWebXmlFalse-output/simple.war
[INFO] Packaging webapp
[INFO] Assembling webapp [maven-war-plugin-test] in [/opt/grid/slave/workspace/maven-plugins-UTs/jdk/java-5x/label/ubuntu/trunk/maven-war-plugin/target/test-classes/unit/warmojotest/SimpleWarMissingWebXmlTrue]
[INFO] Processing war project
[INFO] Copying webapp resources [/opt/grid/slave/workspace/maven-plugins-UTs/jdk/java-5x/label/ubuntu/trunk/maven-war-plugin/target/test-classes/unit/warmojotest/SimpleWarMissingWebXmlTrue-test-data/source]
[INFO] Webapp assembled in [4 msecs]
[INFO] Building war: /opt/grid/slave/workspace/maven-plugins-UTs/jdk/java-5x/label/ubuntu/trunk/maven-war-plugin/target/test-classes/unit/warmojotest/SimpleWarMissingWebXmlTrue-output/simple.war
[INFO] Packaging webapp
[INFO] Assembling webapp [maven-war-plugin-test] in [/opt/grid/slave/workspace/maven-plugins-UTs/jdk/java-5x/label/ubuntu/trunk/maven-war-plugin/target/test-classes/unit/warmojotest/AttachClasses]
[INFO] Processing war project
[INFO] Copying webapp resources [/opt/grid/slave/workspace/maven-plugins-UTs/jdk/java-5x/label/ubuntu/trunk/maven-war-plugin/target/test-classes/unit/warmojotest/AttachClasses-test-data/source]
[INFO] Webapp assembled in [16 msecs]
[INFO] Building war: /opt/grid/slave/workspace/maven-plugins-UTs/jdk/java-5x/label/ubuntu/trunk/maven-war-plugin/target/test-classes/unit/warmojotest/AttachClasses-output/simple.war
[INFO] WEB-INF/web.xml already added, skipping
[INFO] Packaging classes
[INFO] Building jar: /opt/grid/slave/workspace/maven-plugins-UTs/jdk/java-5x/label/ubuntu/trunk/maven-war-plugin/target/test-classes/unit/warmojotest/AttachClasses-output/simple-classes.jar
[INFO] Packaging webapp
[INFO] Assembling webapp [maven-war-plugin-test] in [/opt/grid/slave/workspace/maven-plugins-UTs/jdk/java-5x/label/ubuntu/trunk/maven-war-plugin/target/test-classes/unit/warmojotest/AttachClassesCustomClassifier]
[INFO] Processing war project
[INFO] Copying webapp resources [/opt/grid/slave/workspace/maven-plugins-UTs/jdk/java-5x/label/ubuntu/trunk/maven-war-plugin/target/test-classes/unit/warmojotest/AttachClassesCustomClassifier-test-data/source]
[INFO] Webapp assembled in [7 msecs]
[INFO] Building war: /opt/grid/slave/workspace/maven-plugins-UTs/jdk/java-5x/label/ubuntu/trunk/maven-war-plugin/target/test-classes/unit/warmojotest/AttachClassesCustomClassifier-output/simple.war
[INFO] WEB-INF/web.xml already added, skipping
[INFO] Packaging classes
[INFO] Building jar: /opt/grid/slave/workspace/maven-plugins-UTs/jdk/java-5x/label/ubuntu/trunk/maven-war-plugin/target/test-classes/unit/warmojotest/AttachClassesCustomClassifier-output/simple-mystuff.jar
Tests run: 11, Failures: 0, Errors: 0, Skipped: 0, Time elapsed: 8.454 sec
Running org.apache.maven.plugin.war.WarOverlaysTest
[INFO] Building jar: /opt/grid/slave/workspace/maven-plugins-UTs/jdk/java-5x/label/ubuntu/trunk/maven-war-plugin/target/test-overlays/overlay-full-1.war
[INFO] Building jar: /opt/grid/slave/workspace/maven-plugins-UTs/jdk/java-5x/label/ubuntu/trunk/maven-war-plugin/target/test-overlays/overlay-full-2.war
[INFO] Building jar: /opt/grid/slave/workspace/maven-plugins-UTs/jdk/java-5x/label/ubuntu/trunk/maven-war-plugin/target/test-overlays/overlay-full-3.war
[INFO] Exploding webapp
[INFO] Assembling webapp [maven-war-plugin-test] in [/opt/grid/slave/workspace/maven-plugins-UTs/jdk/java-5x/label/ubuntu/trunk/maven-war-plugin/target/test-classes/unit/waroverlays/no-overlay]
[INFO] Processing war project
[INFO] Copying webapp resources [/opt/grid/slave/workspace/maven-plugins-UTs/jdk/java-5x/label/ubuntu/trunk/maven-war-plugin/target/test-classes/unit/waroverlays/no-overlay-test-data/source]
[INFO] Webapp assembled in [4 msecs]
[INFO] Building jar: /opt/grid/slave/workspace/maven-plugins-UTs/jdk/java-5x/label/ubuntu/trunk/maven-war-plugin/target/test-overlays/overlay-one.war
[INFO] Exploding webapp
[INFO] Assembling webapp [maven-war-plugin-test] in [/opt/grid/slave/workspace/maven-plugins-UTs/jdk/java-5x/label/ubuntu/trunk/maven-war-plugin/target/test-classes/unit/waroverlays/default-overlay]
[INFO] Processing war project
[INFO] Copying webapp resources [/opt/grid/slave/workspace/maven-plugins-UTs/jdk/java-5x/label/ubuntu/trunk/maven-war-plugin/target/test-classes/unit/waroverlays/default-overlay-test-data/source]
[INFO] Processing overlay [ id wartests:overlay-one]
[INFO] Webapp assembled in [21 msecs]
[INFO] Building jar: /opt/grid/slave/workspace/maven-plugins-UTs/jdk/java-5x/label/ubuntu/trunk/maven-war-plugin/target/test-overlays/overlay-two.war
[INFO] Exploding webapp
[INFO] Assembling webapp [maven-war-plugin-test] in [/opt/grid/slave/workspace/maven-plugins-UTs/jdk/java-5x/label/ubuntu/trunk/maven-war-plugin/target/test-classes/unit/waroverlays/default-overlays]
[INFO] Processing war project
[INFO] Copying webapp resources [/opt/grid/slave/workspace/maven-plugins-UTs/jdk/java-5x/label/ubuntu/trunk/maven-war-plugin/target/test-classes/unit/waroverlays/default-overlays-test-data/source]
[INFO] Processing overlay [ id wartests:overlay-one]
[INFO] Processing overlay [ id wartests:overlay-two]
[INFO] Webapp assembled in [15 msecs]
[INFO] Exploding webapp
[INFO] Assembling webapp [maven-war-plugin-test] in [/opt/grid/slave/workspace/maven-plugins-UTs/jdk/java-5x/label/ubuntu/trunk/maven-war-plugin/target/test-classes/unit/waroverlays/scenario-one-default-settings]
[INFO] Processing war project
[INFO] Copying webapp resources [/opt/grid/slave/workspace/maven-plugins-UTs/jdk/java-5x/label/ubuntu/trunk/maven-war-plugin/target/test-classes/unit/waroverlays/scenario-one-default-settings-test-data/source]
[INFO] Processing overlay [ id wartests:overlay-full-1]
[INFO] Processing overlay [ id wartests:overlay-full-2]
[INFO] Processing overlay [ id wartests:overlay-full-3]
[INFO] Webapp assembled in [56 msecs]
[INFO] Exploding webapp
[INFO] Assembling webapp [maven-war-plugin-test] in [/opt/grid/slave/workspace/maven-plugins-UTs/jdk/java-5x/label/ubuntu/trunk/maven-war-plugin/target/test-classes/unit/waroverlays/scenario-one-overlay-settings]
[INFO] Processing war project
[INFO] Copying webapp resources [/opt/grid/slave/workspace/maven-plugins-UTs/jdk/java-5x/label/ubuntu/trunk/maven-war-plugin/target/test-classes/unit/waroverlays/scenario-one-overlay-settings-test-data/source]
[INFO] Processing overlay [ id wartests:overlay-full-1]
[INFO] Processing overlay [ id wartests:overlay-full-2]
[INFO] Processing overlay [ id wartests:overlay-full-3]
[INFO] Webapp assembled in [46 msecs]
[INFO] Exploding webapp
[INFO] Assembling webapp [maven-war-plugin-test] in [/opt/grid/slave/workspace/maven-plugins-UTs/jdk/java-5x/label/ubuntu/trunk/maven-war-plugin/target/test-classes/unit/waroverlays/scenario-one-full-settings]
[INFO] Processing war project
[INFO] Copying webapp resources [/opt/grid/slave/workspace/maven-plugins-UTs/jdk/java-5x/label/ubuntu/trunk/maven-war-plugin/target/test-classes/unit/waroverlays/scenario-one-full-settings-test-data/source]
[INFO] Processing overlay [ id wartests:overlay-full-1]
[INFO] Processing overlay [ id wartests:overlay-full-2]
[INFO] Processing overlay [ id wartests:overlay-full-3]
[INFO] Webapp assembled in [38 msecs]
[INFO] Exploding webapp
[INFO] Assembling webapp [maven-war-plugin-test] in [/opt/grid/slave/workspace/maven-plugins-UTs/jdk/java-5x/label/ubuntu/trunk/maven-war-plugin/target/test-classes/unit/waroverlays/overlays-includes-excludes-multiple-defs]
[INFO] Processing overlay [ id wartests:overlay-full-3]
[INFO] Processing overlay [ id wartests:overlay-full-1]
[INFO] Processing overlay [ id wartests:overlay-full-3]
[INFO] Processing war project
[INFO] Copying webapp resources [/opt/grid/slave/workspace/maven-plugins-UTs/jdk/java-5x/label/ubuntu/trunk/maven-war-plugin/target/test-classes/unit/waroverlays/overlays-includes-excludes-multiple-defs-test-data/source]
[INFO] Processing overlay [ id wartests:overlay-full-2]
[INFO] Webapp assembled in [81 msecs]
[INFO] Exploding webapp
[INFO] Assembling webapp [maven-war-plugin-test] in [/opt/grid/slave/workspace/maven-plugins-UTs/jdk/java-5x/label/ubuntu/trunk/maven-war-plugin/target/test-classes/unit/waroverlays/overlays-includes-excludes-multiple-defs2]
[INFO] Processing overlay [ id wartests:overlay-full-3]
[INFO] Processing overlay [ id wartests:overlay-full-1]
[INFO] Processing overlay [ id wartests:overlay-full-3]
[INFO] Processing war project
[INFO] Copying webapp resources [/opt/grid/slave/workspace/maven-plugins-UTs/jdk/java-5x/label/ubuntu/trunk/maven-war-plugin/target/test-classes/unit/waroverlays/overlays-includes-excludes-multiple-defs2-test-data/source]
[INFO] Processing overlay [ id wartests:overlay-full-2]
[INFO] Webapp assembled in [51 msecs]
[INFO] Exploding webapp
[INFO] Assembling webapp [maven-war-plugin-test] in [/opt/grid/slave/workspace/maven-plugins-UTs/jdk/java-5x/label/ubuntu/trunk/maven-war-plugin/target/test-classes/unit/waroverlays/cache-updated-overlay]
[INFO] Processing war project
[INFO] Copying webapp resources [/opt/grid/slave/workspace/maven-plugins-UTs/jdk/java-5x/label/ubuntu/trunk/maven-war-plugin/target/test-classes/unit/waroverlays/cache-updated-overlay-test-data/source]
[INFO] Processing overlay [ id wartests:overlay-one]
[INFO] Processing overlay [ id wartests:overlay-two]
[INFO] Webapp assembled in [15 msecs]
[INFO] Exploding webapp
[INFO] Assembling webapp [maven-war-plugin-test] in [/opt/grid/slave/workspace/maven-plugins-UTs/jdk/java-5x/label/ubuntu/trunk/maven-war-plugin/target/test-classes/unit/waroverlays/cache-updated-overlay]
[INFO] Processing war project
[INFO] Copying webapp resources [/opt/grid/slave/workspace/maven-plugins-UTs/jdk/java-5x/label/ubuntu/trunk/maven-war-plugin/target/test-classes/unit/waroverlays/cache-updated-overlay-test-data/source]
[INFO] Processing overlay [ id wartests:overlay-two]
[INFO] File [WEB-INF/web.xml] belonged to overlay [wartests:overlay-one] so it will be overwritten.
[INFO] File [index.jsp] belonged to overlay [wartests:overlay-one] so it will be overwritten.
[INFO] Processing overlay [ id wartests:overlay-one]
[INFO] Webapp assembled in [10 msecs]
[INFO] Exploding webapp
[INFO] Assembling webapp [maven-war-plugin-test] in [/opt/grid/slave/workspace/maven-plugins-UTs/jdk/java-5x/label/ubuntu/trunk/maven-war-plugin/target/test-classes/unit/waroverlays/cache-removed-overlay]
[INFO] Processing war project
[INFO] Copying webapp resources [/opt/grid/slave/workspace/maven-plugins-UTs/jdk/java-5x/label/ubuntu/trunk/maven-war-plugin/target/test-classes/unit/waroverlays/cache-removed-overlay-test-data/source]
[INFO] Processing overlay [ id wartests:overlay-one]
[INFO] Processing overlay [ id wartests:overlay-two]
[INFO] Webapp assembled in [19 msecs]
[INFO] Exploding webapp
[INFO] Assembling webapp [maven-war-plugin-test] in [/opt/grid/slave/workspace/maven-plugins-UTs/jdk/java-5x/label/ubuntu/trunk/maven-war-plugin/target/test-classes/unit/waroverlays/cache-removed-overlay]
[WARNING] Dependency [Dependency {groupId=wartests, artifactId=overlay-one, version=0.0-Test,
type=war}] has been removed from the project. If it was included in the build as an overlay,
consider cleaning the target directory of the project (mvn clean)
[INFO] Processing war project
[INFO] Copying webapp resources [/opt/grid/slave/workspace/maven-plugins-UTs/jdk/java-5x/label/ubuntu/trunk/maven-war-plugin/target/test-classes/unit/waroverlays/cache-removed-overlay-test-data/source]
[INFO] Processing overlay [ id wartests:overlay-two]
[WARNING] File [WEB-INF/web.xml] belonged to overlay [wartests:overlay-one] which does not
exist anymore in the current project. It is recommended to invoke clean if the dependencies
of the project changed.
[WARNING] File [index.jsp] belonged to overlay [wartests:overlay-one] which does not exist
anymore in the current project. It is recommended to invoke clean if the dependencies of the
project changed.
[INFO] Webapp assembled in [18 msecs]
Tests run: 11, Failures: 0, Errors: 0, Skipped: 0, Time elapsed: 2.318 sec

Results :

Tests run: 83, Failures: 0, Errors: 0, Skipped: 0

[INFO] [jar:jar {execution: default-jar}]
[INFO] Building jar: /opt/grid/slave/workspace/maven-plugins-UTs/jdk/java-5x/label/ubuntu/trunk/maven-war-plugin/target/maven-war-plugin-2.2-SNAPSHOT.jar
[INFO] [plugin:addPluginArtifactMetadata {execution: default-addPluginArtifactMetadata}]
[INFO] [install:install {execution: default-install}]
[INFO] Installing /opt/grid/slave/workspace/maven-plugins-UTs/jdk/java-5x/label/ubuntu/trunk/maven-war-plugin/target/maven-war-plugin-2.2-SNAPSHOT.jar
to <https://grid.sonatype.org/ci/job/maven-plugins-UTs/./jdk=java-5x,label=ubuntu/ws/.repository/org/apache/maven/plugins/maven-war-plugin/2.2-SNAPSHOT/maven-war-plugin-2.2-SNAPSHOT.jar>
[INFO] ------------------------------------------------------------------------
[INFO] Building Maven Plugins Aggregator
[INFO]    task-segment: [clean, install]
[INFO] ------------------------------------------------------------------------
[INFO] [clean:clean {execution: default-clean}]
[INFO] Deleting /opt/grid/slave/workspace/maven-plugins-UTs/jdk/java-5x/label/ubuntu/trunk/target
[INFO] [remote-resources:process {execution: default}]
[INFO] [site:attach-descriptor {execution: default-attach-descriptor}]
[INFO] [install:install {execution: default-install}]
[INFO] Installing /opt/grid/slave/workspace/maven-plugins-UTs/jdk/java-5x/label/ubuntu/trunk/pom.xml
to <https://grid.sonatype.org/ci/job/maven-plugins-UTs/./jdk=java-5x,label=ubuntu/ws/.repository/org/apache/maven/plugins/maven-plugins-aggregator/1-SNAPSHOT/maven-plugins-aggregator-1-SNAPSHOT.pom>
[INFO] 
[INFO] 
[INFO] ------------------------------------------------------------------------
[INFO] Reactor Summary:
[INFO] ------------------------------------------------------------------------
[INFO] Maven Plugins ......................................... SUCCESS [8.176s]
[INFO] Maven ACR Plugin ...................................... SUCCESS [6.304s]
[INFO] Maven Ant Plugin ...................................... SUCCESS [6.711s]
[INFO] Maven AntRun Plugin ................................... SUCCESS [2.008s]
[INFO] Maven Eclipse Plugin .................................. SUCCESS [35.287s]
[INFO] Maven Changelog Plugin ................................ SUCCESS [8.698s]
[INFO] Maven Changes Report Plugin ........................... SUCCESS [11.326s]
[INFO] Maven Checkstyle Plugin ............................... SUCCESS [16.232s]
[INFO] Maven Clean Plugin .................................... SUCCESS [3.839s]
[INFO] Maven Compiler Plugin ................................. SUCCESS [8.778s]
[INFO] Maven Dependency Plugin ............................... SUCCESS [2:38.539s]
[INFO] Maven Deploy Plugin ................................... SUCCESS [6.046s]
[INFO] Maven DOAP Plugin ..................................... SUCCESS [11.933s]
[INFO] Maven Documentation Checker Plugin .................... SUCCESS [2.366s]
[INFO] Maven EAR Plugin ...................................... SUCCESS [7.555s]
[INFO] Maven EJB Plugin ...................................... SUCCESS [12.029s]
[INFO] Maven GPG Plugin ...................................... SUCCESS [3.388s]
[INFO] Maven Help Plugin ..................................... SUCCESS [4.245s]
[INFO] Maven IDEA Plugin ..................................... SUCCESS [13.293s]
[INFO] Maven Install Plugin .................................. SUCCESS [4.287s]
[INFO] Maven JAR Plugin ...................................... SUCCESS [3.279s]
[INFO] Maven Jarsigner Plugin ................................ SUCCESS [1.917s]
[INFO] Maven Shade Plugin .................................... SUCCESS [6.829s]
[INFO] Maven Javadoc Plugin .................................. FAILED [5:08.143s]
[INFO] Maven Linkcheck Plugin ................................ SUCCESS [3.023s]
[INFO] Maven One Plugin ...................................... SUCCESS [5.781s]
[INFO] Maven Patch Plugin .................................... SUCCESS [1.950s]
[INFO] Maven PDF Plugin ...................................... SUCCESS [18.202s]
[INFO] Maven PMD Plugin ...................................... SUCCESS [9.337s]
[INFO] Maven RAR Plugin ...................................... SUCCESS [4.281s]
[INFO] Maven Reactor Plugin .................................. SUCCESS [3.786s]
[INFO] Maven Repository Plugin ............................... SUCCESS [6.572s]
[INFO] Maven Resources Plugin ................................ SUCCESS [5.926s]
[INFO] Maven Site Plugin ..................................... SUCCESS [18.313s]
[INFO] Maven Source Plugin ................................... SUCCESS [6.812s]
[INFO] Maven Stage Plugin .................................... SUCCESS [2.589s]
[INFO] Maven Toolchains Plugin ............................... SUCCESS [1.705s]
[INFO] Maven Verifier Plugin ................................. SUCCESS [2.727s]
[INFO] Maven WAR Plugin ...................................... SUCCESS [24.479s]
[INFO] Maven Plugins Aggregator .............................. SUCCESS [0.070s]
[INFO] ------------------------------------------------------------------------
[INFO] Error for project: Maven Javadoc Plugin (during install)
[INFO] ------------------------------------------------------------------------
[INFO] There are test failures.

Please refer to /opt/grid/slave/workspace/maven-plugins-UTs/jdk/java-5x/label/ubuntu/trunk/maven-javadoc-plugin/target/surefire-reports
for the individual test results.
[INFO] ------------------------------------------------------------------------
[INFO] Trace
org.apache.maven.BuildFailureException: There are test failures.

Please refer to /opt/grid/slave/workspace/maven-plugins-UTs/jdk/java-5x/label/ubuntu/trunk/maven-javadoc-plugin/target/surefire-reports
for the individual test results.
	at org.apache.maven.lifecycle.DefaultLifecycleExecutor.executeGoals(DefaultLifecycleExecutor.java:715)
	at org.apache.maven.lifecycle.DefaultLifecycleExecutor.executeGoalWithLifecycle(DefaultLifecycleExecutor.java:556)
	at org.apache.maven.lifecycle.DefaultLifecycleExecutor.executeGoal(DefaultLifecycleExecutor.java:535)
	at org.apache.maven.lifecycle.DefaultLifecycleExecutor.executeGoalAndHandleFailures(DefaultLifecycleExecutor.java:387)
	at org.apache.maven.lifecycle.DefaultLifecycleExecutor.executeTaskSegments(DefaultLifecycleExecutor.java:348)
	at org.apache.maven.lifecycle.DefaultLifecycleExecutor.execute(DefaultLifecycleExecutor.java:180)
	at org.apache.maven.DefaultMaven.doExecute(DefaultMaven.java:328)
	at org.apache.maven.DefaultMaven.execute(DefaultMaven.java:138)
	at org.apache.maven.cli.MavenCli.main(MavenCli.java:362)
	at org.apache.maven.cli.compat.CompatibleMain.main(CompatibleMain.java:60)
	at sun.reflect.NativeMethodAccessorImpl.invoke0(Native Method)
	at sun.reflect.NativeMethodAccessorImpl.invoke(NativeMethodAccessorImpl.java:39)
	at sun.reflect.DelegatingMethodAccessorImpl.invoke(DelegatingMethodAccessorImpl.java:25)
	at java.lang.reflect.Method.invoke(Method.java:592)
	at org.codehaus.classworlds.Launcher.launchEnhanced(Launcher.java:315)
	at org.codehaus.classworlds.Launcher.launch(Launcher.java:255)
	at org.codehaus.classworlds.Launcher.mainWithExitCode(Launcher.java:430)
	at org.codehaus.classworlds.Launcher.main(Launcher.java:375)
Caused by: org.apache.maven.plugin.MojoFailureException: There are test failures.

Please refer to /opt/grid/slave/workspace/maven-plugins-UTs/jdk/java-5x/label/ubuntu/trunk/maven-javadoc-plugin/target/surefire-reports
for the individual test results.
	at org.apache.maven.plugin.surefire.SurefireHelper.reportExecution(SurefireHelper.java:74)
	at org.apache.maven.plugin.surefire.SurefirePlugin.execute(SurefirePlugin.java:642)
	at org.apache.maven.plugin.DefaultPluginManager.executeMojo(DefaultPluginManager.java:490)
	at org.apache.maven.lifecycle.DefaultLifecycleExecutor.executeGoals(DefaultLifecycleExecutor.java:694)
	... 17 more
[INFO] ------------------------------------------------------------------------
[INFO] BUILD ERRORS
[INFO] ------------------------------------------------------------------------
[INFO] Total time: 12 minutes 48 seconds
[INFO] Finished at: Wed Apr 20 18:21:47 CDT 2011
[INFO] Final Memory: 167M/234M
[INFO] ------------------------------------------------------------------------


Mime
View raw message