maven-notifications mailing list archives

Site index · List index
Message view « Date » · « Thread »
Top « Date » · « Thread »
From "GRiD .ORG" <bui...@lists.sonatype.com>
Subject Build failed in Hudson: maven-plugins-UTs » java-5x,windows #1037
Date Tue, 19 Apr 2011 23:20:49 GMT
See <https://grid.sonatype.org/ci/job/maven-plugins-UTs/./jdk=java-5x,label=windows/1037/changes>

Changes:

[Dennis Lundberg] [MCHANGES-234] Add GitHub issue template

[Hervé Boutemy] trying to fix unit test on grid

[Lukas Theussl] revert r1091342

------------------------------------------
[...truncated 3808 lines...]
(webxml attribute is missing from war task, or ignoreWebxml attribute is specified as 'true')
[INFO] Packaging classes
[INFO] Building jar: X:\slave\workspace\maven-plugins-UTs\jdk\java-5x\label\windows\trunk\maven-war-plugin\target\test-classes\unit\warmojotest\AttachClassesCustomClassifier-output\simple-mystuff.jar
Tests run: 11, Failures: 0, Errors: 0, Skipped: 0, Time elapsed: 0.968 sec
Running org.apache.maven.plugin.war.WarOverlaysTest
[INFO] Building jar: X:\slave\workspace\maven-plugins-UTs\jdk\java-5x\label\windows\trunk\maven-war-plugin\target\test-overlays\overlay-full-1.war
[INFO] Building jar: X:\slave\workspace\maven-plugins-UTs\jdk\java-5x\label\windows\trunk\maven-war-plugin\target\test-overlays\overlay-full-2.war
[INFO] Building jar: X:\slave\workspace\maven-plugins-UTs\jdk\java-5x\label\windows\trunk\maven-war-plugin\target\test-overlays\overlay-full-3.war
[INFO] Exploding webapp
[INFO] Assembling webapp [maven-war-plugin-test] in [X:\slave\workspace\maven-plugins-UTs\jdk\java-5x\label\windows\trunk\maven-war-plugin\target\test-classes\unit\waroverlays\no-overlay]
[INFO] Processing war project
[INFO] Copying webapp resources [X:\slave\workspace\maven-plugins-UTs\jdk\java-5x\label\windows\trunk\maven-war-plugin\target\test-classes\unit\waroverlays\no-overlay-test-data\source]
[INFO] Webapp assembled in [8 msecs]
[INFO] Building jar: X:\slave\workspace\maven-plugins-UTs\jdk\java-5x\label\windows\trunk\maven-war-plugin\target\test-overlays\overlay-one.war
[INFO] Exploding webapp
[INFO] Assembling webapp [maven-war-plugin-test] in [X:\slave\workspace\maven-plugins-UTs\jdk\java-5x\label\windows\trunk\maven-war-plugin\target\test-classes\unit\waroverlays\default-overlay]
[INFO] Processing war project
[INFO] Copying webapp resources [X:\slave\workspace\maven-plugins-UTs\jdk\java-5x\label\windows\trunk\maven-war-plugin\target\test-classes\unit\waroverlays\default-overlay-test-data\source]
[INFO] Processing overlay [ id wartests:overlay-one]
[INFO] Webapp assembled in [23 msecs]
[INFO] Building jar: X:\slave\workspace\maven-plugins-UTs\jdk\java-5x\label\windows\trunk\maven-war-plugin\target\test-overlays\overlay-two.war
[INFO] Exploding webapp
[INFO] Assembling webapp [maven-war-plugin-test] in [X:\slave\workspace\maven-plugins-UTs\jdk\java-5x\label\windows\trunk\maven-war-plugin\target\test-classes\unit\waroverlays\default-overlays]
[INFO] Processing war project
[INFO] Copying webapp resources [X:\slave\workspace\maven-plugins-UTs\jdk\java-5x\label\windows\trunk\maven-war-plugin\target\test-classes\unit\waroverlays\default-overlays-test-data\source]
[INFO] Processing overlay [ id wartests:overlay-one]
[INFO] Processing overlay [ id wartests:overlay-two]
[INFO] Webapp assembled in [39 msecs]
[INFO] Exploding webapp
[INFO] Assembling webapp [maven-war-plugin-test] in [X:\slave\workspace\maven-plugins-UTs\jdk\java-5x\label\windows\trunk\maven-war-plugin\target\test-classes\unit\waroverlays\scenario-one-default-settings]
[INFO] Processing war project
[INFO] Copying webapp resources [X:\slave\workspace\maven-plugins-UTs\jdk\java-5x\label\windows\trunk\maven-war-plugin\target\test-classes\unit\waroverlays\scenario-one-default-settings-test-data\source]
[INFO] Processing overlay [ id wartests:overlay-full-1]
[INFO] Processing overlay [ id wartests:overlay-full-2]
[INFO] Processing overlay [ id wartests:overlay-full-3]
[INFO] Webapp assembled in [119 msecs]
[INFO] Exploding webapp
[INFO] Assembling webapp [maven-war-plugin-test] in [X:\slave\workspace\maven-plugins-UTs\jdk\java-5x\label\windows\trunk\maven-war-plugin\target\test-classes\unit\waroverlays\scenario-one-overlay-settings]
[INFO] Processing war project
[INFO] Copying webapp resources [X:\slave\workspace\maven-plugins-UTs\jdk\java-5x\label\windows\trunk\maven-war-plugin\target\test-classes\unit\waroverlays\scenario-one-overlay-settings-test-data\source]
[INFO] Processing overlay [ id wartests:overlay-full-1]
[INFO] Processing overlay [ id wartests:overlay-full-2]
[INFO] Processing overlay [ id wartests:overlay-full-3]
[INFO] Webapp assembled in [133 msecs]
[INFO] Exploding webapp
[INFO] Assembling webapp [maven-war-plugin-test] in [X:\slave\workspace\maven-plugins-UTs\jdk\java-5x\label\windows\trunk\maven-war-plugin\target\test-classes\unit\waroverlays\scenario-one-full-settings]
[INFO] Processing war project
[INFO] Copying webapp resources [X:\slave\workspace\maven-plugins-UTs\jdk\java-5x\label\windows\trunk\maven-war-plugin\target\test-classes\unit\waroverlays\scenario-one-full-settings-test-data\source]
[INFO] Processing overlay [ id wartests:overlay-full-1]
[INFO] Processing overlay [ id wartests:overlay-full-2]
[INFO] Processing overlay [ id wartests:overlay-full-3]
[INFO] Webapp assembled in [103 msecs]
[INFO] Exploding webapp
[INFO] Assembling webapp [maven-war-plugin-test] in [X:\slave\workspace\maven-plugins-UTs\jdk\java-5x\label\windows\trunk\maven-war-plugin\target\test-classes\unit\waroverlays\overlays-includes-excludes-multiple-defs]
[INFO] Processing overlay [ id wartests:overlay-full-3]
[INFO] Processing overlay [ id wartests:overlay-full-1]
[INFO] Processing overlay [ id wartests:overlay-full-3]
[INFO] Processing war project
[INFO] Copying webapp resources [X:\slave\workspace\maven-plugins-UTs\jdk\java-5x\label\windows\trunk\maven-war-plugin\target\test-classes\unit\waroverlays\overlays-includes-excludes-multiple-defs-test-data\source]
[INFO] Processing overlay [ id wartests:overlay-full-2]
[INFO] Webapp assembled in [111 msecs]
[INFO] Exploding webapp
[INFO] Assembling webapp [maven-war-plugin-test] in [X:\slave\workspace\maven-plugins-UTs\jdk\java-5x\label\windows\trunk\maven-war-plugin\target\test-classes\unit\waroverlays\overlays-includes-excludes-multiple-defs2]
[INFO] Processing overlay [ id wartests:overlay-full-3]
[INFO] Processing overlay [ id wartests:overlay-full-1]
[INFO] Processing overlay [ id wartests:overlay-full-3]
[INFO] Processing war project
[INFO] Copying webapp resources [X:\slave\workspace\maven-plugins-UTs\jdk\java-5x\label\windows\trunk\maven-war-plugin\target\test-classes\unit\waroverlays\overlays-includes-excludes-multiple-defs2-test-data\source]
[INFO] Processing overlay [ id wartests:overlay-full-2]
[INFO] Webapp assembled in [140 msecs]
[INFO] Exploding webapp
[INFO] Assembling webapp [maven-war-plugin-test] in [X:\slave\workspace\maven-plugins-UTs\jdk\java-5x\label\windows\trunk\maven-war-plugin\target\test-classes\unit\waroverlays\cache-updated-overlay]
[INFO] Processing war project
[INFO] Copying webapp resources [X:\slave\workspace\maven-plugins-UTs\jdk\java-5x\label\windows\trunk\maven-war-plugin\target\test-classes\unit\waroverlays\cache-updated-overlay-test-data\source]
[INFO] Processing overlay [ id wartests:overlay-one]
[INFO] Processing overlay [ id wartests:overlay-two]
[INFO] Webapp assembled in [33 msecs]
[INFO] Exploding webapp
[INFO] Assembling webapp [maven-war-plugin-test] in [X:\slave\workspace\maven-plugins-UTs\jdk\java-5x\label\windows\trunk\maven-war-plugin\target\test-classes\unit\waroverlays\cache-updated-overlay]
[INFO] Processing war project
[INFO] Copying webapp resources [X:\slave\workspace\maven-plugins-UTs\jdk\java-5x\label\windows\trunk\maven-war-plugin\target\test-classes\unit\waroverlays\cache-updated-overlay-test-data\source]
[INFO] Processing overlay [ id wartests:overlay-two]
[INFO] File [index.jsp] belonged to overlay [wartests:overlay-one] so it will be overwritten.
[INFO] File [WEB-INF/web.xml] belonged to overlay [wartests:overlay-one] so it will be overwritten.
[INFO] Processing overlay [ id wartests:overlay-one]
[INFO] Webapp assembled in [9 msecs]
[INFO] Exploding webapp
[INFO] Assembling webapp [maven-war-plugin-test] in [X:\slave\workspace\maven-plugins-UTs\jdk\java-5x\label\windows\trunk\maven-war-plugin\target\test-classes\unit\waroverlays\cache-removed-overlay]
[INFO] Processing war project
[INFO] Copying webapp resources [X:\slave\workspace\maven-plugins-UTs\jdk\java-5x\label\windows\trunk\maven-war-plugin\target\test-classes\unit\waroverlays\cache-removed-overlay-test-data\source]
[INFO] Processing overlay [ id wartests:overlay-one]
[INFO] Processing overlay [ id wartests:overlay-two]
[INFO] Webapp assembled in [39 msecs]
[INFO] Exploding webapp
[INFO] Assembling webapp [maven-war-plugin-test] in [X:\slave\workspace\maven-plugins-UTs\jdk\java-5x\label\windows\trunk\maven-war-plugin\target\test-classes\unit\waroverlays\cache-removed-overlay]
[WARNING] Dependency [Dependency {groupId=wartests, artifactId=overlay-one, version=0.0-Test,
type=war}] has been removed from the project. If it was included in the build as an overlay,
consider cleaning the target directory of the project (mvn clean)
[INFO] Processing war project
[INFO] Copying webapp resources [X:\slave\workspace\maven-plugins-UTs\jdk\java-5x\label\windows\trunk\maven-war-plugin\target\test-classes\unit\waroverlays\cache-removed-overlay-test-data\source]
[INFO] Processing overlay [ id wartests:overlay-two]
[WARNING] File [index.jsp] belonged to overlay [wartests:overlay-one] which does not exist
anymore in the current project. It is recommended to invoke clean if the dependencies of the
project changed.
[WARNING] File [WEB-INF/web.xml] belonged to overlay [wartests:overlay-one] which does not
exist anymore in the current project. It is recommended to invoke clean if the dependencies
of the project changed.
[INFO] Webapp assembled in [7 msecs]
Tests run: 11, Failures: 0, Errors: 0, Skipped: 0, Time elapsed: 1.827 sec
Running org.apache.maven.plugin.war.WarZipTest
[INFO] Packaging webapp
[INFO] Assembling webapp [maven-war-plugin-test] in [X:\slave\workspace\maven-plugins-UTs\jdk\java-5x\label\windows\trunk\maven-war-plugin\target\test-classes\unit\warziptest\one-zip]
[INFO] Processing war project
[INFO] Copying webapp resources [X:\slave\workspace\maven-plugins-UTs\jdk\java-5x\label\windows\trunk\maven-war-plugin\target\test-classes\unit\warziptest\one-zip-test-data\source]
[INFO] Processing overlay [ id zipGroupId:zipId]
[INFO] Webapp assembled in [31 msecs]
[INFO] Building war: X:\slave\workspace\maven-plugins-UTs\jdk\java-5x\label\windows\trunk\maven-war-plugin\target\test-classes\unit\warziptest\one-zip-output\simple.war
[WARNING] Warning: selected war files include a WEB-INF/web.xml which will be ignored 
(webxml attribute is missing from war task, or ignoreWebxml attribute is specified as 'true')
[INFO] Packaging webapp
[INFO] Assembling webapp [maven-war-plugin-test] in [X:\slave\workspace\maven-plugins-UTs\jdk\java-5x\label\windows\trunk\maven-war-plugin\target\test-classes\unit\warziptest\one-zip-overlay-targetPath]
[INFO] Processing war project
[INFO] Copying webapp resources [X:\slave\workspace\maven-plugins-UTs\jdk\java-5x\label\windows\trunk\maven-war-plugin\target\test-classes\unit\warziptest\one-zip-overlay-targetPath-test-data\source]
[INFO] Processing overlay [ id zipGroupId:zipId]
[INFO] Webapp assembled in [18 msecs]
[INFO] Building war: X:\slave\workspace\maven-plugins-UTs\jdk\java-5x\label\windows\trunk\maven-war-plugin\target\test-classes\unit\warziptest\one-zip-overlay-targetPath-output\simple.war
[WARNING] Warning: selected war files include a WEB-INF/web.xml which will be ignored 
(webxml attribute is missing from war task, or ignoreWebxml attribute is specified as 'true')
[INFO] Packaging webapp
[INFO] Assembling webapp [maven-war-plugin-test] in [X:\slave\workspace\maven-plugins-UTs\jdk\java-5x\label\windows\trunk\maven-war-plugin\target\test-classes\unit\warziptest\one-zip-overlay-skip]
[INFO] Processing war project
[INFO] Copying webapp resources [X:\slave\workspace\maven-plugins-UTs\jdk\java-5x\label\windows\trunk\maven-war-plugin\target\test-classes\unit\warziptest\one-zip-overlay-skip-test-data\source]
[INFO] Webapp assembled in [14 msecs]
[INFO] Building war: X:\slave\workspace\maven-plugins-UTs\jdk\java-5x\label\windows\trunk\maven-war-plugin\target\test-classes\unit\warziptest\one-zip-overlay-skip-output\simple.war
[WARNING] Warning: selected war files include a WEB-INF/web.xml which will be ignored 
(webxml attribute is missing from war task, or ignoreWebxml attribute is specified as 'true')
[INFO] Packaging webapp
[INFO] Assembling webapp [maven-war-plugin-test] in [X:\slave\workspace\maven-plugins-UTs\jdk\java-5x\label\windows\trunk\maven-war-plugin\target\test-classes\unit\warziptest\one-zip-overlay-skip]
[INFO] Processing war project
[INFO] Copying webapp resources [X:\slave\workspace\maven-plugins-UTs\jdk\java-5x\label\windows\trunk\maven-war-plugin\target\test-classes\unit\warziptest\one-zip-overlay-skip-test-data\source]
[INFO] Skipping overlay [ id zipGroupId:zipId]
[INFO] Webapp assembled in [8 msecs]
[INFO] Building war: X:\slave\workspace\maven-plugins-UTs\jdk\java-5x\label\windows\trunk\maven-war-plugin\target\test-classes\unit\warziptest\one-zip-overlay-skip-output\simple.war
[WARNING] Warning: selected war files include a WEB-INF/web.xml which will be ignored 
(webxml attribute is missing from war task, or ignoreWebxml attribute is specified as 'true')
Tests run: 4, Failures: 0, Errors: 0, Skipped: 0, Time elapsed: 0.415 sec

Results :

Tests run: 83, Failures: 0, Errors: 0, Skipped: 0

[INFO] [jar:jar {execution: default-jar}]
[INFO] Building jar: X:\slave\workspace\maven-plugins-UTs\jdk\java-5x\label\windows\trunk\maven-war-plugin\target\maven-war-plugin-2.2-SNAPSHOT.jar
[INFO] [plugin:addPluginArtifactMetadata {execution: default-addPluginArtifactMetadata}]
[INFO] [install:install {execution: default-install}]
[INFO] Installing X:\slave\workspace\maven-plugins-UTs\jdk\java-5x\label\windows\trunk\maven-war-plugin\target\maven-war-plugin-2.2-SNAPSHOT.jar
to x:\slave\workspace\maven-plugins-UTs\jdk\java-5x\label\windows\.repository\org\apache\maven\plugins\maven-war-plugin\2.2-SNAPSHOT\maven-war-plugin-2.2-SNAPSHOT.jar
[INFO] ------------------------------------------------------------------------
[INFO] Building Maven Plugins Aggregator
[INFO]    task-segment: [clean, install]
[INFO] ------------------------------------------------------------------------
[INFO] [clean:clean {execution: default-clean}]
[INFO] Deleting x:\slave\workspace\maven-plugins-UTs\jdk\java-5x\label\windows\trunk\target
[INFO] [remote-resources:process {execution: default}]
[INFO] [site:attach-descriptor {execution: default-attach-descriptor}]
[INFO] [install:install {execution: default-install}]
[INFO] Installing x:\slave\workspace\maven-plugins-UTs\jdk\java-5x\label\windows\trunk\pom.xml
to x:\slave\workspace\maven-plugins-UTs\jdk\java-5x\label\windows\.repository\org\apache\maven\plugins\maven-plugins-aggregator\1-SNAPSHOT\maven-plugins-aggregator-1-SNAPSHOT.pom
[INFO] 
[INFO] 
[INFO] ------------------------------------------------------------------------
[INFO] Reactor Summary:
[INFO] ------------------------------------------------------------------------
[INFO] Maven Plugins ......................................... SUCCESS [9.406s]
[INFO] Maven ACR Plugin ...................................... SUCCESS [29.838s]
[INFO] Maven Ant Plugin ...................................... SUCCESS [10.553s]
[INFO] Maven AntRun Plugin ................................... SUCCESS [2.725s]
[INFO] Maven Eclipse Plugin .................................. SUCCESS [21.100s]
[INFO] Maven Changelog Plugin ................................ SUCCESS [11.086s]
[INFO] Maven Changes Report Plugin ........................... SUCCESS [8.089s]
[INFO] Maven Checkstyle Plugin ............................... SUCCESS [17.049s]
[INFO] Maven Clean Plugin .................................... SUCCESS [3.439s]
[INFO] Maven Compiler Plugin ................................. SUCCESS [9.289s]
[INFO] Maven Dependency Plugin ............................... SUCCESS [56.078s]
[INFO] Maven Deploy Plugin ................................... SUCCESS [5.892s]
[INFO] Maven DOAP Plugin ..................................... SUCCESS [14.396s]
[INFO] Maven Documentation Checker Plugin .................... SUCCESS [1.780s]
[INFO] Maven EAR Plugin ...................................... SUCCESS [4.858s]
[INFO] Maven EJB Plugin ...................................... SUCCESS [4.675s]
[INFO] Maven GPG Plugin ...................................... SUCCESS [1.299s]
[INFO] Maven Help Plugin ..................................... SUCCESS [5.626s]
[INFO] Maven IDEA Plugin ..................................... SUCCESS [12.632s]
[INFO] Maven Install Plugin .................................. SUCCESS [5.969s]
[INFO] Maven JAR Plugin ...................................... SUCCESS [2.742s]
[INFO] Maven Jarsigner Plugin ................................ SUCCESS [2.620s]
[INFO] Maven Shade Plugin .................................... SUCCESS [6.189s]
[INFO] Maven Javadoc Plugin .................................. FAILED [5:12.639s]
[INFO] Maven Linkcheck Plugin ................................ SUCCESS [2.455s]
[INFO] Maven One Plugin ...................................... SUCCESS [5.967s]
[INFO] Maven Patch Plugin .................................... SUCCESS [1.190s]
[INFO] Maven PDF Plugin ...................................... SUCCESS [14.720s]
[INFO] Maven PMD Plugin ...................................... SUCCESS [9.418s]
[INFO] Maven RAR Plugin ...................................... SUCCESS [3.022s]
[INFO] Maven Reactor Plugin .................................. SUCCESS [5.296s]
[INFO] Maven Repository Plugin ............................... SUCCESS [5.136s]
[INFO] Maven Resources Plugin ................................ SUCCESS [5.998s]
[INFO] Maven Site Plugin ..................................... SUCCESS [15.810s]
[INFO] Maven Source Plugin ................................... SUCCESS [4.699s]
[INFO] Maven Stage Plugin .................................... SUCCESS [2.283s]
[INFO] Maven Toolchains Plugin ............................... SUCCESS [1.940s]
[INFO] Maven Verifier Plugin ................................. SUCCESS [2.210s]
[INFO] Maven WAR Plugin ...................................... SUCCESS [14.012s]
[INFO] Maven Plugins Aggregator .............................. SUCCESS [0.029s]
[INFO] ------------------------------------------------------------------------
[INFO] Error for project: Maven Javadoc Plugin (during install)
[INFO] ------------------------------------------------------------------------
[INFO] There are test failures.

Please refer to X:\slave\workspace\maven-plugins-UTs\jdk\java-5x\label\windows\trunk\maven-javadoc-plugin\target\surefire-reports
for the individual test results.
[INFO] ------------------------------------------------------------------------
[INFO] Trace
org.apache.maven.BuildFailureException: There are test failures.

Please refer to X:\slave\workspace\maven-plugins-UTs\jdk\java-5x\label\windows\trunk\maven-javadoc-plugin\target\surefire-reports
for the individual test results.
	at org.apache.maven.lifecycle.DefaultLifecycleExecutor.executeGoals(DefaultLifecycleExecutor.java:715)
	at org.apache.maven.lifecycle.DefaultLifecycleExecutor.executeGoalWithLifecycle(DefaultLifecycleExecutor.java:556)
	at org.apache.maven.lifecycle.DefaultLifecycleExecutor.executeGoal(DefaultLifecycleExecutor.java:535)
	at org.apache.maven.lifecycle.DefaultLifecycleExecutor.executeGoalAndHandleFailures(DefaultLifecycleExecutor.java:387)
	at org.apache.maven.lifecycle.DefaultLifecycleExecutor.executeTaskSegments(DefaultLifecycleExecutor.java:348)
	at org.apache.maven.lifecycle.DefaultLifecycleExecutor.execute(DefaultLifecycleExecutor.java:180)
	at org.apache.maven.DefaultMaven.doExecute(DefaultMaven.java:328)
	at org.apache.maven.DefaultMaven.execute(DefaultMaven.java:138)
	at org.apache.maven.cli.MavenCli.main(MavenCli.java:362)
	at org.apache.maven.cli.compat.CompatibleMain.main(CompatibleMain.java:60)
	at sun.reflect.NativeMethodAccessorImpl.invoke0(Native Method)
	at sun.reflect.NativeMethodAccessorImpl.invoke(NativeMethodAccessorImpl.java:39)
	at sun.reflect.DelegatingMethodAccessorImpl.invoke(DelegatingMethodAccessorImpl.java:25)
	at java.lang.reflect.Method.invoke(Method.java:592)
	at org.codehaus.classworlds.Launcher.launchEnhanced(Launcher.java:315)
	at org.codehaus.classworlds.Launcher.launch(Launcher.java:255)
	at org.codehaus.classworlds.Launcher.mainWithExitCode(Launcher.java:430)
	at org.codehaus.classworlds.Launcher.main(Launcher.java:375)
Caused by: org.apache.maven.plugin.MojoFailureException: There are test failures.

Please refer to X:\slave\workspace\maven-plugins-UTs\jdk\java-5x\label\windows\trunk\maven-javadoc-plugin\target\surefire-reports
for the individual test results.
	at org.apache.maven.plugin.surefire.SurefireHelper.reportExecution(SurefireHelper.java:74)
	at org.apache.maven.plugin.surefire.SurefirePlugin.execute(SurefirePlugin.java:642)
	at org.apache.maven.plugin.DefaultPluginManager.executeMojo(DefaultPluginManager.java:490)
	at org.apache.maven.lifecycle.DefaultLifecycleExecutor.executeGoals(DefaultLifecycleExecutor.java:694)
	... 17 more
[INFO] ------------------------------------------------------------------------
[INFO] BUILD ERRORS
[INFO] ------------------------------------------------------------------------
[INFO] Total time: 10 minutes 56 seconds
[INFO] Finished at: Tue Apr 19 16:20:48 PDT 2011
[INFO] Final Memory: 103M/185M
[INFO] ------------------------------------------------------------------------


Mime
View raw message