maven-notifications mailing list archives

Site index · List index
Message view « Date » · « Thread »
Top « Date » · « Thread »
From "GRiD .ORG" <bui...@lists.sonatype.com>
Subject Build failed in Hudson: maven-plugins-ITs » java-5x,windows #663
Date Fri, 15 Apr 2011 07:13:23 GMT
See <https://grid.sonatype.org/ci/job/maven-plugins-ITs/./jdk=java-5x,label=windows/663/changes>

Changes:

[Dennis Lundberg] [MCHECKSTYLE-149] supressionsFileExpression does not work
Submitted by: Idcmp
Reviewed by: Dennis Lundberg

[Dennis Lundberg] [MCHECKSTYLE-153] Checkstyle doesn't run on projects containing only test
classes
Submitted by: Bruce Mackenzie Nielsen
Reviewed by: Dennis Lundberg

------------------------------------------
[...truncated 6980 lines...]
[INFO] --- maven-plugin-plugin:2.7:descriptor (default-descriptor) @ maven-remote-resources-plugin
---
[INFO] Using 'UTF-8' encoding to read mojo metadata.
[INFO] Applying mojo extractor for language: java
[INFO] Mojo extractor for language: java found 3 mojo descriptors.
[INFO] Applying mojo extractor for language: bsh
[INFO] Mojo extractor for language: bsh found 0 mojo descriptors.
[INFO] 
[INFO] --- maven-remote-resources-plugin:1.1:process (default) @ maven-remote-resources-plugin
---
[INFO] 
[INFO] --- maven-resources-plugin:2.4.3:resources (default-resources) @ maven-remote-resources-plugin
---
[INFO] Using 'UTF-8' encoding to copy filtered resources.
[INFO] Copying 1 resource
[INFO] Copying 3 resources
[INFO] 
[INFO] --- maven-compiler-plugin:2.3.2:compile (default-compile) @ maven-remote-resources-plugin
---
[INFO] Compiling 11 source files to X:\slave\workspace\maven-plugins-ITs\jdk\java-5x\label\windows\trunk\maven-remote-resources-plugin\target\classes
[INFO] 
[INFO] --- maven-resources-plugin:2.4.3:testResources (default-testResources) @ maven-remote-resources-plugin
---
[INFO] Using 'UTF-8' encoding to copy filtered resources.
[INFO] Copying 7 resources
[INFO] Copying 42 resources
[INFO] Copying 1 resource
[INFO] Copying 3 resources
[INFO] 
[INFO] --- maven-compiler-plugin:2.3.2:testCompile (default-testCompile) @ maven-remote-resources-plugin
---
[INFO] Compiling 17 source files to X:\slave\workspace\maven-plugins-ITs\jdk\java-5x\label\windows\trunk\maven-remote-resources-plugin\target\test-classes
[INFO] 
[INFO] --- maven-surefire-plugin:2.7.2:test (default-test) @ maven-remote-resources-plugin
---
[INFO] Surefire report directory: X:\slave\workspace\maven-plugins-ITs\jdk\java-5x\label\windows\trunk\maven-remote-resources-plugin\target\surefire-reports

-------------------------------------------------------
 T E S T S
-------------------------------------------------------
Running org.apache.maven.plugin.resources.remote.RemoteResourcesMojoTest
Tests run: 8, Failures: 0, Errors: 0, Skipped: 0, Time elapsed: 1.913 sec

Results :

Tests run: 8, Failures: 0, Errors: 0, Skipped: 0

[INFO] 
[INFO] --- maven-jar-plugin:2.3.1:jar (default-jar) @ maven-remote-resources-plugin ---
[INFO] Building jar: X:\slave\workspace\maven-plugins-ITs\jdk\java-5x\label\windows\trunk\maven-remote-resources-plugin\target\maven-remote-resources-plugin-1.3-SNAPSHOT.jar
[INFO] 
[INFO] --- maven-plugin-plugin:2.7:addPluginArtifactMetadata (default-addPluginArtifactMetadata)
@ maven-remote-resources-plugin ---
[INFO] 
[INFO] --- maven-invoker-plugin:1.5:install (install-descriptor) @ maven-remote-resources-plugin
---
[INFO] Installing X:\slave\workspace\maven-plugins-ITs\jdk\java-5x\label\windows\trunk\maven-remote-resources-plugin\pom.xml
to X:\slave\workspace\maven-plugins-ITs\jdk\java-5x\label\windows\trunk\maven-remote-resources-plugin\target\it-repo\org\apache\maven\plugins\maven-remote-resources-plugin\1.3-SNAPSHOT\maven-remote-resources-plugin-1.3-SNAPSHOT.pom
[INFO] Installing X:\slave\workspace\maven-plugins-ITs\jdk\java-5x\label\windows\trunk\maven-remote-resources-plugin\target\maven-remote-resources-plugin-1.3-SNAPSHOT.jar
to X:\slave\workspace\maven-plugins-ITs\jdk\java-5x\label\windows\trunk\maven-remote-resources-plugin\target\it-repo\org\apache\maven\plugins\maven-remote-resources-plugin\1.3-SNAPSHOT\maven-remote-resources-plugin-1.3-SNAPSHOT.jar
[INFO] 
[INFO] --- maven-surefire-plugin:2.7.2:test (integration-tests) @ maven-remote-resources-plugin
---
[INFO] Surefire report directory: X:\slave\workspace\maven-plugins-ITs\jdk\java-5x\label\windows\trunk\maven-remote-resources-plugin\target\surefire-reports

-------------------------------------------------------
 T E S T S
-------------------------------------------------------
Running org.apache.maven.plugin.resources.remote.it.IT_BadDependencyPoms
Tests run: 1, Failures: 0, Errors: 0, Skipped: 0, Time elapsed: 23.213 sec
Running org.apache.maven.plugin.resources.remote.it.IT_CustomFilterDelimiter
Tests run: 1, Failures: 0, Errors: 0, Skipped: 0, Time elapsed: 4.193 sec
Running org.apache.maven.plugin.resources.remote.it.IT_FilterLocalOverride
Tests run: 1, Failures: 0, Errors: 0, Skipped: 0, Time elapsed: 3.854 sec
Running org.apache.maven.plugin.resources.remote.it.IT_GenerateFromBundle
Tests run: 1, Failures: 0, Errors: 0, Skipped: 0, Time elapsed: 3.947 sec
Running org.apache.maven.plugin.resources.remote.it.IT_GenerateFromOverride
Tests run: 1, Failures: 0, Errors: 0, Skipped: 0, Time elapsed: 3.844 sec
Running org.apache.maven.plugin.resources.remote.it.IT_GetDependencyProjects
Tests run: 1, Failures: 0, Errors: 0, Skipped: 0, Time elapsed: 14.163 sec
Running org.apache.maven.plugin.resources.remote.it.IT_RunOnlyAtExecutionRoot
Tests run: 1, Failures: 0, Errors: 0, Skipped: 0, Time elapsed: 14.529 sec
Running org.apache.maven.plugin.resources.remote.it.IT_SupplementalArtifact
Tests run: 1, Failures: 0, Errors: 0, Skipped: 0, Time elapsed: 10.676 sec

Results :

Tests run: 8, Failures: 0, Errors: 0, Skipped: 0

[INFO] 
[INFO] --- maven-install-plugin:2.3.1:install (default-install) @ maven-remote-resources-plugin
---
[INFO] Installing X:\slave\workspace\maven-plugins-ITs\jdk\java-5x\label\windows\trunk\maven-remote-resources-plugin\target\maven-remote-resources-plugin-1.3-SNAPSHOT.jar
to x:\slave\workspace\maven-plugins-ITs\jdk\java-5x\label\windows\.repository\org\apache\maven\plugins\maven-remote-resources-plugin\1.3-SNAPSHOT\maven-remote-resources-plugin-1.3-SNAPSHOT.jar
[INFO] Installing X:\slave\workspace\maven-plugins-ITs\jdk\java-5x\label\windows\trunk\maven-remote-resources-plugin\pom.xml
to x:\slave\workspace\maven-plugins-ITs\jdk\java-5x\label\windows\.repository\org\apache\maven\plugins\maven-remote-resources-plugin\1.3-SNAPSHOT\maven-remote-resources-plugin-1.3-SNAPSHOT.pom
[INFO] 
[INFO] --- maven-deploy-plugin:2.5:deploy (default-deploy) @ maven-remote-resources-plugin
---
Downloading: file:/opt/repos/deploy-junk/org/apache/maven/plugins/maven-remote-resources-plugin/1.3-SNAPSHOT/maven-metadata.xml
Downloaded: file:/opt/repos/deploy-junk/org/apache/maven/plugins/maven-remote-resources-plugin/1.3-SNAPSHOT/maven-metadata.xml
(800 B at 13.0 KB/sec)
Uploading: file:/opt/repos/deploy-junk/org/apache/maven/plugins/maven-remote-resources-plugin/1.3-SNAPSHOT/maven-remote-resources-plugin-1.3-20110415.071321-42.jar
Uploaded: file:/opt/repos/deploy-junk/org/apache/maven/plugins/maven-remote-resources-plugin/1.3-SNAPSHOT/maven-remote-resources-plugin-1.3-20110415.071321-42.jar
(63 KB at 2422.9 KB/sec)
Uploading: file:/opt/repos/deploy-junk/org/apache/maven/plugins/maven-remote-resources-plugin/1.3-SNAPSHOT/maven-remote-resources-plugin-1.3-20110415.071321-42.pom
Uploaded: file:/opt/repos/deploy-junk/org/apache/maven/plugins/maven-remote-resources-plugin/1.3-SNAPSHOT/maven-remote-resources-plugin-1.3-20110415.071321-42.pom
(13 KB at 2080.9 KB/sec)
Downloading: file:/opt/repos/deploy-junk/org/apache/maven/plugins/maven-remote-resources-plugin/maven-metadata.xml
Downloaded: file:/opt/repos/deploy-junk/org/apache/maven/plugins/maven-remote-resources-plugin/maven-metadata.xml
(383 B at 26.7 KB/sec)
Downloading: file:/opt/repos/deploy-junk/org/apache/maven/plugins/maven-metadata.xml
Downloaded: file:/opt/repos/deploy-junk/org/apache/maven/plugins/maven-metadata.xml (7 KB
at 1164.2 KB/sec)
Uploading: file:/opt/repos/deploy-junk/org/apache/maven/plugins/maven-remote-resources-plugin/1.3-SNAPSHOT/maven-metadata.xml
Uploaded: file:/opt/repos/deploy-junk/org/apache/maven/plugins/maven-remote-resources-plugin/1.3-SNAPSHOT/maven-metadata.xml
(800 B at 156.2 KB/sec)
Uploading: file:/opt/repos/deploy-junk/org/apache/maven/plugins/maven-remote-resources-plugin/maven-metadata.xml
Uploaded: file:/opt/repos/deploy-junk/org/apache/maven/plugins/maven-remote-resources-plugin/maven-metadata.xml
(383 B at 124.7 KB/sec)
Uploading: file:/opt/repos/deploy-junk/org/apache/maven/plugins/maven-metadata.xml
Uploaded: file:/opt/repos/deploy-junk/org/apache/maven/plugins/maven-metadata.xml (7 KB at
2328.5 KB/sec)
[INFO]                                                                         
[INFO] ------------------------------------------------------------------------
[INFO] Building Maven Plugins Aggregator 1-SNAPSHOT
[INFO] ------------------------------------------------------------------------
[INFO] 
[INFO] --- maven-clean-plugin:2.4.1:clean (default-clean) @ maven-plugins-aggregator ---
[INFO] Deleting x:\slave\workspace\maven-plugins-ITs\jdk\java-5x\label\windows\trunk\target
[INFO] 
[INFO] --- maven-remote-resources-plugin:1.1:process (default) @ maven-plugins-aggregator
---
[INFO] 
[INFO] --- maven-install-plugin:2.3.1:install (default-install) @ maven-plugins-aggregator
---
[INFO] Installing x:\slave\workspace\maven-plugins-ITs\jdk\java-5x\label\windows\trunk\pom.xml
to x:\slave\workspace\maven-plugins-ITs\jdk\java-5x\label\windows\.repository\org\apache\maven\plugins\maven-plugins-aggregator\1-SNAPSHOT\maven-plugins-aggregator-1-SNAPSHOT.pom
[INFO] 
[INFO] --- maven-deploy-plugin:2.5:deploy (default-deploy) @ maven-plugins-aggregator ---
Downloading: file:/opt/repos/deploy-junk/org/apache/maven/plugins/maven-plugins-aggregator/1-SNAPSHOT/maven-metadata.xml
Downloaded: file:/opt/repos/deploy-junk/org/apache/maven/plugins/maven-plugins-aggregator/1-SNAPSHOT/maven-metadata.xml
(619 B at 14.4 KB/sec)
Uploading: file:/opt/repos/deploy-junk/org/apache/maven/plugins/maven-plugins-aggregator/1-SNAPSHOT/maven-plugins-aggregator-1-20110415.071321-65.pom
Uploaded: file:/opt/repos/deploy-junk/org/apache/maven/plugins/maven-plugins-aggregator/1-SNAPSHOT/maven-plugins-aggregator-1-20110415.071321-65.pom
(5 KB at 195.3 KB/sec)
Downloading: file:/opt/repos/deploy-junk/org/apache/maven/plugins/maven-plugins-aggregator/maven-metadata.xml
Downloaded: file:/opt/repos/deploy-junk/org/apache/maven/plugins/maven-plugins-aggregator/maven-metadata.xml
(304 B at 74.2 KB/sec)
Uploading: file:/opt/repos/deploy-junk/org/apache/maven/plugins/maven-plugins-aggregator/1-SNAPSHOT/maven-metadata.xml
Uploaded: file:/opt/repos/deploy-junk/org/apache/maven/plugins/maven-plugins-aggregator/1-SNAPSHOT/maven-metadata.xml
(619 B at 151.1 KB/sec)
Uploading: file:/opt/repos/deploy-junk/org/apache/maven/plugins/maven-plugins-aggregator/maven-metadata.xml
Uploaded: file:/opt/repos/deploy-junk/org/apache/maven/plugins/maven-plugins-aggregator/maven-metadata.xml
(304 B at 99.0 KB/sec)
[INFO] ------------------------------------------------------------------------
[INFO] Reactor Summary:
[INFO] 
[INFO] Maven Plugins ..................................... SUCCESS [28.969s]
[INFO] Maven ACR Plugin .................................. SUCCESS [47.719s]
[INFO] Maven Ant Plugin .................................. SUCCESS [2:23.350s]
[INFO] Maven AntRun Plugin ............................... SUCCESS [1:21.248s]
[INFO] Maven Eclipse Plugin .............................. SUCCESS [10:23.589s]
[INFO] Maven Changelog Plugin ............................ SUCCESS [59.825s]
[INFO] Maven Changes Report Plugin ....................... SUCCESS [1:26.132s]
[INFO] Maven Checkstyle Plugin ........................... SUCCESS [1:48.482s]
[INFO] Maven Clean Plugin ................................ SUCCESS [23.736s]
[INFO] Maven Compiler Plugin ............................. SUCCESS [33.362s]
[INFO] Maven Dependency Plugin ........................... FAILURE [59.862s]
[INFO] Maven Deploy Plugin ............................... SUCCESS [2:21.225s]
[INFO] Maven DOAP Plugin ................................. SUCCESS [29.376s]
[INFO] Maven Documentation Checker Plugin ................ SUCCESS [9.673s]
[INFO] Maven EAR Plugin .................................. SUCCESS [5:15.493s]
[INFO] Maven EJB Plugin .................................. SUCCESS [47.610s]
[INFO] Maven GPG Plugin .................................. SUCCESS [40.163s]
[INFO] Maven Help Plugin ................................. SUCCESS [1:19.454s]
[INFO] Maven IDEA Plugin ................................. SUCCESS [14.393s]
[INFO] Maven Install Plugin .............................. SUCCESS [1:10.705s]
[INFO] Maven JAR Plugin .................................. SUCCESS [1:55.371s]
[INFO] Maven Jarsigner Plugin ............................ SUCCESS [52.607s]
[INFO] Maven Javadoc Plugin .............................. SUCCESS [9:04.231s]
[INFO] Maven Linkcheck Plugin ............................ SUCCESS [2.011s]
[INFO] Maven One Plugin .................................. SUCCESS [3.410s]
[INFO] Maven Patch Plugin ................................ SUCCESS [16.573s]
[INFO] Maven PDF Plugin .................................. SUCCESS [39.138s]
[INFO] Maven PMD Plugin .................................. SUCCESS [1:01.784s]
[INFO] Maven RAR Plugin .................................. SUCCESS [10.745s]
[INFO] Maven Reactor Plugin .............................. SUCCESS [4.620s]
[INFO] Maven Repository Plugin ........................... SUCCESS [33.398s]
[INFO] Maven Resources Plugin ............................ SUCCESS [1:22.290s]
[INFO] Maven Shade Plugin ................................ SUCCESS [2:53.802s]
[INFO] Maven Site Plugin ................................. FAILURE [1:22.523s]
[INFO] Maven Source Plugin ............................... SUCCESS [49.411s]
[INFO] Maven Stage Plugin ................................ SUCCESS [2.396s]
[INFO] Maven Toolchains Plugin ........................... SUCCESS [2.053s]
[INFO] Maven Verifier Plugin ............................. SUCCESS [14.316s]
[INFO] Maven WAR Plugin .................................. SUCCESS [1:44.340s]
[INFO] Maven Invoker Plugin .............................. SUCCESS [5:48.153s]
[INFO] Maven Project Info Reports Plugin ................. SUCCESS [3:18.928s]
[INFO] Maven Remote Resources Plugin ..................... SUCCESS [1:27.847s]
[INFO] Maven Plugins Aggregator .......................... SUCCESS [0.126s]
[INFO] ------------------------------------------------------------------------
[INFO] BUILD FAILURE
[INFO] ------------------------------------------------------------------------
[INFO] Total time: 1:08:02.508s
[INFO] Finished at: Fri Apr 15 00:13:21 PDT 2011
[INFO] Final Memory: 47M/86M
[INFO] ------------------------------------------------------------------------
[ERROR] Failed to execute goal org.apache.maven.plugins:maven-surefire-plugin:2.7.2:test (default-test)
on project maven-dependency-plugin: There are test failures.
[ERROR] 
[ERROR] Please refer to X:\slave\workspace\maven-plugins-ITs\jdk\java-5x\label\windows\trunk\maven-dependency-plugin\target\surefire-reports
for the individual test results.
[ERROR] -> [Help 1]
org.apache.maven.lifecycle.LifecycleExecutionException: Failed to execute goal org.apache.maven.plugins:maven-surefire-plugin:2.7.2:test
(default-test) on project maven-dependency-plugin: There are test failures.

Please refer to X:\slave\workspace\maven-plugins-ITs\jdk\java-5x\label\windows\trunk\maven-dependency-plugin\target\surefire-reports
for the individual test results.
	at org.apache.maven.lifecycle.internal.MojoExecutor.execute(MojoExecutor.java:213)
	at org.apache.maven.lifecycle.internal.MojoExecutor.execute(MojoExecutor.java:153)
	at org.apache.maven.lifecycle.internal.MojoExecutor.execute(MojoExecutor.java:145)
	at org.apache.maven.lifecycle.internal.LifecycleModuleBuilder.buildProject(LifecycleModuleBuilder.java:84)
	at org.apache.maven.lifecycle.internal.LifecycleModuleBuilder.buildProject(LifecycleModuleBuilder.java:59)
	at org.apache.maven.lifecycle.internal.LifecycleStarter.singleThreadedBuild(LifecycleStarter.java:183)
	at org.apache.maven.lifecycle.internal.LifecycleStarter.execute(LifecycleStarter.java:161)
	at org.apache.maven.DefaultMaven.doExecute(DefaultMaven.java:319)
	at org.apache.maven.DefaultMaven.execute(DefaultMaven.java:156)
	at org.apache.maven.cli.MavenCli.execute(MavenCli.java:537)
	at org.apache.maven.cli.MavenCli.doMain(MavenCli.java:196)
	at org.apache.maven.cli.MavenCli.main(MavenCli.java:141)
	at sun.reflect.NativeMethodAccessorImpl.invoke0(Native Method)
	at sun.reflect.NativeMethodAccessorImpl.invoke(NativeMethodAccessorImpl.java:39)
	at sun.reflect.DelegatingMethodAccessorImpl.invoke(DelegatingMethodAccessorImpl.java:25)
	at java.lang.reflect.Method.invoke(Method.java:592)
	at org.codehaus.plexus.classworlds.launcher.Launcher.launchEnhanced(Launcher.java:290)
	at org.codehaus.plexus.classworlds.launcher.Launcher.launch(Launcher.java:230)
	at org.codehaus.plexus.classworlds.launcher.Launcher.mainWithExitCode(Launcher.java:409)
	at org.codehaus.plexus.classworlds.launcher.Launcher.main(Launcher.java:352)
Caused by: org.apache.maven.plugin.MojoFailureException: There are test failures.

Please refer to X:\slave\workspace\maven-plugins-ITs\jdk\java-5x\label\windows\trunk\maven-dependency-plugin\target\surefire-reports
for the individual test results.
	at org.apache.maven.plugin.surefire.SurefireHelper.reportExecution(SurefireHelper.java:74)
	at org.apache.maven.plugin.surefire.SurefirePlugin.execute(SurefirePlugin.java:642)
	at org.apache.maven.plugin.DefaultBuildPluginManager.executeMojo(DefaultBuildPluginManager.java:101)
	at org.apache.maven.lifecycle.internal.MojoExecutor.execute(MojoExecutor.java:209)
	... 19 more
[ERROR] Failed to execute goal org.apache.maven.plugins:maven-invoker-plugin:1.5:run (integration-test)
on project maven-site-plugin: 1 build failed. -> [Help 1]
org.apache.maven.lifecycle.LifecycleExecutionException: Failed to execute goal org.apache.maven.plugins:maven-invoker-plugin:1.5:run
(integration-test) on project maven-site-plugin: 1 build failed.
	at org.apache.maven.lifecycle.internal.MojoExecutor.execute(MojoExecutor.java:213)
	at org.apache.maven.lifecycle.internal.MojoExecutor.execute(MojoExecutor.java:153)
	at org.apache.maven.lifecycle.internal.MojoExecutor.execute(MojoExecutor.java:145)
	at org.apache.maven.lifecycle.internal.LifecycleModuleBuilder.buildProject(LifecycleModuleBuilder.java:84)
	at org.apache.maven.lifecycle.internal.LifecycleModuleBuilder.buildProject(LifecycleModuleBuilder.java:59)
	at org.apache.maven.lifecycle.internal.LifecycleStarter.singleThreadedBuild(LifecycleStarter.java:183)
	at org.apache.maven.lifecycle.internal.LifecycleStarter.execute(LifecycleStarter.java:161)
	at org.apache.maven.DefaultMaven.doExecute(DefaultMaven.java:319)
	at org.apache.maven.DefaultMaven.execute(DefaultMaven.java:156)
	at org.apache.maven.cli.MavenCli.execute(MavenCli.java:537)
	at org.apache.maven.cli.MavenCli.doMain(MavenCli.java:196)
	at org.apache.maven.cli.MavenCli.main(MavenCli.java:141)
	at sun.reflect.NativeMethodAccessorImpl.invoke0(Native Method)
	at sun.reflect.NativeMethodAccessorImpl.invoke(NativeMethodAccessorImpl.java:39)
	at sun.reflect.DelegatingMethodAccessorImpl.invoke(DelegatingMethodAccessorImpl.java:25)
	at java.lang.reflect.Method.invoke(Method.java:592)
	at org.codehaus.plexus.classworlds.launcher.Launcher.launchEnhanced(Launcher.java:290)
	at org.codehaus.plexus.classworlds.launcher.Launcher.launch(Launcher.java:230)
	at org.codehaus.plexus.classworlds.launcher.Launcher.mainWithExitCode(Launcher.java:409)
	at org.codehaus.plexus.classworlds.launcher.Launcher.main(Launcher.java:352)
Caused by: org.apache.maven.plugin.MojoFailureException: 1 build failed.
	at org.apache.maven.plugin.invoker.InvokerSession.handleFailures(InvokerSession.java:263)
	at org.apache.maven.plugin.invoker.InvokerMojo.processResults(InvokerMojo.java:58)
	at org.apache.maven.plugin.invoker.AbstractInvokerMojo.execute(AbstractInvokerMojo.java:620)
	at org.apache.maven.plugin.DefaultBuildPluginManager.executeMojo(DefaultBuildPluginManager.java:101)
	at org.apache.maven.lifecycle.internal.MojoExecutor.execute(MojoExecutor.java:209)
	... 19 more
[ERROR] 
[ERROR] Re-run Maven using the -X switch to enable full debug logging.
[ERROR] 
[ERROR] For more information about the errors and possible solutions, please read the following
articles:
[ERROR] [Help 1] http://cwiki.apache.org/confluence/display/MAVEN/MojoFailureException
[ERROR] 
[ERROR] After correcting the problems, you can resume the build with the command
[ERROR]   mvn <goals> -rf :maven-dependency-plugin
Failed to send e-mail to snicoll because no e-mail address is known, and no default e-mail
domain is configured


Mime
View raw message