maven-notifications mailing list archives

Site index · List index
Message view « Date » · « Thread »
Top « Date » · « Thread »
From "GRiD .ORG" <bui...@lists.sonatype.com>
Subject Build failed in Hudson: maven-plugins-UTs » java-5x,windows #1038
Date Wed, 20 Apr 2011 23:22:34 GMT
See <https://grid.sonatype.org/ci/job/maven-plugins-UTs/./jdk=java-5x,label=windows/1038/changes>

Changes:

[Dennis Lundberg] [MCHANGES-231] Changes plugin doesn't use maven proxy settings

[Dennis Lundberg] [MCHANGES-236] Configured outputEncoding not used for writing changes-report.html
file
Submitted by: Oliver Schmitz-Hennemann
Reviewed by: Dennis Lundberg

- Patch applied with modifications

------------------------------------------
[...truncated 22702 lines...]
[INFO] Exploding webapp
[INFO] Assembling webapp [maven-war-plugin-test] in [X:\slave\workspace\maven-plugins-UTs\jdk\java-5x\label\windows\trunk\maven-war-plugin\target\test-classes\unit\waroverlays\scenario-one-overlay-settings]
[INFO] Processing war project
[INFO] Copying webapp resources [X:\slave\workspace\maven-plugins-UTs\jdk\java-5x\label\windows\trunk\maven-war-plugin\target\test-classes\unit\waroverlays\scenario-one-overlay-settings-test-data\source]
[INFO] Processing overlay [ id wartests:overlay-full-1]
[INFO] Processing overlay [ id wartests:overlay-full-2]
[INFO] Processing overlay [ id wartests:overlay-full-3]
[INFO] Webapp assembled in [97 msecs]
[INFO] Exploding webapp
[INFO] Assembling webapp [maven-war-plugin-test] in [X:\slave\workspace\maven-plugins-UTs\jdk\java-5x\label\windows\trunk\maven-war-plugin\target\test-classes\unit\waroverlays\scenario-one-full-settings]
[INFO] Processing war project
[INFO] Copying webapp resources [X:\slave\workspace\maven-plugins-UTs\jdk\java-5x\label\windows\trunk\maven-war-plugin\target\test-classes\unit\waroverlays\scenario-one-full-settings-test-data\source]
[INFO] Processing overlay [ id wartests:overlay-full-1]
[INFO] Processing overlay [ id wartests:overlay-full-2]
[INFO] Processing overlay [ id wartests:overlay-full-3]
[INFO] Webapp assembled in [104 msecs]
[INFO] Exploding webapp
[INFO] Assembling webapp [maven-war-plugin-test] in [X:\slave\workspace\maven-plugins-UTs\jdk\java-5x\label\windows\trunk\maven-war-plugin\target\test-classes\unit\waroverlays\overlays-includes-excludes-multiple-defs]
[INFO] Processing overlay [ id wartests:overlay-full-3]
[INFO] Processing overlay [ id wartests:overlay-full-1]
[INFO] Processing overlay [ id wartests:overlay-full-3]
[INFO] Processing war project
[INFO] Copying webapp resources [X:\slave\workspace\maven-plugins-UTs\jdk\java-5x\label\windows\trunk\maven-war-plugin\target\test-classes\unit\waroverlays\overlays-includes-excludes-multiple-defs-test-data\source]
[INFO] Processing overlay [ id wartests:overlay-full-2]
[INFO] Webapp assembled in [103 msecs]
[INFO] Exploding webapp
[INFO] Assembling webapp [maven-war-plugin-test] in [X:\slave\workspace\maven-plugins-UTs\jdk\java-5x\label\windows\trunk\maven-war-plugin\target\test-classes\unit\waroverlays\overlays-includes-excludes-multiple-defs2]
[INFO] Processing overlay [ id wartests:overlay-full-3]
[INFO] Processing overlay [ id wartests:overlay-full-1]
[INFO] Processing overlay [ id wartests:overlay-full-3]
[INFO] Processing war project
[INFO] Copying webapp resources [X:\slave\workspace\maven-plugins-UTs\jdk\java-5x\label\windows\trunk\maven-war-plugin\target\test-classes\unit\waroverlays\overlays-includes-excludes-multiple-defs2-test-data\source]
[INFO] Processing overlay [ id wartests:overlay-full-2]
[INFO] Webapp assembled in [140 msecs]
[INFO] Exploding webapp
[INFO] Assembling webapp [maven-war-plugin-test] in [X:\slave\workspace\maven-plugins-UTs\jdk\java-5x\label\windows\trunk\maven-war-plugin\target\test-classes\unit\waroverlays\cache-updated-overlay]
[INFO] Processing war project
[INFO] Copying webapp resources [X:\slave\workspace\maven-plugins-UTs\jdk\java-5x\label\windows\trunk\maven-war-plugin\target\test-classes\unit\waroverlays\cache-updated-overlay-test-data\source]
[INFO] Processing overlay [ id wartests:overlay-one]
[INFO] Processing overlay [ id wartests:overlay-two]
[INFO] Webapp assembled in [39 msecs]
[INFO] Exploding webapp
[INFO] Assembling webapp [maven-war-plugin-test] in [X:\slave\workspace\maven-plugins-UTs\jdk\java-5x\label\windows\trunk\maven-war-plugin\target\test-classes\unit\waroverlays\cache-updated-overlay]
[INFO] Processing war project
[INFO] Copying webapp resources [X:\slave\workspace\maven-plugins-UTs\jdk\java-5x\label\windows\trunk\maven-war-plugin\target\test-classes\unit\waroverlays\cache-updated-overlay-test-data\source]
[INFO] Processing overlay [ id wartests:overlay-two]
[INFO] File [index.jsp] belonged to overlay [wartests:overlay-one] so it will be overwritten.
[INFO] File [WEB-INF/web.xml] belonged to overlay [wartests:overlay-one] so it will be overwritten.
[INFO] Processing overlay [ id wartests:overlay-one]
[INFO] Webapp assembled in [17 msecs]
[INFO] Exploding webapp
[INFO] Assembling webapp [maven-war-plugin-test] in [X:\slave\workspace\maven-plugins-UTs\jdk\java-5x\label\windows\trunk\maven-war-plugin\target\test-classes\unit\waroverlays\cache-removed-overlay]
[INFO] Processing war project
[INFO] Copying webapp resources [X:\slave\workspace\maven-plugins-UTs\jdk\java-5x\label\windows\trunk\maven-war-plugin\target\test-classes\unit\waroverlays\cache-removed-overlay-test-data\source]
[INFO] Processing overlay [ id wartests:overlay-one]
[INFO] Processing overlay [ id wartests:overlay-two]
[INFO] Webapp assembled in [31 msecs]
[INFO] Exploding webapp
[INFO] Assembling webapp [maven-war-plugin-test] in [X:\slave\workspace\maven-plugins-UTs\jdk\java-5x\label\windows\trunk\maven-war-plugin\target\test-classes\unit\waroverlays\cache-removed-overlay]
[WARNING] Dependency [Dependency {groupId=wartests, artifactId=overlay-one, version=0.0-Test,
type=war}] has been removed from the project. If it was included in the build as an overlay,
consider cleaning the target directory of the project (mvn clean)
[INFO] Processing war project
[INFO] Copying webapp resources [X:\slave\workspace\maven-plugins-UTs\jdk\java-5x\label\windows\trunk\maven-war-plugin\target\test-classes\unit\waroverlays\cache-removed-overlay-test-data\source]
[INFO] Processing overlay [ id wartests:overlay-two]
[WARNING] File [index.jsp] belonged to overlay [wartests:overlay-one] which does not exist
anymore in the current project. It is recommended to invoke clean if the dependencies of the
project changed.
[WARNING] File [WEB-INF/web.xml] belonged to overlay [wartests:overlay-one] which does not
exist anymore in the current project. It is recommended to invoke clean if the dependencies
of the project changed.
[INFO] Webapp assembled in [5 msecs]
Tests run: 11, Failures: 0, Errors: 0, Skipped: 0, Time elapsed: 1.718 sec
Running org.apache.maven.plugin.war.WarZipTest
[INFO] Packaging webapp
[INFO] Assembling webapp [maven-war-plugin-test] in [X:\slave\workspace\maven-plugins-UTs\jdk\java-5x\label\windows\trunk\maven-war-plugin\target\test-classes\unit\warziptest\one-zip]
[INFO] Processing war project
[INFO] Copying webapp resources [X:\slave\workspace\maven-plugins-UTs\jdk\java-5x\label\windows\trunk\maven-war-plugin\target\test-classes\unit\warziptest\one-zip-test-data\source]
[INFO] Processing overlay [ id zipGroupId:zipId]
[INFO] Webapp assembled in [20 msecs]
[INFO] Building war: X:\slave\workspace\maven-plugins-UTs\jdk\java-5x\label\windows\trunk\maven-war-plugin\target\test-classes\unit\warziptest\one-zip-output\simple.war
[WARNING] Warning: selected war files include a WEB-INF/web.xml which will be ignored 
(webxml attribute is missing from war task, or ignoreWebxml attribute is specified as 'true')
[INFO] Packaging webapp
[INFO] Assembling webapp [maven-war-plugin-test] in [X:\slave\workspace\maven-plugins-UTs\jdk\java-5x\label\windows\trunk\maven-war-plugin\target\test-classes\unit\warziptest\one-zip-overlay-targetPath]
[INFO] Processing war project
[INFO] Copying webapp resources [X:\slave\workspace\maven-plugins-UTs\jdk\java-5x\label\windows\trunk\maven-war-plugin\target\test-classes\unit\warziptest\one-zip-overlay-targetPath-test-data\source]
[INFO] Processing overlay [ id zipGroupId:zipId]
[INFO] Webapp assembled in [31 msecs]
[INFO] Building war: X:\slave\workspace\maven-plugins-UTs\jdk\java-5x\label\windows\trunk\maven-war-plugin\target\test-classes\unit\warziptest\one-zip-overlay-targetPath-output\simple.war
[WARNING] Warning: selected war files include a WEB-INF/web.xml which will be ignored 
(webxml attribute is missing from war task, or ignoreWebxml attribute is specified as 'true')
[INFO] Packaging webapp
[INFO] Assembling webapp [maven-war-plugin-test] in [X:\slave\workspace\maven-plugins-UTs\jdk\java-5x\label\windows\trunk\maven-war-plugin\target\test-classes\unit\warziptest\one-zip-overlay-skip]
[INFO] Processing war project
[INFO] Copying webapp resources [X:\slave\workspace\maven-plugins-UTs\jdk\java-5x\label\windows\trunk\maven-war-plugin\target\test-classes\unit\warziptest\one-zip-overlay-skip-test-data\source]
[INFO] Webapp assembled in [543 msecs]
[INFO] Building war: X:\slave\workspace\maven-plugins-UTs\jdk\java-5x\label\windows\trunk\maven-war-plugin\target\test-classes\unit\warziptest\one-zip-overlay-skip-output\simple.war
[WARNING] Warning: selected war files include a WEB-INF/web.xml which will be ignored 
(webxml attribute is missing from war task, or ignoreWebxml attribute is specified as 'true')
[INFO] Packaging webapp
[INFO] Assembling webapp [maven-war-plugin-test] in [X:\slave\workspace\maven-plugins-UTs\jdk\java-5x\label\windows\trunk\maven-war-plugin\target\test-classes\unit\warziptest\one-zip-overlay-skip]
[INFO] Processing war project
[INFO] Copying webapp resources [X:\slave\workspace\maven-plugins-UTs\jdk\java-5x\label\windows\trunk\maven-war-plugin\target\test-classes\unit\warziptest\one-zip-overlay-skip-test-data\source]
[INFO] Skipping overlay [ id zipGroupId:zipId]
[INFO] Webapp assembled in [5 msecs]
[INFO] Building war: X:\slave\workspace\maven-plugins-UTs\jdk\java-5x\label\windows\trunk\maven-war-plugin\target\test-classes\unit\warziptest\one-zip-overlay-skip-output\simple.war
[WARNING] Warning: selected war files include a WEB-INF/web.xml which will be ignored 
(webxml attribute is missing from war task, or ignoreWebxml attribute is specified as 'true')
Tests run: 4, Failures: 0, Errors: 0, Skipped: 0, Time elapsed: 0.93 sec

Results :

Tests run: 83, Failures: 0, Errors: 0, Skipped: 0

[INFO] [jar:jar {execution: default-jar}]
[INFO] Building jar: X:\slave\workspace\maven-plugins-UTs\jdk\java-5x\label\windows\trunk\maven-war-plugin\target\maven-war-plugin-2.2-SNAPSHOT.jar
[INFO] [plugin:addPluginArtifactMetadata {execution: default-addPluginArtifactMetadata}]
[INFO] [install:install {execution: default-install}]
[INFO] Installing X:\slave\workspace\maven-plugins-UTs\jdk\java-5x\label\windows\trunk\maven-war-plugin\target\maven-war-plugin-2.2-SNAPSHOT.jar
to x:\slave\workspace\maven-plugins-UTs\jdk\java-5x\label\windows\.repository\org\apache\maven\plugins\maven-war-plugin\2.2-SNAPSHOT\maven-war-plugin-2.2-SNAPSHOT.jar
[INFO] ------------------------------------------------------------------------
[INFO] Building Maven Plugins Aggregator
[INFO]    task-segment: [clean, install]
[INFO] ------------------------------------------------------------------------
[INFO] [clean:clean {execution: default-clean}]
[INFO] [remote-resources:process {execution: default}]
[INFO] [site:attach-descriptor {execution: default-attach-descriptor}]
[INFO] [install:install {execution: default-install}]
[INFO] Installing x:\slave\workspace\maven-plugins-UTs\jdk\java-5x\label\windows\trunk\pom.xml
to x:\slave\workspace\maven-plugins-UTs\jdk\java-5x\label\windows\.repository\org\apache\maven\plugins\maven-plugins-aggregator\1-SNAPSHOT\maven-plugins-aggregator-1-SNAPSHOT.pom
[INFO] 
[INFO] 
[INFO] ------------------------------------------------------------------------
[INFO] Reactor Summary:
[INFO] ------------------------------------------------------------------------
[INFO] Maven Plugins ......................................... SUCCESS [21.283s]
[INFO] Maven ACR Plugin ...................................... SUCCESS [7.569s]
[INFO] Maven Ant Plugin ...................................... SUCCESS [8.120s]
[INFO] Maven AntRun Plugin ................................... SUCCESS [3.609s]
[INFO] Maven Eclipse Plugin .................................. SUCCESS [22.574s]
[INFO] Maven Changelog Plugin ................................ SUCCESS [11.633s]
[INFO] Maven Changes Report Plugin ........................... SUCCESS [10.983s]
[INFO] Maven Checkstyle Plugin ............................... SUCCESS [19.342s]
[INFO] Maven Clean Plugin .................................... SUCCESS [5.265s]
[INFO] Maven Compiler Plugin ................................. SUCCESS [10.506s]
[INFO] Maven Dependency Plugin ............................... FAILED [54.877s]
[INFO] Maven Deploy Plugin ................................... SUCCESS [6.156s]
[INFO] Maven DOAP Plugin ..................................... SUCCESS [16.701s]
[INFO] Maven Documentation Checker Plugin .................... SUCCESS [1.763s]
[INFO] Maven EAR Plugin ...................................... SUCCESS [5.162s]
[INFO] Maven EJB Plugin ...................................... SUCCESS [4.666s]
[INFO] Maven GPG Plugin ...................................... SUCCESS [1.335s]
[INFO] Maven Help Plugin ..................................... SUCCESS [3.636s]
[INFO] Maven IDEA Plugin ..................................... SUCCESS [12.962s]
[INFO] Maven Install Plugin .................................. SUCCESS [5.576s]
[INFO] Maven JAR Plugin ...................................... SUCCESS [2.361s]
[INFO] Maven Jarsigner Plugin ................................ SUCCESS [1.426s]
[INFO] Maven Shade Plugin .................................... SUCCESS [8.117s]
[INFO] Maven Javadoc Plugin .................................. FAILED [5:19.579s]
[INFO] Maven Linkcheck Plugin ................................ SUCCESS [2.878s]
[INFO] Maven One Plugin ...................................... SUCCESS [2.776s]
[INFO] Maven Patch Plugin .................................... SUCCESS [1.064s]
[INFO] Maven PDF Plugin ...................................... SUCCESS [15.814s]
[INFO] Maven PMD Plugin ...................................... SUCCESS [10.050s]
[INFO] Maven RAR Plugin ...................................... SUCCESS [2.357s]
[INFO] Maven Reactor Plugin .................................. SUCCESS [6.377s]
[INFO] Maven Repository Plugin ............................... SUCCESS [4.526s]
[INFO] Maven Resources Plugin ................................ SUCCESS [4.594s]
[INFO] Maven Site Plugin ..................................... SUCCESS [13.881s]
[INFO] Maven Source Plugin ................................... SUCCESS [3.577s]
[INFO] Maven Stage Plugin .................................... SUCCESS [2.705s]
[INFO] Maven Toolchains Plugin ............................... SUCCESS [1.540s]
[INFO] Maven Verifier Plugin ................................. SUCCESS [1.629s]
[INFO] Maven WAR Plugin ...................................... SUCCESS [12.009s]
[INFO] Maven Plugins Aggregator .............................. SUCCESS [0.024s]
[INFO] ------------------------------------------------------------------------
[INFO] Error for project: Maven Dependency Plugin (during install)
[INFO] ------------------------------------------------------------------------
[INFO] There are test failures.

Please refer to X:\slave\workspace\maven-plugins-UTs\jdk\java-5x\label\windows\trunk\maven-dependency-plugin\target\surefire-reports
for the individual test results.
[INFO] ------------------------------------------------------------------------
[INFO] Trace
org.apache.maven.BuildFailureException: There are test failures.

Please refer to X:\slave\workspace\maven-plugins-UTs\jdk\java-5x\label\windows\trunk\maven-dependency-plugin\target\surefire-reports
for the individual test results.
	at org.apache.maven.lifecycle.DefaultLifecycleExecutor.executeGoals(DefaultLifecycleExecutor.java:715)
	at org.apache.maven.lifecycle.DefaultLifecycleExecutor.executeGoalWithLifecycle(DefaultLifecycleExecutor.java:556)
	at org.apache.maven.lifecycle.DefaultLifecycleExecutor.executeGoal(DefaultLifecycleExecutor.java:535)
	at org.apache.maven.lifecycle.DefaultLifecycleExecutor.executeGoalAndHandleFailures(DefaultLifecycleExecutor.java:387)
	at org.apache.maven.lifecycle.DefaultLifecycleExecutor.executeTaskSegments(DefaultLifecycleExecutor.java:348)
	at org.apache.maven.lifecycle.DefaultLifecycleExecutor.execute(DefaultLifecycleExecutor.java:180)
	at org.apache.maven.DefaultMaven.doExecute(DefaultMaven.java:328)
	at org.apache.maven.DefaultMaven.execute(DefaultMaven.java:138)
	at org.apache.maven.cli.MavenCli.main(MavenCli.java:362)
	at org.apache.maven.cli.compat.CompatibleMain.main(CompatibleMain.java:60)
	at sun.reflect.NativeMethodAccessorImpl.invoke0(Native Method)
	at sun.reflect.NativeMethodAccessorImpl.invoke(NativeMethodAccessorImpl.java:39)
	at sun.reflect.DelegatingMethodAccessorImpl.invoke(DelegatingMethodAccessorImpl.java:25)
	at java.lang.reflect.Method.invoke(Method.java:592)
	at org.codehaus.classworlds.Launcher.launchEnhanced(Launcher.java:315)
	at org.codehaus.classworlds.Launcher.launch(Launcher.java:255)
	at org.codehaus.classworlds.Launcher.mainWithExitCode(Launcher.java:430)
	at org.codehaus.classworlds.Launcher.main(Launcher.java:375)
Caused by: org.apache.maven.plugin.MojoFailureException: There are test failures.

Please refer to X:\slave\workspace\maven-plugins-UTs\jdk\java-5x\label\windows\trunk\maven-dependency-plugin\target\surefire-reports
for the individual test results.
	at org.apache.maven.plugin.surefire.SurefireHelper.reportExecution(SurefireHelper.java:74)
	at org.apache.maven.plugin.surefire.SurefirePlugin.execute(SurefirePlugin.java:642)
	at org.apache.maven.plugin.DefaultPluginManager.executeMojo(DefaultPluginManager.java:490)
	at org.apache.maven.lifecycle.DefaultLifecycleExecutor.executeGoals(DefaultLifecycleExecutor.java:694)
	... 17 more
[INFO] ------------------------------------------------------------------------
[INFO] Error for project: Maven Javadoc Plugin (during install)
[INFO] ------------------------------------------------------------------------
[INFO] There are test failures.

Please refer to X:\slave\workspace\maven-plugins-UTs\jdk\java-5x\label\windows\trunk\maven-javadoc-plugin\target\surefire-reports
for the individual test results.
[INFO] ------------------------------------------------------------------------
[INFO] Trace
org.apache.maven.BuildFailureException: There are test failures.

Please refer to X:\slave\workspace\maven-plugins-UTs\jdk\java-5x\label\windows\trunk\maven-javadoc-plugin\target\surefire-reports
for the individual test results.
	at org.apache.maven.lifecycle.DefaultLifecycleExecutor.executeGoals(DefaultLifecycleExecutor.java:715)
	at org.apache.maven.lifecycle.DefaultLifecycleExecutor.executeGoalWithLifecycle(DefaultLifecycleExecutor.java:556)
	at org.apache.maven.lifecycle.DefaultLifecycleExecutor.executeGoal(DefaultLifecycleExecutor.java:535)
	at org.apache.maven.lifecycle.DefaultLifecycleExecutor.executeGoalAndHandleFailures(DefaultLifecycleExecutor.java:387)
	at org.apache.maven.lifecycle.DefaultLifecycleExecutor.executeTaskSegments(DefaultLifecycleExecutor.java:348)
	at org.apache.maven.lifecycle.DefaultLifecycleExecutor.execute(DefaultLifecycleExecutor.java:180)
	at org.apache.maven.DefaultMaven.doExecute(DefaultMaven.java:328)
	at org.apache.maven.DefaultMaven.execute(DefaultMaven.java:138)
	at org.apache.maven.cli.MavenCli.main(MavenCli.java:362)
	at org.apache.maven.cli.compat.CompatibleMain.main(CompatibleMain.java:60)
	at sun.reflect.NativeMethodAccessorImpl.invoke0(Native Method)
	at sun.reflect.NativeMethodAccessorImpl.invoke(NativeMethodAccessorImpl.java:39)
	at sun.reflect.DelegatingMethodAccessorImpl.invoke(DelegatingMethodAccessorImpl.java:25)
	at java.lang.reflect.Method.invoke(Method.java:592)
	at org.codehaus.classworlds.Launcher.launchEnhanced(Launcher.java:315)
	at org.codehaus.classworlds.Launcher.launch(Launcher.java:255)
	at org.codehaus.classworlds.Launcher.mainWithExitCode(Launcher.java:430)
	at org.codehaus.classworlds.Launcher.main(Launcher.java:375)
Caused by: org.apache.maven.plugin.MojoFailureException: There are test failures.

Please refer to X:\slave\workspace\maven-plugins-UTs\jdk\java-5x\label\windows\trunk\maven-javadoc-plugin\target\surefire-reports
for the individual test results.
	at org.apache.maven.plugin.surefire.SurefireHelper.reportExecution(SurefireHelper.java:74)
	at org.apache.maven.plugin.surefire.SurefirePlugin.execute(SurefirePlugin.java:642)
	at org.apache.maven.plugin.DefaultPluginManager.executeMojo(DefaultPluginManager.java:490)
	at org.apache.maven.lifecycle.DefaultLifecycleExecutor.executeGoals(DefaultLifecycleExecutor.java:694)
	... 17 more
[INFO] ------------------------------------------------------------------------
[INFO] BUILD ERRORS
[INFO] ------------------------------------------------------------------------
[INFO] Total time: 10 minutes 52 seconds
[INFO] Finished at: Wed Apr 20 16:22:33 PDT 2011
[INFO] Final Memory: 104M/187M
[INFO] ------------------------------------------------------------------------


Mime
View raw message