maven-notifications mailing list archives

Site index · List index
Message view « Date » · « Thread »
Top « Date » · « Thread »
From "GRiD .ORG" <bui...@lists.sonatype.com>
Subject Build failed in Hudson: surefire » java-5x,windows #270
Date Thu, 24 Mar 2011 16:29:23 GMT
See <https://grid.sonatype.org/ci/job/surefire/./jdk=java-5x,label=windows/270/changes>

Changes:

[Kristian Rosenvold] o Renamed to run listener

Renamed implementation class to match interface name
Removed a couple of unused methods

------------------------------------------
[...truncated 3918 lines...]
[INFO] Tests are skipped.
[INFO] 
[INFO] --- maven-jar-plugin:2.3.1:jar (default-jar) @ surefire-integration-tests ---
[INFO] Building jar: X:\slave\workspace\surefire\jdk\java-5x\label\windows\trunk\surefire-integration-tests\target\surefire-integration-tests-2.8.1-SNAPSHOT.jar
[INFO] 
[INFO] --- maven-failsafe-plugin:2.8:integration-test (default) @ surefire-integration-tests
---
[INFO] Failsafe report directory: X:\slave\workspace\surefire\jdk\java-5x\label\windows\trunk\surefire-integration-tests\target\failsafe-reports

-------------------------------------------------------
 T E S T S
-------------------------------------------------------
Running org.apache.maven.surefire.its.AbstractTestCaseIT
Tests run: 1, Failures: 0, Errors: 0, Skipped: 0, Time elapsed: 5.879 sec
Running org.apache.maven.surefire.its.AdditionalClasspathIT
Tests run: 1, Failures: 0, Errors: 0, Skipped: 0, Time elapsed: 4.939 sec
Running org.apache.maven.surefire.its.AggregateReportIT
Tests run: 1, Failures: 0, Errors: 0, Skipped: 0, Time elapsed: 19.944 sec
Running org.apache.maven.surefire.its.ArgLineIT
Tests run: 1, Failures: 0, Errors: 0, Skipped: 0, Time elapsed: 4.68 sec
Running org.apache.maven.surefire.its.CheckSingleTestIT
Tests run: 4, Failures: 0, Errors: 0, Skipped: 0, Time elapsed: 19.442 sec
Running org.apache.maven.surefire.its.CheckTestFailIfNoTestsForkModeIT
Tests run: 6, Failures: 0, Errors: 0, Skipped: 0, Time elapsed: 25.845 sec
Running org.apache.maven.surefire.its.CheckTestFailIfNoTestsIT
Tests run: 2, Failures: 0, Errors: 0, Skipped: 0, Time elapsed: 6.888 sec
Running org.apache.maven.surefire.its.CheckTestNgBeforeMethodFailureIT
Tests run: 1, Failures: 0, Errors: 0, Skipped: 0, Time elapsed: 8.915 sec
Running org.apache.maven.surefire.its.CheckTestNgBeforeMethodIT
Tests run: 1, Failures: 0, Errors: 0, Skipped: 0, Time elapsed: 5.384 sec
Running org.apache.maven.surefire.its.CheckTestNgExecuteErrorIT
Tests run: 1, Failures: 0, Errors: 0, Skipped: 0, Time elapsed: 6.694 sec
Running org.apache.maven.surefire.its.CheckTestNgGroupThreadParallelIT
Tests run: 1, Failures: 0, Errors: 0, Skipped: 0, Time elapsed: 5.772 sec
Running org.apache.maven.surefire.its.CheckTestNgJdk14IT
Tests run: 1, Failures: 0, Errors: 0, Skipped: 0, Time elapsed: 6.157 sec
Running org.apache.maven.surefire.its.CheckTestNgListenerReporterIT
Tests run: 1, Failures: 0, Errors: 0, Skipped: 0, Time elapsed: 5.608 sec
Running org.apache.maven.surefire.its.CheckTestNgPathWithSpacesIT
Tests run: 1, Failures: 0, Errors: 0, Skipped: 0, Time elapsed: 5.597 sec
Running org.apache.maven.surefire.its.CheckTestNgReportTestIT
Tests run: 1, Failures: 0, Errors: 0, Skipped: 0, Time elapsed: 8.969 sec
Running org.apache.maven.surefire.its.CheckTestNgSuiteXmlIT
Tests run: 2, Failures: 0, Errors: 0, Skipped: 0, Time elapsed: 11.545 sec
Running org.apache.maven.surefire.its.CheckTestNgSuiteXmlSingleIT
Tests run: 1, Failures: 0, Errors: 0, Skipped: 0, Time elapsed: 6.676 sec
Running org.apache.maven.surefire.its.CheckTestNgVersionsIT
Tests run: 17, Failures: 0, Errors: 0, Skipped: 0, Time elapsed: 135.646 sec
Running org.apache.maven.surefire.its.ClasspathFilteringIT
Tests run: 1, Failures: 0, Errors: 0, Skipped: 0, Time elapsed: 10.32 sec
Running org.apache.maven.surefire.its.ClassPathOrderIT
Tests run: 1, Failures: 0, Errors: 0, Skipped: 0, Time elapsed: 18.002 sec
Running org.apache.maven.surefire.its.ClasspathScopeFilteringIT
Tests run: 1, Failures: 0, Errors: 0, Skipped: 0, Time elapsed: 4.827 sec
Running org.apache.maven.surefire.its.DefaultConfigurationIT
Tests run: 1, Failures: 0, Errors: 0, Skipped: 0, Time elapsed: 4.782 sec
Running org.apache.maven.surefire.its.EnvironmentVariableIT
Tests run: 1, Failures: 0, Errors: 0, Skipped: 0, Time elapsed: 8.058 sec
Running org.apache.maven.surefire.its.ForkConsoleOutputIT
Tests run: 4, Failures: 0, Errors: 0, Skipped: 0, Time elapsed: 79.838 sec
Running org.apache.maven.surefire.its.ForkModeIT
Tests run: 5, Failures: 0, Errors: 0, Skipped: 0, Time elapsed: 23.538 sec
Running org.apache.maven.surefire.its.IncludesExcludesIT
Tests run: 1, Failures: 0, Errors: 0, Skipped: 0, Time elapsed: 4.889 sec
Running org.apache.maven.surefire.its.JUnit44HamcrestIT
Tests run: 1, Failures: 0, Errors: 0, Skipped: 0, Time elapsed: 16.765 sec
Running org.apache.maven.surefire.its.JUnit44TestMethodPatternIT
Tests run: 1, Failures: 0, Errors: 0, Skipped: 0, Time elapsed: 17.504 sec
Running org.apache.maven.surefire.its.JUnit44TestSingleMethodIT
Tests run: 1, Failures: 0, Errors: 0, Skipped: 0, Time elapsed: 17.07 sec
Running org.apache.maven.surefire.its.Junit47concurrencyIT
Tests run: 1, Failures: 0, Errors: 1, Skipped: 0, Time elapsed: 7.203 sec <<< FAILURE!
Running org.apache.maven.surefire.its.JUnit48TestMethodPatternIT
Tests run: 1, Failures: 0, Errors: 0, Skipped: 0, Time elapsed: 17.272 sec
Running org.apache.maven.surefire.its.JUnit48TestSingleMethodIT
Tests run: 1, Failures: 0, Errors: 0, Skipped: 0, Time elapsed: 17.205 sec
Running org.apache.maven.surefire.its.JUnit4ForkAlwaysStaticInitPollutionIT
Tests run: 1, Failures: 0, Errors: 1, Skipped: 0, Time elapsed: 4.198 sec <<< FAILURE!
Running org.apache.maven.surefire.its.Junit4IgnoreIT
Tests run: 1, Failures: 0, Errors: 0, Skipped: 0, Time elapsed: 16.953 sec
Running org.apache.maven.surefire.its.JUnit4RunListenerIT
Tests run: 2, Failures: 0, Errors: 0, Skipped: 0, Time elapsed: 34.391 sec
Running org.apache.maven.surefire.its.Junit4VersionsIT
Tests run: 9, Failures: 0, Errors: 1, Skipped: 0, Time elapsed: 90.331 sec <<< FAILURE!
Running org.apache.maven.surefire.its.JUnitDepIT
Tests run: 3, Failures: 0, Errors: 0, Skipped: 0, Time elapsed: 29.049 sec
Running org.apache.maven.surefire.its.NoRunnableTestsInClassIT
Tests run: 1, Failures: 0, Errors: 0, Skipped: 0, Time elapsed: 7.201 sec
Running org.apache.maven.surefire.its.PlainOldJavaClasspathIT
Tests run: 1, Failures: 0, Errors: 0, Skipped: 0, Time elapsed: 7.938 sec
Running org.apache.maven.surefire.its.PlexusConflictIT
Tests run: 2, Failures: 0, Errors: 0, Skipped: 0, Time elapsed: 11.855 sec
Running org.apache.maven.surefire.its.PojoSimpleIT
Tests run: 1, Failures: 0, Errors: 0, Skipped: 0, Time elapsed: 5.108 sec
Running org.apache.maven.surefire.its.ReportersIT
Tests run: 1, Failures: 0, Errors: 0, Skipped: 0, Time elapsed: 19.217 sec
Running org.apache.maven.surefire.its.ResultCountingIT
Tests run: 3, Failures: 0, Errors: 0, Skipped: 0, Time elapsed: 16.573 sec
Running org.apache.maven.surefire.its.RunOrderIT
Tests run: 3, Failures: 0, Errors: 0, Skipped: 0, Time elapsed: 14.513 sec
Running org.apache.maven.surefire.its.SiblingAggregatorIT
Tests run: 1, Failures: 0, Errors: 0, Skipped: 0, Time elapsed: 5.867 sec
Running org.apache.maven.surefire.its.Surefire141PluggableProvidersIT
Tests run: 1, Failures: 0, Errors: 0, Skipped: 0, Time elapsed: 11.9 sec
Running org.apache.maven.surefire.its.Surefire146ForkPerTestNoSetupIT
Tests run: 1, Failures: 0, Errors: 0, Skipped: 0, Time elapsed: 5.902 sec
Running org.apache.maven.surefire.its.Surefire162CharsetProviderIT
Tests run: 1, Failures: 0, Errors: 0, Skipped: 0, Time elapsed: 5.643 sec
Running org.apache.maven.surefire.its.Surefire224WellFormedXmlFailuresIT
Tests run: 1, Failures: 0, Errors: 0, Skipped: 0, Time elapsed: 5.976 sec
Running org.apache.maven.surefire.its.Surefire257NotRerunningTestsIT
Tests run: 1, Failures: 0, Errors: 0, Skipped: 0, Time elapsed: 11.22 sec
Running org.apache.maven.surefire.its.Surefire260TestWithIdenticalNamesIT
Tests run: 1, Failures: 0, Errors: 0, Skipped: 0, Time elapsed: 13.669 sec
Running org.apache.maven.surefire.its.Surefire377TestNgAndJUnitTogetherIT
Tests run: 1, Failures: 0, Errors: 0, Skipped: 0, Time elapsed: 6.945 sec
Running org.apache.maven.surefire.its.Surefire408ManualProviderSelectionIT
Tests run: 1, Failures: 0, Errors: 0, Skipped: 0, Time elapsed: 7.465 sec
Running org.apache.maven.surefire.its.Surefire42NotExtendingTestCaseIT
Tests run: 1, Failures: 0, Errors: 0, Skipped: 0, Time elapsed: 5.724 sec
Running org.apache.maven.surefire.its.Surefire44InnerClassTestIT
Tests run: 1, Failures: 0, Errors: 0, Skipped: 0, Time elapsed: 5.405 sec
Running org.apache.maven.surefire.its.Surefire500PuzzlingErrorIT
Tests run: 1, Failures: 0, Errors: 0, Skipped: 0, Time elapsed: 5.886 sec
Running org.apache.maven.surefire.its.Surefire510TestClassPathForkModesIT
Tests run: 2, Failures: 0, Errors: 0, Skipped: 0, Time elapsed: 11.877 sec
Running org.apache.maven.surefire.its.Surefire570MultipleReportDirectoriesIT
Tests run: 2, Failures: 0, Errors: 0, Skipped: 0, Time elapsed: 40.718 sec
Running org.apache.maven.surefire.its.Surefire613TestCountInParallelIT
Tests run: 1, Failures: 0, Errors: 0, Skipped: 0, Time elapsed: 5.781 sec
Running org.apache.maven.surefire.its.Surefire621TestCountingJunit3InParallelIT
Tests run: 1, Failures: 0, Errors: 0, Skipped: 0, Time elapsed: 8.027 sec
Running org.apache.maven.surefire.its.Surefire628ConsoleOutputBeforeAndAfterClassIT
Tests run: 1, Failures: 0, Errors: 0, Skipped: 0, Time elapsed: 5.389 sec
Running org.apache.maven.surefire.its.Surefire634UnsettableSystemPropertiesWarningIT
Tests run: 1, Failures: 0, Errors: 0, Skipped: 0, Time elapsed: 5.211 sec
Running org.apache.maven.surefire.its.Surefire673MockitoIT
Tests run: 1, Failures: 0, Errors: 0, Skipped: 0, Time elapsed: 8.038 sec
Running org.apache.maven.surefire.its.Surefire674BuildFailingWhenErrorsIT
Tests run: 1, Failures: 0, Errors: 0, Skipped: 0, Time elapsed: 5.487 sec
Running org.apache.maven.surefire.its.Surefire685CommaSeparatedIncludesIT
Tests run: 1, Failures: 0, Errors: 0, Skipped: 0, Time elapsed: 5.81 sec
Running org.apache.maven.surefire.its.Surefire697NiceSummaryIT
Tests run: 1, Failures: 0, Errors: 0, Skipped: 0, Time elapsed: 6.394 sec
Running org.apache.maven.surefire.its.Surefire705ParallelForkTimeoutIT
Tests run: 1, Failures: 0, Errors: 0, Skipped: 0, Time elapsed: 6.855 sec
Running org.apache.maven.surefire.its.SystemPropertiesTestIT
Tests run: 2, Failures: 0, Errors: 0, Skipped: 0, Time elapsed: 16.278 sec
Running org.apache.maven.surefire.its.TestNgTestMethodPatternIT
Tests run: 1, Failures: 0, Errors: 0, Skipped: 0, Time elapsed: 7.41 sec
Running org.apache.maven.surefire.its.TestNgTestSingleMethod5149IT
Tests run: 1, Failures: 0, Errors: 0, Skipped: 0, Time elapsed: 10.267 sec
Running org.apache.maven.surefire.its.TestNgTestSingleMethodIT
Tests run: 1, Failures: 0, Errors: 0, Skipped: 0, Time elapsed: 6.073 sec
Running org.apache.maven.surefire.its.TimeoutForkedTestIT
Tests run: 1, Failures: 0, Errors: 0, Skipped: 0, Time elapsed: 15.49 sec
Running org.apache.maven.surefire.its.TwoTestCasesIT
Tests run: 4, Failures: 0, Errors: 0, Skipped: 0, Time elapsed: 24.449 sec
Running org.apache.maven.surefire.its.UmlautDirIT
Tests run: 2, Failures: 0, Errors: 0, Skipped: 0, Time elapsed: 11.572 sec
Running org.apache.maven.surefire.its.UseIsolatedClassLoaderIT
Tests run: 1, Failures: 0, Errors: 0, Skipped: 0, Time elapsed: 10.107 sec
Running org.apache.maven.surefire.its.WorkingDirectoryIT
Tests run: 4, Failures: 0, Errors: 0, Skipped: 0, Time elapsed: 16.63 sec
Running org.apache.maven.surefire.its.WorkingDirectoryMissingIT
Tests run: 1, Failures: 0, Errors: 0, Skipped: 0, Time elapsed: 4.663 sec

Results :

Tests in error: 
  test47(org.apache.maven.surefire.its.Junit47concurrencyIT): Exit code was non-zero: 1; command
line and log = 
  testJunit4Ignore(org.apache.maven.surefire.its.JUnit4ForkAlwaysStaticInitPollutionIT): Exit
code was non-zero: 1; command line and log = 
  test47(org.apache.maven.surefire.its.Junit4VersionsIT): Exit code was non-zero: 1; command
line and log = 

Tests run: 136, Failures: 0, Errors: 3, Skipped: 0

[INFO] 
[INFO] --- maven-failsafe-plugin:2.8:verify (default) @ surefire-integration-tests ---
[INFO] Failsafe report directory: X:\slave\workspace\surefire\jdk\java-5x\label\windows\trunk\surefire-integration-tests\target\failsafe-reports
[INFO] ------------------------------------------------------------------------
[INFO] Reactor Summary:
[INFO] 
[INFO] SureFire .......................................... SUCCESS [2:12.085s]
[INFO] surefire-shadefire ................................ SUCCESS [1:12.960s]
[INFO] SureFire API ...................................... SUCCESS [12.623s]
[INFO] SureFire Booter ................................... SUCCESS [2.175s]
[INFO] SureFire Providers ................................ SUCCESS [0.113s]
[INFO] Shared JUnit3 provider code ....................... SUCCESS [1.764s]
[INFO] Shared Junit4 Provider Code ....................... SUCCESS [6.561s]
[INFO] SureFire JUnit Runner ............................. SUCCESS [1.361s]
[INFO] SureFire JUnit4 Runner ............................ SUCCESS [1.473s]
[INFO] SureFire JUnitCore Runner ......................... SUCCESS [14.270s]
[INFO] SureFire TestNG Utils ............................. SUCCESS [6.387s]
[INFO] SureFire TestNG Runner ............................ SUCCESS [1.367s]
[INFO] Maven Surefire Common ............................. SUCCESS [6.113s]
[INFO] Maven Surefire Plugin ............................. SUCCESS [1:04.324s]
[INFO] Maven Failsafe Plugin ............................. SUCCESS [19.426s]
[INFO] Maven Surefire Report Plugin ...................... SUCCESS [46.996s]
[INFO] Maven Surefire Integration Test Setup ............. SUCCESS [1:20.669s]
[INFO] Maven Surefire Integration Tests .................. FAILURE [18:52.115s]
[INFO] ------------------------------------------------------------------------
[INFO] BUILD FAILURE
[INFO] ------------------------------------------------------------------------
[INFO] Total time: 26:47.132s
[INFO] Finished at: Thu Mar 24 09:29:18 PDT 2011
[INFO] Final Memory: 17M/31M
[INFO] ------------------------------------------------------------------------
[ERROR] Failed to execute goal org.apache.maven.plugins:maven-failsafe-plugin:2.8:verify (default)
on project surefire-integration-tests: There are test failures.
[ERROR] 
[ERROR] Please refer to X:\slave\workspace\surefire\jdk\java-5x\label\windows\trunk\surefire-integration-tests\target\failsafe-reports
for the individual test results.
[ERROR] -> [Help 1]
org.apache.maven.lifecycle.LifecycleExecutionException: Failed to execute goal org.apache.maven.plugins:maven-failsafe-plugin:2.8:verify
(default) on project surefire-integration-tests: There are test failures.

Please refer to X:\slave\workspace\surefire\jdk\java-5x\label\windows\trunk\surefire-integration-tests\target\failsafe-reports
for the individual test results.
	at org.apache.maven.lifecycle.internal.MojoExecutor.execute(MojoExecutor.java:213)
	at org.apache.maven.lifecycle.internal.MojoExecutor.execute(MojoExecutor.java:153)
	at org.apache.maven.lifecycle.internal.MojoExecutor.execute(MojoExecutor.java:145)
	at org.apache.maven.lifecycle.internal.LifecycleModuleBuilder.buildProject(LifecycleModuleBuilder.java:84)
	at org.apache.maven.lifecycle.internal.LifecycleModuleBuilder.buildProject(LifecycleModuleBuilder.java:59)
	at org.apache.maven.lifecycle.internal.LifecycleStarter.singleThreadedBuild(LifecycleStarter.java:183)
	at org.apache.maven.lifecycle.internal.LifecycleStarter.execute(LifecycleStarter.java:161)
	at org.apache.maven.DefaultMaven.doExecute(DefaultMaven.java:319)
	at org.apache.maven.DefaultMaven.execute(DefaultMaven.java:156)
	at org.apache.maven.cli.MavenCli.execute(MavenCli.java:537)
	at org.apache.maven.cli.MavenCli.doMain(MavenCli.java:196)
	at org.apache.maven.cli.MavenCli.main(MavenCli.java:141)
	at sun.reflect.NativeMethodAccessorImpl.invoke0(Native Method)
	at sun.reflect.NativeMethodAccessorImpl.invoke(NativeMethodAccessorImpl.java:39)
	at sun.reflect.DelegatingMethodAccessorImpl.invoke(DelegatingMethodAccessorImpl.java:25)
	at java.lang.reflect.Method.invoke(Method.java:592)
	at org.codehaus.plexus.classworlds.launcher.Launcher.launchEnhanced(Launcher.java:290)
	at org.codehaus.plexus.classworlds.launcher.Launcher.launch(Launcher.java:230)
	at org.codehaus.plexus.classworlds.launcher.Launcher.mainWithExitCode(Launcher.java:409)
	at org.codehaus.plexus.classworlds.launcher.Launcher.main(Launcher.java:352)
Caused by: org.apache.maven.plugin.MojoFailureException: There are test failures.

Please refer to X:\slave\workspace\surefire\jdk\java-5x\label\windows\trunk\surefire-integration-tests\target\failsafe-reports
for the individual test results.
	at org.apache.maven.plugin.surefire.SurefireHelper.reportExecution(SurefireHelper.java:74)
	at org.apache.maven.plugin.failsafe.VerifyMojo.execute(VerifyMojo.java:205)
	at org.apache.maven.plugin.DefaultBuildPluginManager.executeMojo(DefaultBuildPluginManager.java:101)
	at org.apache.maven.lifecycle.internal.MojoExecutor.execute(MojoExecutor.java:209)
	... 19 more
[ERROR] 
[ERROR] Re-run Maven using the -X switch to enable full debug logging.
[ERROR] 
[ERROR] For more information about the errors and possible solutions, please read the following
articles:
[ERROR] [Help 1] http://cwiki.apache.org/confluence/display/MAVEN/MojoFailureException
[ERROR] 
[ERROR] After correcting the problems, you can resume the build with the command
[ERROR]   mvn <goals> -rf :surefire-integration-tests


Mime
View raw message